{"text_format":"1","workbook":"xlsx","n_sheets":9,"sheets":["Contents","Technical Guide","Copy tables and charts","Interactive","Controls Sheet","EASR Charts Controls","ASR lookup","EASR lookup","Interpretation"],"not_rendered":{"charts":6,"images":12,"macros":1,"external_links":0,"defined_names":20,"comments":0,"pivot_tables":0},"unopened":[],"bounds":{"document_bytes":16777216,"sheet_cells":100000,"rows_first":2000,"rows_last":500,"rows_between":2000,"halvings":0,"cell_chars":16384,"cell_head_chars":4096},"cells_cut":0,"cells_raw":0,"read":"whole","date_system":"1900"}

{"sheet":"Contents","index":0,"n_rows":0,"n_cols":0,"rows_kept":0,"cut":false,"hidden":false,"merged":[]}

{"sheet":"Technical Guide","index":1,"n_rows":47,"n_cols":3,"rows_kept":47,"cut":false,"hidden":false,"merged":[[13,1,14,1]]}
[]
[]
[]
[]
[]
[]
[]
[]
[]
[]
{"$rows_left_out":38}
{"sheet":"Copy tables and charts","index":2,"n_rows":35,"n_cols":13,"rows_kept":35,"cut":false,"hidden":false,"merged":[]}
[]
[null,null,null,null,null,null,null,null,null,null,null,null,"Figure 1"]
[]
[]
[]
[]
["Copying and pasting charts and tables to use in documents, reports or presentations"]
[]
["Why use this method to copy and paste charts "]
["If the standard {Copy} and {Paste} option is used for inserting Excel charts into documents, reports"]
{"$rows_left_out":26}
{"sheet":"Interactive","index":3,"n_rows":41,"n_cols":13,"rows_kept":41,"cut":false,"hidden":false,"merged":[[12,12,15,13],[40,12,44,13]]}
[]
[]
[]
[]
[]
[]
[]
[]
[]
[]
{"$rows_left_out":32}
{"sheet":"Controls Sheet","index":4,"n_rows":93,"n_cols":41,"rows_kept":93,"cut":false,"hidden":false,"merged":[]}
[null,"LA index",null,"Group","Names","Lookup","Number of LA's","Top 5 males EASR","Top 5 females EASR"]
["Current selection (list number)",1,null,1.1000000000000001,"Regional Centres local authorities",1,24,603.9,434.5]
["Current selection",null,null,5.7,"Prospering Smaller Towns local authorities",2,108,458.3,340.9]
[null,null,null,6.1,"Coastal and Countryside local authorities",3,54,501.9,360.3]
[null,null,null,7.11,"Industrial Hinterlands local authorities",4,42,664.3,475.1]
["Current selection variables",null,null,7.12,"Manufacturing Towns local authorities",5,41,583.5,422.4]
["Local Authority","Group"]
["Isle of Anglesey",6.1,{"$f":"INDEX(A8:A29,B2)","v":"Isle of Anglesey"},{"$f":"INDEX(B8:B29,B2)","v":6.1},{"$f":"VLOOKUP($D$8,$D$2:$F$6,2,FALSE)","v":"Coastal and Countryside local authorities"},{"$f":"VLOOKUP($D$8,$D$2:$G$6,3,FALSE)","v":3},{"$f":"VLOOKUP($D$8,$D$2:$I$6,5,FALSE)","v":502},{"$f":"VLOOKUP($D$8,$D$2:$I$6,6,FALSE)","v":360}]
["Gwynedd",6.1]
["Conwy",6.1,null,null,"Wales"]
{"$rows_left_out":84}
{"sheet":"EASR Charts Controls","index":5,"n_rows":111,"n_cols":30,"rows_kept":111,"cut":false,"hidden":true,"merged":[]}
["LAs ordered from Best in class to worst",null,null,null,null,null,null,null,null,null,null,null,null,null,{"$f":"CONCATENATE('Controls Sheet'!A36,\" (\",ROUND(VLOOKUP('Controls Sheet'!A36,'EASR lookup'!C5:I273,6,FALSE),0),\")\")","v":"Isle of Anglesey (637)"},null,null,null,null,null,null,{"$f":"CONCATENATE('Controls Sheet'!A36,\" (\",ROUND(VLOOKUP('Controls Sheet'!A36,'EASR lookup'!C5:I273,7,FALSE),0),\")\")","v":"Isle of Anglesey (431)"}]
["Males",null,null,null,null,null,"Females",null,null,null,null,null,null,null,"Males",null,null,null,null,null,null,"Females"]
[1.1000000000000001,5.7,6.1,7.11,7.12,null,1.1000000000000001,5.7,6.1,7.11,7.12,null,null,null,"LA","EASR","ldiff","udiff","Selected LA EASR",{"$f":"\"Best 5 in peer group combined (\"&'Controls Sheet'!G8&\")\"","v":"Best 5 in peer group combined (502)"},"Wales (666)","LA","EASR","ldiff","udiff","Selected LA EASR",{"$f":"\"Best 5 in peer group combined (\"&'Controls Sheet'!H8&\")\"","v":"Best 5 in peer group combined (360)"},"Wales (485)","Number of rows",{"$f":"VLOOKUP('Controls Sheet'!D8,'Controls Sheet'!$D$2:$G$6,4,FALSE)","v":54}]
["Southend-on-Sea","East Cambridgeshire","Christchurch","Redcar and Cleveland","Banbridge",null,"Exeter","Cotswold","Purbeck","North Tyneside","Larne",null,null,null,{"$f":"IF(INDEX($A$4:$E$111,,'Controls Sheet'!$F$8)=0,\"\",INDEX($A$4:$E$111,,'Controls Sheet'!$F$8))","v":"Christchurch"},{"$f":"IF(ISERROR(VLOOKUP($O4,'EASR lookup'!$C$5:$I$273,6,FALSE)),\"\",VLOOKUP($O4,'EASR lookup'!$C$5:$I$273,6,FALSE))","v":438.1},{"$f":"IF(O4='Controls Sheet'!$C$8,VLOOKUP(O4,'EASR lookup'!$C$5:$M$273,8,FALSE),\"\")","v":""},{"$f":"IF(O4='Controls Sheet'!$C$8,VLOOKUP(O4,'EASR lookup'!$C$5:$M$273,9,FALSE),\"\")","v":""},{"$f":"IF(O4='Controls Sheet'!$C$8,'EASR Charts Controls'!P4,\"\")","v":""},{"$f":"IF(P4=\"\",\"\",VLOOKUP('Controls Sheet'!$D$8,'Controls Sheet'!$D$2:$I$6,5,FALSE))","v":501.9},{"$f":"IF(P4=\"\",\"\",666.4)","v":666.4},{"$f":"IF(INDEX($G$4:$K$111,,'Controls Sheet'!$F$8)=0,\"\",INDEX($G$4:$K$111,,'Controls Sheet'!$F$8))","v":"Purbeck"},{"$f":"IF(ISERROR(VLOOKUP($V4,'EASR lookup'!$C$5:$I$273,7,FALSE)),\"\",VLOOKUP($V4,'EASR lookup'!$C$5:$I$273,7,FALSE))","v":304.2},{"$f":"IF(V4='Controls Sheet'!$C$8,VLOOKUP(V4,'EASR lookup'!$C$5:$M$273,10,FALSE),\"\")","v":""},{"$f":"IF(V4='Controls Sheet'!$C$8,VLOOKUP(V4,'EASR lookup'!$C$5:$M$273,11,FALSE),\"\")","v":""},{"$f":"IF(V4='Controls Sheet'!$C$8,'EASR Charts Controls'!W4,\"\")","v":""},{"$f":"IF(W4=\"\",\"\",VLOOKUP('Controls Sheet'!$D$8,'Controls Sheet'!$D$2:$I$6,6,FALSE))","v":360.3},{"$f":"IF(W4=\"\",\"\",484.5)","v":484.5}]
["Eastbourne","South Northamptonshire","Purbeck","Darlington","Carrickfergus",null,"Norwich","East Dorset","Christchurch","Darlington","Erewash",null,null,null,{"$f":"IF(INDEX($A$4:$E$111,,'Controls Sheet'!$F$8)=0,\"\",INDEX($A$4:$E$111,,'Controls Sheet'!$F$8))","v":"Purbeck"},{"$f":"IF(ISERROR(VLOOKUP($O5,'EASR lookup'!$C$5:$I$273,6,FALSE)),\"\",VLOOKUP($O5,'EASR lookup'!$C$5:$I$273,6,FALSE))","v":494.2},{"$f":"IF(O5='Controls Sheet'!$C$8,VLOOKUP(O5,'EASR lookup'!$C$5:$M$273,8,FALSE),\"\")","v":""},{"$f":"IF(O5='Controls Sheet'!$C$8,VLOOKUP(O5,'EASR lookup'!$C$5:$M$273,9,FALSE),\"\")","v":""},{"$f":"IF(O5='Controls Sheet'!$C$8,'EASR Charts Controls'!P5,\"\")","v":""},{"$f":"IF(P5=\"\",\"\",VLOOKUP('Controls Sheet'!$D$8,'Controls Sheet'!$D$2:$I$6,5,FALSE))","v":501.9},{"$f":"IF(P5=\"\",\"\",666.4)","v":666.4},{"$f":"IF(INDEX($G$4:$K$111,,'Controls Sheet'!$F$8)=0,\"\",INDEX($G$4:$K$111,,'Controls Sheet'!$F$8))","v":"Christchurch"},{"$f":"IF(ISERROR(VLOOKUP($V5,'EASR lookup'!$C$5:$I$273,7,FALSE)),\"\",VLOOKUP($V5,'EASR lookup'!$C$5:$I$273,7,FALSE))","v":330.7},{"$f":"IF(V5='Controls Sheet'!$C$8,VLOOKUP(V5,'EASR lookup'!$C$5:$M$273,10,FALSE),\"\")","v":""},{"$f":"IF(V5='Controls Sheet'!$C$8,VLOOKUP(V5,'EASR lookup'!$C$5:$M$273,11,FALSE),\"\")","v":""},{"$f":"IF(V5='Controls Sheet'!$C$8,'EASR Charts Controls'!W5,\"\")","v":""},{"$f":"IF(W5=\"\",\"\",VLOOKUP('Controls Sheet'!$D$8,'Controls Sheet'!$D$2:$I$6,6,FALSE))","v":360.3},{"$f":"IF(W5=\"\",\"\",484.5)","v":484.5}]
["Exeter","Babergh","South Lakeland","East Lothian","North East Derbyshire",null,"Worthing","East Cambridgeshire","Chichester","Barrow-in-Furness","Havant",null,null,null,{"$f":"IF(INDEX($A$4:$E$111,,'Controls Sheet'!$F$8)=0,\"\",INDEX($A$4:$E$111,,'Controls Sheet'!$F$8))","v":"South Lakeland"},{"$f":"IF(ISERROR(VLOOKUP($O6,'EASR lookup'!$C$5:$I$273,6,FALSE)),\"\",VLOOKUP($O6,'EASR lookup'!$C$5:$I$273,6,FALSE))","v":513.70000000000005},{"$f":"IF(O6='Controls Sheet'!$C$8,VLOOKUP(O6,'EASR lookup'!$C$5:$M$273,8,FALSE),\"\")","v":""},{"$f":"IF(O6='Controls Sheet'!$C$8,VLOOKUP(O6,'EASR lookup'!$C$5:$M$273,9,FALSE),\"\")","v":""},{"$f":"IF(O6='Controls Sheet'!$C$8,'EASR Charts Controls'!P6,\"\")","v":""},{"$f":"IF(P6=\"\",\"\",VLOOKUP('Controls Sheet'!$D$8,'Controls Sheet'!$D$2:$I$6,5,FALSE))","v":501.9},666.4,{"$f":"IF(INDEX($G$4:$K$111,,'Controls Sheet'!$F$8)=0,\"\",INDEX($G$4:$K$111,,'Controls Sheet'!$F$8))","v":"Chichester"},{"$f":"IF(ISERROR(VLOOKUP($V6,'EASR lookup'!$C$5:$I$273,7,FALSE)),\"\",VLOOKUP($V6,'EASR lookup'!$C$5:$I$273,7,FALSE))","v":377.6},{"$f":"IF(V6='Controls Sheet'!$C$8,VLOOKUP(V6,'EASR lookup'!$C$5:$M$273,10,FALSE),\"\")","v":""},{"$f":"IF(V6='Controls Sheet'!$C$8,VLOOKUP(V6,'EASR lookup'!$C$5:$M$273,11,FALSE),\"\")","v":""},{"$f":"IF(V6='Controls Sheet'!$C$8,'EASR Charts Controls'!W6,\"\")","v":""},{"$f":"IF(W6=\"\",\"\",VLOOKUP('Controls Sheet'!$D$8,'Controls Sheet'!$D$2:$I$6,6,FALSE))","v":360.3},484.5]
["Norwich","Mid Suffolk","Craven","Wirral","Swale",null,"Bristol","Rutland","West Devon","Copeland","Amber Valley",null,null,null,{"$f":"IF(INDEX($A$4:$E$111,,'Controls Sheet'!$F$8)=0,\"\",INDEX($A$4:$E$111,,'Controls Sheet'!$F$8))","v":"Craven"},{"$f":"IF(ISERROR(VLOOKUP($O7,'EASR lookup'!$C$5:$I$273,6,FALSE)),\"\",VLOOKUP($O7,'EASR lookup'!$C$5:$I$273,6,FALSE))","v":514.79999999999995},{"$f":"IF(O7='Controls Sheet'!$C$8,VLOOKUP(O7,'EASR lookup'!$C$5:$M$273,8,FALSE),\"\")","v":""},{"$f":"IF(O7='Controls Sheet'!$C$8,VLOOKUP(O7,'EASR lookup'!$C$5:$M$273,9,FALSE),\"\")","v":""},{"$f":"IF(O7='Controls Sheet'!$C$8,'EASR Charts Controls'!P7,\"\")","v":""},{"$f":"IF(P7=\"\",\"\",VLOOKUP('Controls Sheet'!$D$8,'Controls Sheet'!$D$2:$I$6,5,FALSE))","v":501.9},666.4,{"$f":"IF(INDEX($G$4:$K$111,,'Controls Sheet'!$F$8)=0,\"\",INDEX($G$4:$K$111,,'Controls Sheet'!$F$8))","v":"West Devon"},{"$f":"IF(ISERROR(VLOOKUP($V7,'EASR lookup'!$C$5:$I$273,7,FALSE)),\"\",VLOOKUP($V7,'EASR lookup'!$C$5:$I$273,7,FALSE))","v":377.8},{"$f":"IF(V7='Controls Sheet'!$C$8,VLOOKUP(V7,'EASR lookup'!$C$5:$M$273,10,FALSE),\"\")","v":""},{"$f":"IF(V7='Controls Sheet'!$C$8,VLOOKUP(V7,'EASR lookup'!$C$5:$M$273,11,FALSE),\"\")","v":""},{"$f":"IF(V7='Controls Sheet'!$C$8,'EASR Charts Controls'!W7,\"\")","v":""},{"$f":"IF(W7=\"\",\"\",VLOOKUP('Controls Sheet'!$D$8,'Controls Sheet'!$D$2:$I$6,6,FALSE))","v":360.3},484.5]
["Bournemouth","East Dorset","Chichester","North Tyneside","Havant",null,"Southend-on-Sea","North Dorset","South Hams","Sefton","Dudley",null,null,null,{"$f":"IF(INDEX($A$4:$E$111,,'Controls Sheet'!$F$8)=0,\"\",INDEX($A$4:$E$111,,'Controls Sheet'!$F$8))","v":"Chichester"},{"$f":"IF(ISERROR(VLOOKUP($O8,'EASR lookup'!$C$5:$I$273,6,FALSE)),\"\",VLOOKUP($O8,'EASR lookup'!$C$5:$I$273,6,FALSE))","v":521.4},{"$f":"IF(O8='Controls Sheet'!$C$8,VLOOKUP(O8,'EASR lookup'!$C$5:$M$273,8,FALSE),\"\")","v":""},{"$f":"IF(O8='Controls Sheet'!$C$8,VLOOKUP(O8,'EASR lookup'!$C$5:$M$273,9,FALSE),\"\")","v":""},{"$f":"IF(O8='Controls Sheet'!$C$8,'EASR Charts Controls'!P8,\"\")","v":""},{"$f":"IF(P8=\"\",\"\",VLOOKUP('Controls Sheet'!$D$8,'Controls Sheet'!$D$2:$I$6,5,FALSE))","v":501.9},666.4,{"$f":"IF(INDEX($G$4:$K$111,,'Controls Sheet'!$F$8)=0,\"\",INDEX($G$4:$K$111,,'Controls Sheet'!$F$8))","v":"South Hams"},{"$f":"IF(ISERROR(VLOOKUP($V8,'EASR lookup'!$C$5:$I$273,7,FALSE)),\"\",VLOOKUP($V8,'EASR lookup'!$C$5:$I$273,7,FALSE))","v":379.5},{"$f":"IF(V8='Controls Sheet'!$C$8,VLOOKUP(V8,'EASR lookup'!$C$5:$M$273,10,FALSE),\"\")","v":""},{"$f":"IF(V8='Controls Sheet'!$C$8,VLOOKUP(V8,'EASR lookup'!$C$5:$M$273,11,FALSE),\"\")","v":""},{"$f":"IF(V8='Controls Sheet'!$C$8,'EASR Charts Controls'!W8,\"\")","v":""},{"$f":"IF(W8=\"\",\"\",VLOOKUP('Controls Sheet'!$D$8,'Controls Sheet'!$D$2:$I$6,6,FALSE))","v":360.3},484.5]
["Sheffield","Mid Devon","South Hams","Merthyr Tydfil","Tamworth",null,"Eastbourne","South Norfolk","West Dorset","Swansea","East Staffordshire",null,null,null,{"$f":"IF(INDEX($A$4:$E$111,,'Controls Sheet'!$F$8)=0,\"\",INDEX($A$4:$E$111,,'Controls Sheet'!$F$8))","v":"South Hams"},{"$f":"IF(ISERROR(VLOOKUP($O9,'EASR lookup'!$C$5:$I$273,6,FALSE)),\"\",VLOOKUP($O9,'EASR lookup'!$C$5:$I$273,6,FALSE))","v":538.6},{"$f":"IF(O9='Controls Sheet'!$C$8,VLOOKUP(O9,'EASR lookup'!$C$5:$M$273,8,FALSE),\"\")","v":""},{"$f":"IF(O9='Controls Sheet'!$C$8,VLOOKUP(O9,'EASR lookup'!$C$5:$M$273,9,FALSE),\"\")","v":""},{"$f":"IF(O9='Controls Sheet'!$C$8,'EASR Charts Controls'!P9,\"\")","v":""},{"$f":"IF(P9=\"\",\"\",VLOOKUP('Controls Sheet'!$D$8,'Controls Sheet'!$D$2:$I$6,5,FALSE))","v":501.9},666.4,{"$f":"IF(INDEX($G$4:$K$111,,'Controls Sheet'!$F$8)=0,\"\",INDEX($G$4:$K$111,,'Controls Sheet'!$F$8))","v":"West Dorset"},{"$f":"IF(ISERROR(VLOOKUP($V9,'EASR lookup'!$C$5:$I$273,7,FALSE)),\"\",VLOOKUP($V9,'EASR lookup'!$C$5:$I$273,7,FALSE))","v":381.5},{"$f":"IF(V9='Controls Sheet'!$C$8,VLOOKUP(V9,'EASR lookup'!$C$5:$M$273,10,FALSE),\"\")","v":""},{"$f":"IF(V9='Controls Sheet'!$C$8,VLOOKUP(V9,'EASR lookup'!$C$5:$M$273,11,FALSE),\"\")","v":""},{"$f":"IF(V9='Controls Sheet'!$C$8,'EASR Charts Controls'!W9,\"\")","v":""},{"$f":"IF(W9=\"\",\"\",VLOOKUP('Controls Sheet'!$D$8,'Controls Sheet'!$D$2:$I$6,6,FALSE))","v":360.3},484.5]
["Portsmouth","New Forest","West Dorset","South Ayrshire","Amber Valley",null,"Brighton and Hove","Hambleton","North Norfolk","Redcar and Cleveland","Banbridge",null,null,null,{"$f":"IF(INDEX($A$4:$E$111,,'Controls Sheet'!$F$8)=0,\"\",INDEX($A$4:$E$111,,'Controls Sheet'!$F$8))","v":"West Dorset"},{"$f":"IF(ISERROR(VLOOKUP($O10,'EASR lookup'!$C$5:$I$273,6,FALSE)),\"\",VLOOKUP($O10,'EASR lookup'!$C$5:$I$273,6,FALSE))","v":540.70000000000005},{"$f":"IF(O10='Controls Sheet'!$C$8,VLOOKUP(O10,'EASR lookup'!$C$5:$M$273,8,FALSE),\"\")","v":""},{"$f":"IF(O10='Controls Sheet'!$C$8,VLOOKUP(O10,'EASR lookup'!$C$5:$M$273,9,FALSE),\"\")","v":""},{"$f":"IF(O10='Controls Sheet'!$C$8,'EASR Charts Controls'!P10,\"\")","v":""},{"$f":"IF(P10=\"\",\"\",VLOOKUP('Controls Sheet'!$D$8,'Controls Sheet'!$D$2:$I$6,5,FALSE))","v":501.9},666.4,{"$f":"IF(INDEX($G$4:$K$111,,'Controls Sheet'!$F$8)=0,\"\",INDEX($G$4:$K$111,,'Controls Sheet'!$F$8))","v":"North Norfolk"},{"$f":"IF(ISERROR(VLOOKUP($V10,'EASR lookup'!$C$5:$I$273,7,FALSE)),\"\",VLOOKUP($V10,'EASR lookup'!$C$5:$I$273,7,FALSE))","v":383.7},{"$f":"IF(V10='Controls Sheet'!$C$8,VLOOKUP(V10,'EASR lookup'!$C$5:$M$273,10,FALSE),\"\")","v":""},{"$f":"IF(V10='Controls Sheet'!$C$8,VLOOKUP(V10,'EASR lookup'!$C$5:$M$273,11,FALSE),\"\")","v":""},{"$f":"IF(V10='Controls Sheet'!$C$8,'EASR Charts Controls'!W10,\"\")","v":""},{"$f":"IF(W10=\"\",\"\",VLOOKUP('Controls Sheet'!$D$8,'Controls Sheet'!$D$2:$I$6,6,FALSE))","v":360.3},484.5]
{"$rows_left_out":102}
{"sheet":"ASR lookup","index":6,"n_rows":70,"n_cols":100,"rows_kept":70,"cut":false,"hidden":true,"merged":[]}
["Age-specific rates lookup",null,null,null,null,null,null,null,null,null,null,null,null,null,null,null,null,null,null,null,null,null,null,null,null,null,null,null,"Excess deaths - based on Top 5",null,null,null,null,null,null,null,null,null,null,null,null,null,null,null,null,null,null,null,"Lower confidence intervals",null,null,null,null,null,null,null,null,null,null,null,null,null,null,null,"Upper confidence intervals",null,null,null,null,null,null,null,null,null,null,null,null,null,null,null,"Excess deaths - based on Wales"]
[null,null,null,null,null,null,null,null,7,8,9,10,11,12,13,14,15,16,17,18,19,20,21,22,23,24,25,26,27,28,29,30,31,32,33,34,35,36,37,38,39,40,41,42,43,44,45,46,47,48,49,50,51,52,53,54,55,56,57,58,59,60,61,62,63,64,65,66,67,68,69,70,71,72,73,74,75,76,77,78,79,80,81,82,83,84,85,86,87,88,89,90,91,92,93,94,95,96,97,98]
["Males",null,null,null,null,null,null,"Age­standardised mortality rate","Age-specific rates"]
["Code","LAD","LAD2","Subgroups ","Subgroups2","Groups ","Supergroups","Males","00-01","01-04","05-09","10-14","15-19","20-24","25-29","30-34","35-39","40-44","45-49","50-54","55-59","60-64","65-69","70-74","75-79","80-84","85+","total","00-01","01-04","05-09","10-14","15-19","20-24","25-29","30-34","35-39","40-44","45-49","50-54","55-59","60-64","65-69","70-74","75-79","80-84","85+","total","00-01","01-04","05-09","10-14","15-19","20-24","25-29","30-34","35-39","40-44","45-49","50-54","55-59","60-64","65-69","70-74","00-01","01-04","05-09","10-14","15-19","20-24","25-29","30-34","35-39","40-44","45-49","50-54","55-59","60-64","65-69","70-74","00-01","01-04","05-09","10-14","15-19","20-24","25-29","30-34","35-39","40-44","45-49","50-54","55-59","60-64","65-69","70-74","75-79","80-84","85+","total"]
["00PT","Cardiff","Cardiff","1.1.1","1.1.1","1.1",1,690.4,5.3,0.2,0.1,0,0.3,0.3,0.6,0.8,1.2,1.4,2.4,3.9,6.2,10.199999999999999,16.2,29.2,50.5,82.7,179.8,7.9,2.15,1.44,0.52,-1.02,0.8,-1.71,-0.13,-2.04,2.96,-1.03,-2.9,-0.4,-10.27,4.07,9.75,37.369999999999997,44.47,29.29,63.52,176.84,2.8,0,0,0,0.1,0.1,0.3,0.4,0.7,0.8,1.6,2.7,4.7,8.1,13.2,24.5,9,0.8,0.6,0.4,0.7,0.6,1.1000000000000001,1.5,2.1,2.2999999999999998,3.5,5.3,8.1,12.6,19.600000000000001,34.5,1.2,0.12,0.44,-0.84,-0.76,-9.27,-2.81,-4.47,-4.32,-6.57,-4.21,0.44,-1.75,1.36,5.93,9.0399999999999991,26.37,11.34,30.2,0]
["00PD","Vale of Glamorgan","Vale of Glamorgan","5.7.12","5.7.12","5.7",5,602.20000000000005,4.2,0.3,0,0,0.2,0,0,1.4,1.3,2.6,3.1,3,5.8,6.7,13,27.6,29.5,88.3,161.69999999999999,9.1999999999999993,1.06,0.69,-0.57999999999999996,-0.31,-0.27,-1.38,0,4.3499999999999996,2.6,7,10.06,2.95,8.25,1.1100000000000001,5.38,27.52,-4.55,38.97,25.37,128,0.9,0,0,0,0,0,0,0.4,0.4,1.3,1.7,1.6,3.7,4.4000000000000004,9.6,21.6,12.2,1.8,1,0.9,1.4,1,1,3.2,3.1,4.7,5.2,5,8.6999999999999993,9.8000000000000007,17.3,34.700000000000003,-0.45,0.38,-0.21,-0.35,-0.26,-2.63,-2.85,0.69,-1.0900000000000001,2.73,1.5,-3.83,-2.44,-12.95,-8.2100000000000009,0.81,-28.37,13.18,-5.08,0]
["00PP","Monmouth","Monmouthshire","5.7.13","5.7.13","5.7",5,594.79999999999995,4.9000000000000004,0,0,0,0,0,1.5,1,2.2999999999999998,1.6,2.7,3.2,5.6,8.5,16.399999999999999,22.3,36.4,60.2,159.80000000000001,10.3,0.89,-0.19,-0.4,-0.22,-0.98,-0.9,3,1.65,3.58,2,6.7,3.24,5.71,6.89,15.24,10.92,8.34,0.43,20.46,86,0.6,0,0,0,0,0,0.3,0.1,0.7,0.5,1.3,1.6,3.2,5.6,12.2,16.399999999999999,17.600000000000001,2,1.5,1.4,1.2,1.6,4.5,3.7,5.3,3.7,4.9000000000000004,5.8,8.9,12.3,21.6,29.5,0.03,-0.38,-0.15,-0.25,-0.97,-1.71,1.48,-0.33,1.4,-1.21,-0.47,-1.99,-2.4700000000000002,-5.03,3.57,-10.86,-12.9,-22.4,-6.09,0]
["00NN","Powys","Powys","6.10.17","6.10.17","6.10",6,559,3.3,0.4,0.3,0.5,0.2,0.3,0.6,0.7,1,1.7,1.8,3.9,5.2,6.8,9.4,24.5,37.299999999999997,67.099999999999994,156.1,10.7,-3.31,1,0.63,2,0.63,0.62,-0.78,-0.18,-0.17,2.27,2.91,6.06,5.38,-12.71,-16.37,29.56,16.899999999999999,9.34,27.11,71,0.4,0,0,0.1,0,0,0.1,0.1,0.2,0.7,0.8,2.2999999999999998,3.4,4.8,6.9,19.600000000000001,11.9,2,1.7,1.8,1.3,1.6,2.2999999999999998,2.5,2.8,3.4,3.4,6.2,7.8,9.5,12.5,30.1,-0.9,0.45,0.8,1.64,-0.28000000000000003,-1.53,-0.43,-1.44,-2.0499999999999998,-1.3,-4.92,0.55000000000000004,-5.27,-16.38,-29.31,-10.18,-17.78,-22.14,-15.04,0]
["00NQ","Ceredigion","Ceredigion","6.10.17","6.10.17","6.10",6,547.70000000000005,6.1,0,0,0,0.6,0.8,0.6,0.6,1.2,1,3.1,3.9,7.6,7.2,8.6,21.7,34.700000000000003,67.2,139.30000000000001,9.1999999999999993,-0.88,0,-0.2,0,1.7,3.45,-0.56000000000000005,-0.21,0.26,-0.34,4.2,2.94,8.41,-5.69,-10.41,9.99,4.88,4.8899999999999997,1.45,24,0.7,0,0,0,0.1,0.2,0,0,0.1,0.1,1.2,1.8,4.5,4.3,5.4,15.5,22,2.7,2,2,2.2000000000000002,2,3.2,3.5,4.2,3.5,6.3,7.4,12,11.2,13,29.5,0.42,-0.28000000000000003,-0.1,-0.17,0.99,0.39,-0.36,-0.92,-0.77,-2.11,0.59,0.13,2.93,-7.59,-17.02,-10.43,-12.88,-11.05,-20.6,0]
["00NA","Isle of Anglesey","Isle of Anglesey","6.10.18","6.10.18","6.10",6,636.6,4.9000000000000004,0,0,0,1,2.6,1.1000000000000001,2.7,1.7,1.3,1.7,2.5,5.9,11.1,14,19.100000000000001,36.4,73.3,176.9,11,-1.56,0,-0.2,0,1.82,4.79,0.34,3.59,1.1499999999999999,0.5,1.1200000000000001,-0.22,4.4000000000000004,4.4800000000000004,3.22,5.43,6.98,9.73,26.4,72,0.6,0,0,0,0.1,0.8,0.1,0.9,0.3,0.3,0.5,0.9,3.2,7.4,9.6999999999999993,13.4,17.8,2.2000000000000002,2,2,3.6,6,3.9,6.2,4.8,3.9,4.3,5.5,9.9,16,19.399999999999999,26.5,0.05,-0.34,-0.11,-0.17,1.39,3.59,0.56000000000000005,2.77,0.05,-1.39,-2.59,-3.09,-1.0900000000000001,2.67,-3.26,-15.35,-9.9499999999999993,-4.66,6.89,0]
{"$rows_left_out":61}
{"sheet":"EASR lookup","index":7,"n_rows":273,"n_cols":17,"rows_kept":273,"cut":false,"hidden":true,"merged":[[2,7,2,8],[2,13,2,14]]}
["Highlighted yellow are the BIC for males and females - no longer needed"]
[]
[null,null,null,null,null,null,null,"Age­standardised mortality rate",null,null,null,null,null,"Calc sheet ",null,"ONS EASR - EASR Calculator"]
["Code","LAD","LAD2","Subgroups ","Subgroups2","Groups ","Supergroups","Males","Females","Males ldiff","Males udiff","Females ldiff","Females udiff","Males EASR","Females EASR","Males","Females"]
["00KF","Southend-on-Sea","Southend-on-Sea","1.1.1","1.1.1","1.1",1,554.5,442.9,"","","","","",""]
["21UC","Eastbourne","Eastbourne","1.1.1","1.1.1","1.1",1,610.1,443.9,"","","","","",""]
["18UC","Exeter","Exeter","1.1.1","1.1.1","1.1",1,614.1,421.2,"","","","","",""]
["33UG","Norwich","Norwich","1.1.1","1.1.1","1.1",1,614.70000000000005,423.6,"","","","","",""]
["00HN","Bournemouth","Bournemouth","1.1.1","1.1.1","1.1",1,640.79999999999995,464.9,"","","","","",""]
["00CG","Sheffield","Sheffield","1.1.1","1.1.1","1.1",1,641.1,468,"","","","","",""]
{"$rows_left_out":264}
{"sheet":"Interpretation","index":8,"n_rows":133,"n_cols":1,"rows_kept":133,"cut":false,"hidden":false,"merged":[[132,0,132,10],[110,0,110,10],[124,0,124,10],[126,0,126,10],[128,0,128,10],[130,0,130,10],[114,0,114,10],[112,0,112,10],[120,0,120,10],[32,0,32,9],[118,0,118,10],[34,0,34,10],[36,0,36,9],[38,0,38,9],[40,0,40,9],[67,0,67,10],[69,0,69,10],[71,0,71,10],[73,0,73,10],[75,0,75,10],[79,0,79,10],[108,0,108,10]]}
[]
[]
[]
[]
[]
[]
["As an example, here is the age standardised rate chart for Powys males:"]
[]
[]
[]
{"$rows_left_out":123}