{"text_format":"1","workbook":"xlsx","n_sheets":9,"sheets":["Contents","Technical Guide","Copy tables and charts","Interactive","Controls Sheet","EASR Charts Controls","ASR lookup","EASR lookup","Interpretation"],"not_rendered":{"charts":6,"images":12,"macros":1,"external_links":0,"defined_names":20,"comments":0,"pivot_tables":0},"unopened":[],"bounds":{"document_bytes":16777216,"sheet_cells":100000,"rows_first":2000,"rows_last":500,"rows_between":2000,"halvings":0,"cell_chars":16384,"cell_head_chars":4096},"cells_cut":0,"cells_raw":0,"read":"whole","date_system":"1900"}

{"sheet":"Contents","index":0,"n_rows":0,"n_cols":0,"rows_kept":0,"cut":false,"hidden":false,"merged":[]}

{"sheet":"Technical Guide","index":1,"n_rows":47,"n_cols":3,"rows_kept":47,"cut":false,"hidden":false,"merged":[[13,1,14,1]]}
[]
[]
[]
[]
[]
[]
[]
[]
[]
[]
[]
[null,"TOPIC:","Inverse care law"]
[null,"SUBJECT:","All cause mortality"]
[null,"SOURCE:","Numerator: Annual District Death Extract (ADDE), Office for National Statistics (ONS); NISRA & GROS"]
[null,null,"Denominator: Mid-Year Population Estimates, Office for National Statistics"]
[null,"GEOGRAPHY:","UK local authorities"]
[null,"PERIOD:",2012]
[null,"DEMOGRAPHY:","All persons"]
[null,"STATISTICS:","European age-standardised rate per 100,000 with 95% confidence intervals (intervals calculated using a method proposed by Dobson et al (1991));"]
[null,null,"Crude rates per 100,000 with 95% confidence intervals (intervals calculated using a method proposed by Altman et al (2000));"]
[null,null,"Excess deaths counts"]
[null,"NOTES:","The ONS area classification was used to group like for like areas. The ONS area classification is based on a cluster analysis utilising 42 Census (2001) variables that groups together areas that have similar combinations of characteristics. Full details of the ONS area classification can be found at: "]
[null,null,"http://www.ons.gov.uk/ons/guide-method/geography/products/area-classifications/ns-area-classifications/index/index.html"]
[null,null,"The 'Best 5 in peer group combined' were defined as the 5 local authorities with the lowest all ages all causes European age standardised mortality rate by gender within each area classification in 2012. For each classification 'Best 5 in peer group combined' age-specific rates and EASR were calculated based on the counts of deaths and population of the 5 local authorities identified."]
[null,null,"All persons, all ages, all causes European age standardised mortality rates for administrative geographies were downloaded from ONS at: "]
[null,null,"http://www.ons.gov.uk/ons/rel/vsob1/deaths-registered-area-usual-residence/2012/rft-deaths-area-package-2012.xls"]
[null,null,"The ONS area classification was downloaded from ONS at: "]
[null,null,"http://www.ons.gov.uk/ons/guide-method/geography/products/area-classifications/ns-area-classifications/index/datasets/local-authorities/la-data-file.xls"]
[null,null,"Midyear population estimates were downloaded from ONS at: "]
[null,null,"http://www.ons.gov.uk/ons/rel/pop-estimate/population-estimates-for-uk--england-and-wales--scotland-and-northern-ireland/mid-2001-to-mid-2010-revised/rft---mid-2001-to-mid-2010-uk-population-estimates.zip"]
[null,null,"The Vital Statistics tables held by PHWO were used to extract age specific death registrations for the Welsh and 'Best 5 in peer group combined' local authority areas."]
[null,null,"The age-specific rates chart confidence intervals are highlighted red when the rate for the chosen local authority is significantly higher than the age-specific rate for the 'Best 5 in peer group combined'. When there is no significant difference in the rates the confidence intervals are highlighted grey."]
[null,null,"The age-specific rates calculated for the 'Best 5 in peer group combined' were applied to the Wales local authorities populations to obtain the number of deaths required in each age band to yield the same EASR. "]
[null,null,"The sum of the differences between the observed and target age-specific numbers of deaths represents the total excess deaths."]
[null,null,"This approach has a logical basis, in that it not only ensures the end result, the EASR, is the same in the observed and target populations, but also ensures that the building blocks of the EASR, the age specific rates, are the same in both populations."]
[null,null,"However, it is critical to consider the large quantity of age specific death count permutations that could lead to the same EASR within a single population. The excess deaths calculations here are based on the age-specific rates in the chosen local authority becoming the same as in the 'Best 5 in peer group combined'. That \"best in class\" EASR could also be achieved in a number of ways, including scenarios where deaths actually go up, but the EASR goes down as the deaths are shifted into older age groups. The \"best in class\" EASR could also be obtained by having exactly the same number of deaths as now but by delaying each death by around 15 years. "]
[null,null,"Whilst these scenarios may be extreme and unrealistic, the point they illustrate is valid given that, within the limits of current knowledge, all humans must die eventually. Therefore, the very best that can be achieved in terms of mortality would be to delay deaths at the younger ages until the older ages. In such a scenario, and in the long run, the European age standardised mortality rate would most likely decline whilst the actual number of deaths would most likely increase."]
[null,null,"There are two further considerations that are important to note:"]
[null,null,"·         The observed EASR may not be statistically significantly different to the 'Best 5 in peer group combined' EASR. Whilst this does not preclude the difference being of public health importance, it is important to consider whether attaining an absolute target or getting within a reasonable range is the most appropriate measure."]
[null,null,"·         There may not be an excess in all age bands, yielding in such instances a “negative excess” in those bands."]
[null,null,"A number of assumptions have been made in deriving these 'Top 5 in peer group combined' comparisons and excess deaths estimates, which have not been tested:"]
[null,null,"·         The 'Best 5 in peer group combined' areas had not experienced particularly unusual patterns of mortality for the comparison year."]
[null,null,"·         Wales local authorities had not experienced particularly unusual patterns of mortality for the comparison year."]
[null,null,"·         Area classifications based on Census 2001 will not alter when they are revised to Census 2011."]
[null,null,"These EASRs have been produced using the shortly to be superseded European Standard Population (1976). Repeating this work with the new European Standard Population (2013) would produce somewhat different results, highlighting another limitation in the use of age standardised rates in this manner."]
[null,"REFERENCE:","Dobson A.J. et al (1991) Confidence intervals for weighted sums of Poisson parameters. Stat Med 10(3):457-462."]
[null,null,"Altman D.G. Et al (2000) Statistics with confidence. BMJ books: UK"]

{"sheet":"Copy tables and charts","index":2,"n_rows":35,"n_cols":13,"rows_kept":35,"cut":false,"hidden":false,"merged":[]}
[]
[null,null,null,null,null,null,null,null,null,null,null,null,"Figure 1"]
[]
[]
[]
[]
["Copying and pasting charts and tables to use in documents, reports or presentations"]
[]
["Why use this method to copy and paste charts "]
["If the standard {Copy} and {Paste} option is used for inserting Excel charts into documents, reports"]
["or presentations then frequently the chart will lose some of its formatting and/or the axes labels may be"]
["truncated. Similarly, table column sizes are often distorted using the standard {Copy} and {Paste}"]
["method if a table is too wide. The technique descibed below overcomes these issues."]
[]
["Copying and pasting a chart"]
[1,"Select the chart you want to copy by left clicking on it once i.e. so that the surronding points are "]
[null,"displayed "]
[2,"On the 'Home' tab click the paste icon"]
[3,"Click 'As picture' option and 'Copy as picture' (see figure 1)"]
[4,"Choose 'As shown on screen' and 'picture'"]
[5,"Using your mouse click on the point where you want to insert a copy of the chart e.g. in a Word "]
[null,"document / presentation"]
[6,"On the 'Home' tab click 'paste' then 'paste special' and choose to insert as 'Picture (enhanced metafile)' "]
[]
[null,null,null,null,null,null,null,null,null,null,null,null,"Figure 2"]
[]
["Copying and pasting a table as a picture"]
[1,"Highlight the table you want to copy by left clicking on the top left hand corner "]
[null,"and dragging the mouse to the bottom right corner. "]
[2,"On the 'Home' tab click the paste icon"]
[3,"Click 'As picture' option and 'Copy as picture' (see figure 2)"]
[4,"Choose 'As shown on screen' and 'picture'"]
[5,"Using your mouse click on the point where you want to insert a copy of the chart e.g. in a Word "]
[null,"document / presentation"]
[6,"On the 'Home' tab click 'paste' then 'paste special' and choose to insert as 'Picture (enhanced metafile)' "]

{"sheet":"Interactive","index":3,"n_rows":41,"n_cols":13,"rows_kept":41,"cut":false,"hidden":false,"merged":[[12,12,15,13],[40,12,44,13]]}
[]
[]
[]
[]
[]
[]
[]
[]
[]
[]
[]
[]
[null,null,null,null,null,null,null,null,null,null,null,null,"Age specific comparisons below"]
[]
[]
[]
[]
[]
[]
[]
[]
[]
[]
[]
[]
[]
[]
[]
[]
[]
[]
[]
[]
[]
[]
[]
[]
[]
[]
[]
[null,null,null,null,null,null,null,null,null,null,null,null,"Further age specific comparison below"]

{"sheet":"Controls Sheet","index":4,"n_rows":93,"n_cols":41,"rows_kept":93,"cut":false,"hidden":false,"merged":[]}
[null,"LA index",null,"Group","Names","Lookup","Number of LA's","Top 5 males EASR","Top 5 females EASR"]
["Current selection (list number)",1,null,1.1000000000000001,"Regional Centres local authorities",1,24,603.9,434.5]
["Current selection",null,null,5.7,"Prospering Smaller Towns local authorities",2,108,458.3,340.9]
[null,null,null,6.1,"Coastal and Countryside local authorities",3,54,501.9,360.3]
[null,null,null,7.11,"Industrial Hinterlands local authorities",4,42,664.3,475.1]
["Current selection variables",null,null,7.12,"Manufacturing Towns local authorities",5,41,583.5,422.4]
["Local Authority","Group"]
["Isle of Anglesey",6.1,{"$f":"INDEX(A8:A29,B2)","v":"Isle of Anglesey"},{"$f":"INDEX(B8:B29,B2)","v":6.1},{"$f":"VLOOKUP($D$8,$D$2:$F$6,2,FALSE)","v":"Coastal and Countryside local authorities"},{"$f":"VLOOKUP($D$8,$D$2:$G$6,3,FALSE)","v":3},{"$f":"VLOOKUP($D$8,$D$2:$I$6,5,FALSE)","v":502},{"$f":"VLOOKUP($D$8,$D$2:$I$6,6,FALSE)","v":360}]
["Gwynedd",6.1]
["Conwy",6.1,null,null,"Wales"]
["Denbighshire",6.1]
["Flintshire",7.12]
["Wrexham",7.12]
["Powys",6.1]
["Ceredigion",6.1]
["Pembrokeshire",6.1]
["Carmarthenshire",6.1]
["Swansea",7.11]
["Neath Port Talbot",7.11]
["Bridgend",7.12]
["Vale of Glamorgan",5.7]
["Cardiff",1.1000000000000001]
["Rhondda Cynon Taff",7.11]
["Merthyr Tydfil",7.11]
["Caerphilly",7.11]
["Blaenau Gwent",7.11]
["Torfaen",7.11]
["Monmouthshire",5.7]
["Newport",7.11]
[]
[]
[]
[]
["Age-specific rates"]
["Local Authority","Group",null,null,null,null,null,null,null,null,null,null,null,null,null,null,null,null,null,null,null,null,null,null,null,"error bars +",null,null,null,"error bars -"]
[{"$f":"$C$8","v":"Isle of Anglesey"},{"$f":"$D$8","v":6.1},null,null,null,"Excess deaths",null,null,null,"Best 5 in peer group combined",null,null,null,null,"Confidence intervals",null,null,null,null,"Confidence intervals",null,null,null,null,null,"Confidence intervals",null,null,null,"Confidence intervals",null,null,null,"Excess deaths WALES",null,null,null,"WALES"]
[null,"Males","Females",null,null,"Males","Females",null,null,null,"Males","Females",null,null,"Males","LCI","UCI",null,null,"Females","LCI","UCI",null,null,null,"Males","LCI","UCI",null,"Females","LCI","UCI",null,"Males","Females",null,null,null,"Males","Females"]
["00-01",{"$f":"VLOOKUP($A$36,'ASR lookup'!$C$5:$AB$26,D38,FALSE)","v":4.9000000000000004},{"$f":"VLOOKUP($A$36,'ASR lookup'!$C$40:$AB$61,D38,FALSE)","v":0},7,"00-01",{"$f":"VLOOKUP($A$36,'ASR lookup'!$C$5:$AV$26,'Controls Sheet'!H38,FALSE)","v":-2},{"$f":"VLOOKUP($A$36,'ASR lookup'!$C$40:$AV$61,'Controls Sheet'!H38,FALSE)","v":-1},27,null,"00-01",{"$f":"VLOOKUP($B$36,'ASR lookup'!$F$31:$AB$35,M38,FALSE)","v":8.8000000000000007},{"$f":"VLOOKUP($B$36,'ASR lookup'!$F$66:$AB$70,M38,FALSE)","v":1.4},4,null,"00-01",{"$f":"VLOOKUP($A$36,'ASR lookup'!$C$5:$CB$26,'Controls Sheet'!R38,FALSE)","v":0.6},{"$f":"VLOOKUP($A$36,'ASR lookup'!$C$5:$CB$26,'Controls Sheet'!S38,FALSE)","v":17.8},47,63,"00-01",{"$f":"VLOOKUP($A$36,'ASR lookup'!$C$40:$CB$61,'Controls Sheet'!W38,FALSE)","v":0},{"$f":"VLOOKUP($A$36,'ASR lookup'!$C$40:$CB$61,'Controls Sheet'!X38,FALSE)","v":9.1},47,63,null,"00-01",{"$f":"B38-P38","v":4.3},{"$f":"Q38-B38","v":12.9},null,"00-01",{"$f":"C38-U38","v":0},{"$f":"V38-C38","v":9.1},null,{"$f":"VLOOKUP($A$36,'ASR lookup'!$C$5:$CV$26,'Controls Sheet'!AJ38,FALSE)","v":0},{"$f":"VLOOKUP($A$36,'ASR lookup'!$C$40:$CV$61,'Controls Sheet'!AJ38,FALSE)","v":-1},79,null,"00-01",4.8,3.4,4]
["01-04",{"$f":"VLOOKUP($A$36,'ASR lookup'!$C$5:$AB$26,D39,FALSE)","v":0},{"$f":"VLOOKUP($A$36,'ASR lookup'!$C$40:$AB$61,D39,FALSE)","v":0},8,"01-04",{"$f":"VLOOKUP($A$36,'ASR lookup'!$C$5:$AV$26,'Controls Sheet'!H39,FALSE)","v":0},{"$f":"VLOOKUP($A$36,'ASR lookup'!$C$40:$AV$61,'Controls Sheet'!H39,FALSE)","v":0},28,null,"01-04",{"$f":"VLOOKUP($B$36,'ASR lookup'!$F$31:$AB$35,M39,FALSE)","v":0},{"$f":"VLOOKUP($B$36,'ASR lookup'!$F$66:$AB$70,M39,FALSE)","v":0.2},5,null,"01-04",{"$f":"VLOOKUP($A$36,'ASR lookup'!$C$5:$CB$26,'Controls Sheet'!R39,FALSE)","v":0},{"$f":"VLOOKUP($A$36,'ASR lookup'!$C$5:$CB$26,'Controls Sheet'!S39,FALSE)","v":2.2000000000000002},48,64,"01-04",{"$f":"VLOOKUP($A$36,'ASR lookup'!$C$40:$CB$61,'Controls Sheet'!W39,FALSE)","v":0},{"$f":"VLOOKUP($A$36,'ASR lookup'!$C$40:$CB$61,'Controls Sheet'!X39,FALSE)","v":2.4},48,64,null,"01-04",{"$f":"B39-P39","v":0},{"$f":"Q39-B39","v":2.2000000000000002},null,"01-04",{"$f":"C39-U39","v":0},{"$f":"V39-C39","v":2.4},null,{"$f":"VLOOKUP($A$36,'ASR lookup'!$C$5:$CV$26,'Controls Sheet'!AJ39,FALSE)","v":0},{"$f":"VLOOKUP($A$36,'ASR lookup'!$C$40:$CV$61,'Controls Sheet'!AJ39,FALSE)","v":0},80,null,"01-04",0.2,0.1,5]
["05-09",{"$f":"VLOOKUP($A$36,'ASR lookup'!$C$5:$AB$26,D40,FALSE)","v":0},{"$f":"VLOOKUP($A$36,'ASR lookup'!$C$40:$AB$61,D40,FALSE)","v":0},9,"05-09",{"$f":"VLOOKUP($A$36,'ASR lookup'!$C$5:$AV$26,'Controls Sheet'!H40,FALSE)","v":0},{"$f":"VLOOKUP($A$36,'ASR lookup'!$C$40:$AV$61,'Controls Sheet'!H40,FALSE)","v":0},29,null,"05-09",{"$f":"VLOOKUP($B$36,'ASR lookup'!$F$31:$AB$35,M40,FALSE)","v":0.1},{"$f":"VLOOKUP($B$36,'ASR lookup'!$F$66:$AB$70,M40,FALSE)","v":0.1},6,null,"05-09",{"$f":"VLOOKUP($A$36,'ASR lookup'!$C$5:$CB$26,'Controls Sheet'!R40,FALSE)","v":0},{"$f":"VLOOKUP($A$36,'ASR lookup'!$C$5:$CB$26,'Controls Sheet'!S40,FALSE)","v":2},49,65,"05-09",{"$f":"VLOOKUP($A$36,'ASR lookup'!$C$40:$CB$61,'Controls Sheet'!W40,FALSE)","v":0},{"$f":"VLOOKUP($A$36,'ASR lookup'!$C$40:$CB$61,'Controls Sheet'!X40,FALSE)","v":2.2000000000000002},49,65,null,"05-09",0,2,null,"05-09",0,2.2000000000000002,null,{"$f":"VLOOKUP($A$36,'ASR lookup'!$C$5:$CV$26,'Controls Sheet'!AJ40,FALSE)","v":0},{"$f":"VLOOKUP($A$36,'ASR lookup'!$C$40:$CV$61,'Controls Sheet'!AJ40,FALSE)","v":0},81,null,"05-09",0.1,0.1,6]
["10-14",{"$f":"VLOOKUP($A$36,'ASR lookup'!$C$5:$AB$26,D41,FALSE)","v":0},{"$f":"VLOOKUP($A$36,'ASR lookup'!$C$40:$AB$61,D41,FALSE)","v":1.1000000000000001},10,"10-14",{"$f":"VLOOKUP($A$36,'ASR lookup'!$C$5:$AV$26,'Controls Sheet'!H41,FALSE)","v":0},{"$f":"VLOOKUP($A$36,'ASR lookup'!$C$40:$AV$61,'Controls Sheet'!H41,FALSE)","v":2},30,null,"10-14",{"$f":"VLOOKUP($B$36,'ASR lookup'!$F$31:$AB$35,M41,FALSE)","v":0},{"$f":"VLOOKUP($B$36,'ASR lookup'!$F$66:$AB$70,M41,FALSE)","v":0},7,null,"10-14",{"$f":"VLOOKUP($A$36,'ASR lookup'!$C$5:$CB$26,'Controls Sheet'!R41,FALSE)","v":0},{"$f":"VLOOKUP($A$36,'ASR lookup'!$C$5:$CB$26,'Controls Sheet'!S41,FALSE)","v":2},50,66,"10-14",{"$f":"VLOOKUP($A$36,'ASR lookup'!$C$40:$CB$61,'Controls Sheet'!W41,FALSE)","v":0.1},{"$f":"VLOOKUP($A$36,'ASR lookup'!$C$40:$CB$61,'Controls Sheet'!X41,FALSE)","v":4},50,66,null,"10-14",0,2,null,"10-14",1,2.9,null,{"$f":"VLOOKUP($A$36,'ASR lookup'!$C$5:$CV$26,'Controls Sheet'!AJ41,FALSE)","v":0},{"$f":"VLOOKUP($A$36,'ASR lookup'!$C$40:$CV$61,'Controls Sheet'!AJ41,FALSE)","v":2},82,null,"10-14",0.1,0.1,7]
["15-19",{"$f":"VLOOKUP($A$36,'ASR lookup'!$C$5:$AB$26,D42,FALSE)","v":1},{"$f":"VLOOKUP($A$36,'ASR lookup'!$C$40:$AB$61,D42,FALSE)","v":0.6},11,"15-19",{"$f":"VLOOKUP($A$36,'ASR lookup'!$C$5:$AV$26,'Controls Sheet'!H42,FALSE)","v":2},{"$f":"VLOOKUP($A$36,'ASR lookup'!$C$40:$AV$61,'Controls Sheet'!H42,FALSE)","v":1},31,null,"15-19",{"$f":"VLOOKUP($B$36,'ASR lookup'!$F$31:$AB$35,M42,FALSE)","v":0.1},{"$f":"VLOOKUP($B$36,'ASR lookup'!$F$66:$AB$70,M42,FALSE)","v":0.1},8,null,"15-19",{"$f":"VLOOKUP($A$36,'ASR lookup'!$C$5:$CB$26,'Controls Sheet'!R42,FALSE)","v":0.1},{"$f":"VLOOKUP($A$36,'ASR lookup'!$C$5:$CB$26,'Controls Sheet'!S42,FALSE)","v":3.6},51,67,"15-19",{"$f":"VLOOKUP($A$36,'ASR lookup'!$C$40:$CB$61,'Controls Sheet'!W42,FALSE)","v":0},{"$f":"VLOOKUP($A$36,'ASR lookup'!$C$40:$CB$61,'Controls Sheet'!X42,FALSE)","v":3.1},51,67,null,"15-19",0.9,2.6,null,"15-19",0.6,2.5,null,{"$f":"VLOOKUP($A$36,'ASR lookup'!$C$5:$CV$26,'Controls Sheet'!AJ42,FALSE)","v":1},{"$f":"VLOOKUP($A$36,'ASR lookup'!$C$40:$CV$61,'Controls Sheet'!AJ42,FALSE)","v":1},83,null,"15-19",0.3,0.2,8]
["20-24",{"$f":"VLOOKUP($A$36,'ASR lookup'!$C$5:$AB$26,D43,FALSE)","v":2.6},{"$f":"VLOOKUP($A$36,'ASR lookup'!$C$40:$AB$61,D43,FALSE)","v":0},12,"20-24",{"$f":"VLOOKUP($A$36,'ASR lookup'!$C$5:$AV$26,'Controls Sheet'!H43,FALSE)","v":5},{"$f":"VLOOKUP($A$36,'ASR lookup'!$C$40:$AV$61,'Controls Sheet'!H43,FALSE)","v":0},32,null,"20-24",{"$f":"VLOOKUP($B$36,'ASR lookup'!$F$31:$AB$35,M43,FALSE)","v":0.1},{"$f":"VLOOKUP($B$36,'ASR lookup'!$F$66:$AB$70,M43,FALSE)","v":0.1},9,null,"20-24",{"$f":"VLOOKUP($A$36,'ASR lookup'!$C$5:$CB$26,'Controls Sheet'!R43,FALSE)","v":0.8},{"$f":"VLOOKUP($A$36,'ASR lookup'!$C$5:$CB$26,'Controls Sheet'!S43,FALSE)","v":6},52,68,"20-24",{"$f":"VLOOKUP($A$36,'ASR lookup'!$C$40:$CB$61,'Controls Sheet'!W43,FALSE)","v":0},{"$f":"VLOOKUP($A$36,'ASR lookup'!$C$40:$CB$61,'Controls Sheet'!X43,FALSE)","v":2},52,68,null,"20-24",1.8,3.4,null,"20-24",0,2,null,{"$f":"VLOOKUP($A$36,'ASR lookup'!$C$5:$CV$26,'Controls Sheet'!AJ43,FALSE)","v":4},{"$f":"VLOOKUP($A$36,'ASR lookup'!$C$40:$CV$61,'Controls Sheet'!AJ43,FALSE)","v":-1},84,null,"20-24",0.7,0.3,9]
["25-29",{"$f":"VLOOKUP($A$36,'ASR lookup'!$C$5:$AB$26,D44,FALSE)","v":1.1000000000000001},{"$f":"VLOOKUP($A$36,'ASR lookup'!$C$40:$AB$61,D44,FALSE)","v":0},13,"25-29",{"$f":"VLOOKUP($A$36,'ASR lookup'!$C$5:$AV$26,'Controls Sheet'!H44,FALSE)","v":0},{"$f":"VLOOKUP($A$36,'ASR lookup'!$C$40:$AV$61,'Controls Sheet'!H44,FALSE)","v":-1},33,null,"25-29",{"$f":"VLOOKUP($B$36,'ASR lookup'!$F$31:$AB$35,M44,FALSE)","v":0.9},{"$f":"VLOOKUP($B$36,'ASR lookup'!$F$66:$AB$70,M44,FALSE)","v":0.3},10,null,"25-29",{"$f":"VLOOKUP($A$36,'ASR lookup'!$C$5:$CB$26,'Controls Sheet'!R44,FALSE)","v":0.1},{"$f":"VLOOKUP($A$36,'ASR lookup'!$C$5:$CB$26,'Controls Sheet'!S44,FALSE)","v":3.9},53,69,"25-29",{"$f":"VLOOKUP($A$36,'ASR lookup'!$C$40:$CB$61,'Controls Sheet'!W44,FALSE)","v":0},{"$f":"VLOOKUP($A$36,'ASR lookup'!$C$40:$CB$61,'Controls Sheet'!X44,FALSE)","v":2},53,69,null,"25-29",1,2.8,null,"25-29",0,2,null,{"$f":"VLOOKUP($A$36,'ASR lookup'!$C$5:$CV$26,'Controls Sheet'!AJ44,FALSE)","v":1},{"$f":"VLOOKUP($A$36,'ASR lookup'!$C$40:$CV$61,'Controls Sheet'!AJ44,FALSE)","v":-1},85,null,"25-29",0.8,0.4,10]
["30-34",{"$f":"VLOOKUP($A$36,'ASR lookup'!$C$5:$AB$26,D45,FALSE)","v":2.7},{"$f":"VLOOKUP($A$36,'ASR lookup'!$C$40:$AB$61,D45,FALSE)","v":0.6},14,"30-34",{"$f":"VLOOKUP($A$36,'ASR lookup'!$C$5:$AV$26,'Controls Sheet'!H45,FALSE)","v":4},{"$f":"VLOOKUP($A$36,'ASR lookup'!$C$40:$AV$61,'Controls Sheet'!H45,FALSE)","v":0},34,null,"30-34",{"$f":"VLOOKUP($B$36,'ASR lookup'!$F$31:$AB$35,M45,FALSE)","v":0.8},{"$f":"VLOOKUP($B$36,'ASR lookup'!$F$66:$AB$70,M45,FALSE)","v":0.5},11,null,"30-34",{"$f":"VLOOKUP($A$36,'ASR lookup'!$C$5:$CB$26,'Controls Sheet'!R45,FALSE)","v":0.9},{"$f":"VLOOKUP($A$36,'ASR lookup'!$C$5:$CB$26,'Controls Sheet'!S45,FALSE)","v":6.2},54,70,"30-34",{"$f":"VLOOKUP($A$36,'ASR lookup'!$C$40:$CB$61,'Controls Sheet'!W45,FALSE)","v":0},{"$f":"VLOOKUP($A$36,'ASR lookup'!$C$40:$CB$61,'Controls Sheet'!X45,FALSE)","v":3.1},54,70,null,"30-34",{"$f":"B45-P45","v":1.8},3.5,null,"30-34",0.6,2.5,null,{"$f":"VLOOKUP($A$36,'ASR lookup'!$C$5:$CV$26,'Controls Sheet'!AJ45,FALSE)","v":3},{"$f":"VLOOKUP($A$36,'ASR lookup'!$C$40:$CV$61,'Controls Sheet'!AJ45,FALSE)","v":0},86,null,"30-34",1.2,0.6,11]
["35-39",{"$f":"VLOOKUP($A$36,'ASR lookup'!$C$5:$AB$26,D46,FALSE)","v":1.7},{"$f":"VLOOKUP($A$36,'ASR lookup'!$C$40:$AB$61,D46,FALSE)","v":0.6},15,"35-39",{"$f":"VLOOKUP($A$36,'ASR lookup'!$C$5:$AV$26,'Controls Sheet'!H46,FALSE)","v":1},{"$f":"VLOOKUP($A$36,'ASR lookup'!$C$40:$AV$61,'Controls Sheet'!H46,FALSE)","v":1},35,null,"35-39",{"$f":"VLOOKUP($B$36,'ASR lookup'!$F$31:$AB$35,M46,FALSE)","v":1},{"$f":"VLOOKUP($B$36,'ASR lookup'!$F$66:$AB$70,M46,FALSE)","v":0.2},12,null,"35-39",{"$f":"VLOOKUP($A$36,'ASR lookup'!$C$5:$CB$26,'Controls Sheet'!R46,FALSE)","v":0.3},{"$f":"VLOOKUP($A$36,'ASR lookup'!$C$5:$CB$26,'Controls Sheet'!S46,FALSE)","v":4.8},55,71,"35-39",{"$f":"VLOOKUP($A$36,'ASR lookup'!$C$40:$CB$61,'Controls Sheet'!W46,FALSE)","v":0},{"$f":"VLOOKUP($A$36,'ASR lookup'!$C$40:$CB$61,'Controls Sheet'!X46,FALSE)","v":3.1},55,71,null,"35-39",1.4,3.1,null,"35-39",0.6,2.5,null,{"$f":"VLOOKUP($A$36,'ASR lookup'!$C$5:$CV$26,'Controls Sheet'!AJ46,FALSE)","v":0},{"$f":"VLOOKUP($A$36,'ASR lookup'!$C$40:$CV$61,'Controls Sheet'!AJ46,FALSE)","v":0},87,null,"35-39",1.6,0.8,12]
["40-44",{"$f":"VLOOKUP($A$36,'ASR lookup'!$C$5:$AB$26,D47,FALSE)","v":1.3},{"$f":"VLOOKUP($A$36,'ASR lookup'!$C$40:$AB$61,D47,FALSE)","v":1.7},16,"40-44",{"$f":"VLOOKUP($A$36,'ASR lookup'!$C$5:$AV$26,'Controls Sheet'!H47,FALSE)","v":1},{"$f":"VLOOKUP($A$36,'ASR lookup'!$C$40:$AV$61,'Controls Sheet'!H47,FALSE)","v":3},36,null,"40-44",{"$f":"VLOOKUP($B$36,'ASR lookup'!$F$31:$AB$35,M47,FALSE)","v":1.1000000000000001},{"$f":"VLOOKUP($B$36,'ASR lookup'!$F$66:$AB$70,M47,FALSE)","v":0.5},13,null,"40-44",{"$f":"VLOOKUP($A$36,'ASR lookup'!$C$5:$CB$26,'Controls Sheet'!R47,FALSE)","v":0.3},{"$f":"VLOOKUP($A$36,'ASR lookup'!$C$5:$CB$26,'Controls Sheet'!S47,FALSE)","v":3.9},56,72,"40-44",{"$f":"VLOOKUP($A$36,'ASR lookup'!$C$40:$CB$61,'Controls Sheet'!W47,FALSE)","v":0.5},{"$f":"VLOOKUP($A$36,'ASR lookup'!$C$40:$CB$61,'Controls Sheet'!X47,FALSE)","v":4.4000000000000004},56,72,null,"40-44",1,2.6,null,"40-44",1.2,2.7,null,{"$f":"VLOOKUP($A$36,'ASR lookup'!$C$5:$CV$26,'Controls Sheet'!AJ47,FALSE)","v":-1},{"$f":"VLOOKUP($A$36,'ASR lookup'!$C$40:$CV$61,'Controls Sheet'!AJ47,FALSE)","v":1},88,null,"40-44",2,1.3,13]
["45-49",{"$f":"VLOOKUP($A$36,'ASR lookup'!$C$5:$AB$26,D48,FALSE)","v":1.7},{"$f":"VLOOKUP($A$36,'ASR lookup'!$C$40:$AB$61,D48,FALSE)","v":2},17,"45-49",{"$f":"VLOOKUP($A$36,'ASR lookup'!$C$5:$AV$26,'Controls Sheet'!H48,FALSE)","v":1},{"$f":"VLOOKUP($A$36,'ASR lookup'!$C$40:$AV$61,'Controls Sheet'!H48,FALSE)","v":2},37,null,"45-49",{"$f":"VLOOKUP($B$36,'ASR lookup'!$F$31:$AB$35,M48,FALSE)","v":1.2},{"$f":"VLOOKUP($B$36,'ASR lookup'!$F$66:$AB$70,M48,FALSE)","v":1.2},14,null,"45-49",{"$f":"VLOOKUP($A$36,'ASR lookup'!$C$5:$CB$26,'Controls Sheet'!R48,FALSE)","v":0.5},{"$f":"VLOOKUP($A$36,'ASR lookup'!$C$5:$CB$26,'Controls Sheet'!S48,FALSE)","v":4.3},57,73,"45-49",{"$f":"VLOOKUP($A$36,'ASR lookup'!$C$40:$CB$61,'Controls Sheet'!W48,FALSE)","v":0.7},{"$f":"VLOOKUP($A$36,'ASR lookup'!$C$40:$CB$61,'Controls Sheet'!X48,FALSE)","v":4.8},57,73,null,"45-49",1.2,2.6,null,"45-49",1.3,2.8,null,{"$f":"VLOOKUP($A$36,'ASR lookup'!$C$5:$CV$26,'Controls Sheet'!AJ48,FALSE)","v":-3},{"$f":"VLOOKUP($A$36,'ASR lookup'!$C$40:$CV$61,'Controls Sheet'!AJ48,FALSE)","v":0},89,null,"45-49",2.8,1.9,14]
["50-54",{"$f":"VLOOKUP($A$36,'ASR lookup'!$C$5:$AB$26,D49,FALSE)","v":2.5},{"$f":"VLOOKUP($A$36,'ASR lookup'!$C$40:$AB$61,D49,FALSE)","v":2.1},18,"50-54",{"$f":"VLOOKUP($A$36,'ASR lookup'!$C$5:$AV$26,'Controls Sheet'!H49,FALSE)","v":0},{"$f":"VLOOKUP($A$36,'ASR lookup'!$C$40:$AV$61,'Controls Sheet'!H49,FALSE)","v":1},38,null,"50-54",{"$f":"VLOOKUP($B$36,'ASR lookup'!$F$31:$AB$35,M49,FALSE)","v":2.6},{"$f":"VLOOKUP($B$36,'ASR lookup'!$F$66:$AB$70,M49,FALSE)","v":1.9},15,null,"50-54",{"$f":"VLOOKUP($A$36,'ASR lookup'!$C$5:$CB$26,'Controls Sheet'!R49,FALSE)","v":0.9},{"$f":"VLOOKUP($A$36,'ASR lookup'!$C$5:$CB$26,'Controls Sheet'!S49,FALSE)","v":5.5},58,74,"50-54",{"$f":"VLOOKUP($A$36,'ASR lookup'!$C$40:$CB$61,'Controls Sheet'!W49,FALSE)","v":0.7},{"$f":"VLOOKUP($A$36,'ASR lookup'!$C$40:$CB$61,'Controls Sheet'!X49,FALSE)","v":4.8},58,74,null,"50-54",1.6,3,null,"50-54",1.4,2.7,null,{"$f":"VLOOKUP($A$36,'ASR lookup'!$C$5:$CV$26,'Controls Sheet'!AJ49,FALSE)","v":-3},{"$f":"VLOOKUP($A$36,'ASR lookup'!$C$40:$CV$61,'Controls Sheet'!AJ49,FALSE)","v":-1},90,null,"50-54",3.8,2.5,15]
["55-59",{"$f":"VLOOKUP($A$36,'ASR lookup'!$C$5:$AB$26,D50,FALSE)","v":5.9},{"$f":"VLOOKUP($A$36,'ASR lookup'!$C$40:$AB$61,D50,FALSE)","v":3.4},19,"55-59",{"$f":"VLOOKUP($A$36,'ASR lookup'!$C$5:$AV$26,'Controls Sheet'!H50,FALSE)","v":4},{"$f":"VLOOKUP($A$36,'ASR lookup'!$C$40:$AV$61,'Controls Sheet'!H50,FALSE)","v":1},39,null,"55-59",{"$f":"VLOOKUP($B$36,'ASR lookup'!$F$31:$AB$35,M50,FALSE)","v":4.0999999999999996},{"$f":"VLOOKUP($B$36,'ASR lookup'!$F$66:$AB$70,M50,FALSE)","v":3.1},16,null,"55-59",{"$f":"VLOOKUP($A$36,'ASR lookup'!$C$5:$CB$26,'Controls Sheet'!R50,FALSE)","v":3.2},{"$f":"VLOOKUP($A$36,'ASR lookup'!$C$5:$CB$26,'Controls Sheet'!S50,FALSE)","v":9.9},59,75,"55-59",{"$f":"VLOOKUP($A$36,'ASR lookup'!$C$40:$CB$61,'Controls Sheet'!W50,FALSE)","v":1.5},{"$f":"VLOOKUP($A$36,'ASR lookup'!$C$40:$CB$61,'Controls Sheet'!X50,FALSE)","v":6.8},59,75,null,"55-59",2.7,4,null,"55-59",1.9,3.4,null,{"$f":"VLOOKUP($A$36,'ASR lookup'!$C$5:$CV$26,'Controls Sheet'!AJ50,FALSE)","v":-1},{"$f":"VLOOKUP($A$36,'ASR lookup'!$C$40:$CV$61,'Controls Sheet'!AJ50,FALSE)","v":-1},91,null,"55-59",6.4,4,16]
["60-64",{"$f":"VLOOKUP($A$36,'ASR lookup'!$C$5:$AB$26,D51,FALSE)","v":11.1},{"$f":"VLOOKUP($A$36,'ASR lookup'!$C$40:$AB$61,D51,FALSE)","v":8.3000000000000007},20,"60-64",{"$f":"VLOOKUP($A$36,'ASR lookup'!$C$5:$AV$26,'Controls Sheet'!H51,FALSE)","v":4},{"$f":"VLOOKUP($A$36,'ASR lookup'!$C$40:$AV$61,'Controls Sheet'!H51,FALSE)","v":8},40,null,"60-64",{"$f":"VLOOKUP($B$36,'ASR lookup'!$F$31:$AB$35,M51,FALSE)","v":9.3000000000000007},{"$f":"VLOOKUP($B$36,'ASR lookup'!$F$66:$AB$70,M51,FALSE)","v":5.0999999999999996},17,null,"60-64",{"$f":"VLOOKUP($A$36,'ASR lookup'!$C$5:$CB$26,'Controls Sheet'!R51,FALSE)","v":7.4},{"$f":"VLOOKUP($A$36,'ASR lookup'!$C$5:$CB$26,'Controls Sheet'!S51,FALSE)","v":16},60,76,"60-64",{"$f":"VLOOKUP($A$36,'ASR lookup'!$C$40:$CB$61,'Controls Sheet'!W51,FALSE)","v":5.2},{"$f":"VLOOKUP($A$36,'ASR lookup'!$C$40:$CB$61,'Controls Sheet'!X51,FALSE)","v":12.6},60,76,null,"60-64",3.7,4.9000000000000004,null,"60-64",3.1,4.3,null,{"$f":"VLOOKUP($A$36,'ASR lookup'!$C$5:$CV$26,'Controls Sheet'!AJ51,FALSE)","v":3},{"$f":"VLOOKUP($A$36,'ASR lookup'!$C$40:$CV$61,'Controls Sheet'!AJ51,FALSE)","v":3},92,null,"60-64",10,7.2,17]
["65-69",{"$f":"VLOOKUP($A$36,'ASR lookup'!$C$5:$AB$26,D52,FALSE)","v":14},{"$f":"VLOOKUP($A$36,'ASR lookup'!$C$40:$AB$61,D52,FALSE)","v":9.8000000000000007},21,"65-69",{"$f":"VLOOKUP($A$36,'ASR lookup'!$C$5:$AV$26,'Controls Sheet'!H52,FALSE)","v":3},{"$f":"VLOOKUP($A$36,'ASR lookup'!$C$40:$AV$61,'Controls Sheet'!H52,FALSE)","v":9},41,null,"65-69",{"$f":"VLOOKUP($B$36,'ASR lookup'!$F$31:$AB$35,M52,FALSE)","v":12.7},{"$f":"VLOOKUP($B$36,'ASR lookup'!$F$66:$AB$70,M52,FALSE)","v":6.5},18,null,"65-69",{"$f":"VLOOKUP($A$36,'ASR lookup'!$C$5:$CB$26,'Controls Sheet'!R52,FALSE)","v":9.6999999999999993},{"$f":"VLOOKUP($A$36,'ASR lookup'!$C$5:$CB$26,'Controls Sheet'!S52,FALSE)","v":19.399999999999999},61,77,"65-69",{"$f":"VLOOKUP($A$36,'ASR lookup'!$C$40:$CB$61,'Controls Sheet'!W52,FALSE)","v":6.4},{"$f":"VLOOKUP($A$36,'ASR lookup'!$C$40:$CB$61,'Controls Sheet'!X52,FALSE)","v":14.3},61,77,null,"65-69",4.3,5.4,null,"65-69",3.4,4.5,null,{"$f":"VLOOKUP($A$36,'ASR lookup'!$C$5:$CV$26,'Controls Sheet'!AJ52,FALSE)","v":-3},{"$f":"VLOOKUP($A$36,'ASR lookup'!$C$40:$CV$61,'Controls Sheet'!AJ52,FALSE)","v":-2},93,null,"65-69",15.3,10.6,18]
["70-74",{"$f":"VLOOKUP($A$36,'ASR lookup'!$C$5:$AB$26,D53,FALSE)","v":19.100000000000001},{"$f":"VLOOKUP($A$36,'ASR lookup'!$C$40:$AB$61,D53,FALSE)","v":15.7},22,"70-74",{"$f":"VLOOKUP($A$36,'ASR lookup'!$C$5:$AV$26,'Controls Sheet'!H53,FALSE)","v":5},{"$f":"VLOOKUP($A$36,'ASR lookup'!$C$40:$AV$61,'Controls Sheet'!H53,FALSE)","v":10},42,null,"70-74",{"$f":"VLOOKUP($B$36,'ASR lookup'!$F$31:$AB$35,M53,FALSE)","v":16.3},{"$f":"VLOOKUP($B$36,'ASR lookup'!$F$66:$AB$70,M53,FALSE)","v":10.7},19,null,"70-74",{"$f":"VLOOKUP($A$36,'ASR lookup'!$C$5:$CB$26,'Controls Sheet'!R53,FALSE)","v":13.4},{"$f":"VLOOKUP($A$36,'ASR lookup'!$C$5:$CB$26,'Controls Sheet'!S53,FALSE)","v":26.5},62,78,"70-74",{"$f":"VLOOKUP($A$36,'ASR lookup'!$C$40:$CB$61,'Controls Sheet'!W53,FALSE)","v":10.7},{"$f":"VLOOKUP($A$36,'ASR lookup'!$C$40:$CB$61,'Controls Sheet'!X53,FALSE)","v":22.3},62,78,null,"70-74",5.7,7.4,null,"70-74",5,6.6,null,{"$f":"VLOOKUP($A$36,'ASR lookup'!$C$5:$CV$26,'Controls Sheet'!AJ53,FALSE)","v":-15},{"$f":"VLOOKUP($A$36,'ASR lookup'!$C$40:$CV$61,'Controls Sheet'!AJ53,FALSE)","v":-5},94,null,"70-74",27.3,18.3,19]
["75-79",{"$f":"VLOOKUP($A$36,'ASR lookup'!$C$5:$AB$26,D54,FALSE)","v":36.4},{"$f":"VLOOKUP($A$36,'ASR lookup'!$C$40:$AB$61,D54,FALSE)","v":22.5},23,"75-79",{"$f":"VLOOKUP($A$36,'ASR lookup'!$C$5:$AV$26,'Controls Sheet'!H54,FALSE)","v":7},{"$f":"VLOOKUP($A$36,'ASR lookup'!$C$40:$AV$61,'Controls Sheet'!H54,FALSE)","v":0},43,null,"75-79",{"$f":"VLOOKUP($B$36,'ASR lookup'!$F$31:$AB$35,M54,FALSE)","v":31.3},{"$f":"VLOOKUP($B$36,'ASR lookup'!$F$66:$AB$70,M54,FALSE)","v":22.3},20]
["80-84",{"$f":"VLOOKUP($A$36,'ASR lookup'!$C$5:$AB$26,D55,FALSE)","v":73.3},{"$f":"VLOOKUP($A$36,'ASR lookup'!$C$40:$AB$61,D55,FALSE)","v":45.6},24,"80-84",{"$f":"VLOOKUP($A$36,'ASR lookup'!$C$5:$AV$26,'Controls Sheet'!H55,FALSE)","v":10},{"$f":"VLOOKUP($A$36,'ASR lookup'!$C$40:$AV$61,'Controls Sheet'!H55,FALSE)","v":4},44,null,"80-84",{"$f":"VLOOKUP($B$36,'ASR lookup'!$F$31:$AB$35,M55,FALSE)","v":62.2},{"$f":"VLOOKUP($B$36,'ASR lookup'!$F$66:$AB$70,M55,FALSE)","v":42.7},21]
["85+",{"$f":"VLOOKUP($A$36,'ASR lookup'!$C$5:$AB$26,D56,FALSE)","v":176.9},{"$f":"VLOOKUP($A$36,'ASR lookup'!$C$40:$AB$61,D56,FALSE)","v":131.30000000000001},25,"85+",{"$f":"VLOOKUP($A$36,'ASR lookup'!$C$5:$AV$26,'Controls Sheet'!H56,FALSE)","v":26},{"$f":"VLOOKUP($A$36,'ASR lookup'!$C$40:$AV$61,'Controls Sheet'!H56,FALSE)","v":-2},45,null,"85+",{"$f":"VLOOKUP($B$36,'ASR lookup'!$F$31:$AB$35,M56,FALSE)","v":137.30000000000001},{"$f":"VLOOKUP($B$36,'ASR lookup'!$F$66:$AB$70,M56,FALSE)","v":132.6},22]
["total",{"$f":"VLOOKUP($A$36,'ASR lookup'!$C$5:$AB$26,D57,FALSE)","v":11},{"$f":"VLOOKUP($A$36,'ASR lookup'!$C$40:$AB$61,D57,FALSE)","v":11},26,"total",{"$f":"VLOOKUP($A$36,'ASR lookup'!$C$5:$AV$26,'Controls Sheet'!H57,FALSE)","v":72},{"$f":"VLOOKUP($A$36,'ASR lookup'!$C$40:$AV$61,'Controls Sheet'!H57,FALSE)","v":37},46,null,"total",{"$f":"VLOOKUP($B$36,'ASR lookup'!$F$31:$AB$35,M57,FALSE)","v":10.7},{"$f":"VLOOKUP($B$36,'ASR lookup'!$F$66:$AB$70,M57,FALSE)","v":11.4},23]
[]
["Significant ASR",null,null,null,null,null,null,null,null,null,null,"Significant ASR WALES",null,null,null,null,null,null,null,null,null,"Significant ASR WALES"]
["Males","Rate","LCI","UCI",null,"Females","Rate","LCI","UCI",null,null,"Males","Rate","LCI","UCI",null,"Females","Rate","LCI","UCI",null,"Males","Rate","LCI","UCI",null,"Females","Rate","LCI","UCI",null,"Males","Rate","LCI","UCI",null,"Females","Rate","LCI","UCI"]
["00-01",{"$f":"IF(P38>K38,B38,-10)","v":-10},{"$f":"IF(P38>K38,AA38,\"\")","v":""},{"$f":"IF(P38>K38,AB38,\"\")","v":""},null,"00-01",{"$f":"IF(U38>L38,C38,-10)","v":-10},{"$f":"IF(U38>L38,AE38,\"\")","v":""},{"$f":"IF(U38>L38,AF38,\"\")","v":""},null,null,"00-01",{"$f":"IF(P38>AM38,B38,-10)","v":-10},{"$f":"IF(P38>AM38,AA38,\"\")","v":""},{"$f":"IF(P38>AM38,AB38,\"\")","v":""},null,"00-01",{"$f":"IF(U38>AN38,C38,-10)","v":-10},{"$f":"IF(U38>AN38,AE38,\"\")","v":""},{"$f":"IF(U38>AN38,AF38,\"\")","v":""},null,"00-01",{"$f":"IF(Q38<AM38,B38,-10)","v":-10},{"$f":"IF(Q38<AM38,AA38,\"\")","v":""},{"$f":"IF(Q38<AM38,AB38,\"\")","v":""},null,"00-01",{"$f":"IF(V38<AN38,C38,-10)","v":-10},{"$f":"IF(V38<AN38,AE38,\"\")","v":""},{"$f":"IF(V38<AN38,AF38,\"\")","v":""},null,"00-01",{"$f":"IF(Q38<K38,B38,-10)","v":-10},{"$f":"IF(Q38<K38,AA38,\"\")","v":""},{"$f":"IF(Q38<K38,AB38,\"\")","v":""},null,"00-01",{"$f":"IF(V38<L38,C38,-10)","v":-10},{"$f":"IF(V38<L38,AE38,\"\")","v":""},{"$f":"IF(V38<L38,AF38,\"\")","v":""}]
["01-04",{"$f":"IF(P39>K39,B39,-10)","v":-10},{"$f":"IF(P39>K39,AA39,\"\")","v":""},{"$f":"IF(P39>K39,AB39,\"\")","v":""},null,"01-04",{"$f":"IF(U39>L39,C39,-10)","v":-10},{"$f":"IF(U39>L39,AE39,\"\")","v":""},{"$f":"IF(U39>L39,AF39,\"\")","v":""},null,null,"01-04",{"$f":"IF(P39>AM39,B39,-10)","v":-10},{"$f":"IF(P39>AM39,AA39,\"\")","v":""},{"$f":"IF(P39>AM39,AB39,\"\")","v":""},null,"01-04",{"$f":"IF(U39>AN39,C39,-10)","v":-10},{"$f":"IF(U39>AN39,AE39,\"\")","v":""},{"$f":"IF(U39>AN39,AF39,\"\")","v":""},null,"01-04",{"$f":"IF(Q39<AM39,B39,-10)","v":-10},{"$f":"IF(Q39<AM39,AA39,\"\")","v":""},{"$f":"IF(Q39<AM39,AB39,\"\")","v":""},null,"01-04",{"$f":"IF(V39<AN39,C39,-10)","v":-10},{"$f":"IF(V39<AN39,AE39,\"\")","v":""},{"$f":"IF(V39<AN39,AF39,\"\")","v":""},null,"01-04",{"$f":"IF(Q39<K39,B39,-10)","v":-10},{"$f":"IF(Q39<K39,AA39,\"\")","v":""},{"$f":"IF(Q39<K39,AB39,\"\")","v":""},null,"01-04",{"$f":"IF(V39<L39,C39,-10)","v":-10},{"$f":"IF(V39<L39,AE39,\"\")","v":""},{"$f":"IF(V39<L39,AF39,\"\")","v":""}]
["05-09",-10,"","",null,"05-09",-10,"","",null,null,"05-09",-10,"","",null,"05-09",-10,"","",null,"05-09",-10,"","",null,"05-09",-10,"","",null,"05-09",-10,"","",null,"05-09",-10,"",""]
["10-14",-10,"","",null,"10-14",1.1000000000000001,1,2.9,null,null,"10-14",-10,"","",null,"10-14",-10,"","",null,"10-14",-10,"","",null,"10-14",-10,"","",null,"10-14",-10,"","",null,"10-14",-10,"",""]
["15-19",-10,"","",null,"15-19",-10,"","",null,null,"15-19",-10,"","",null,"15-19",-10,"","",null,"15-19",-10,"","",null,"15-19",-10,"","",null,"15-19",-10,"","",null,"15-19",-10,"",""]
["20-24",2.6,1.8,3.4,null,"20-24",-10,"","",null,null,"20-24",2.6,1.8,3.4,null,"20-24",-10,"","",null,"20-24",-10,"","",null,"20-24",-10,"","",null,"20-24",-10,"","",null,"20-24",-10,"",""]
["25-29",-10,"","",null,"25-29",-10,"","",null,null,"25-29",-10,"","",null,"25-29",-10,"","",null,"25-29",-10,"","",null,"25-29",-10,"","",null,"25-29",-10,"","",null,"25-29",-10,"",""]
["30-34",2.7,1.8,3.5,null,"30-34",-10,"","",null,null,"30-34",-10,"","",null,"30-34",-10,"","",null,"30-34",-10,"","",null,"30-34",-10,"","",null,"30-34",-10,"","",null,"30-34",-10,"",""]
["35-39",-10,"","",null,"35-39",-10,"","",null,null,"35-39",-10,"","",null,"35-39",-10,"","",null,"35-39",-10,"","",null,"35-39",-10,"","",null,"35-39",-10,"","",null,"35-39",-10,"",""]
["40-44",-10,"","",null,"40-44",-10,"","",null,null,"40-44",-10,"","",null,"40-44",-10,"","",null,"40-44",-10,"","",null,"40-44",-10,"","",null,"40-44",-10,"","",null,"40-44",-10,"",""]
["45-49",-10,"","",null,"45-49",-10,"","",null,null,"45-49",-10,"","",null,"45-49",-10,"","",null,"45-49",-10,"","",null,"45-49",-10,"","",null,"45-49",-10,"","",null,"45-49",-10,"",""]
["50-54",-10,"","",{"$f":"IF(P49>K49,AA49,\"\")","v":""},"50-54",{"$f":"IF(U49>L49,C49,-10)","v":-10},{"$f":"IF(U49>L49,AE49,\"\")","v":""},{"$f":"IF(U49>L49,AF49,\"\")","v":""},null,null,"50-54",-10,"","",{"$f":"IF(AA49>V49,AL49,\"\")","v":""},"50-54",-10,"","",null,"50-54",-10,"","",{"$f":"IF(AK49>AF49,AV49,\"\")","v":""},"50-54",-10,"","",null,"50-54",-10,"","",{"$f":"IF(AU49>AP49,BF49,\"\")","v":""},"50-54",-10,"",""]
["55-59",-10,"","",{"$f":"IF(P50>K50,AA50,\"\")","v":""},"55-59",{"$f":"IF(U50>L50,C50,-10)","v":-10},{"$f":"IF(U50>L50,AE50,\"\")","v":""},{"$f":"IF(U50>L50,AF50,\"\")","v":""},null,null,"55-59",-10,"","",{"$f":"IF(AA50>V50,AL50,\"\")","v":""},"55-59",-10,"","",null,"55-59",-10,"","",{"$f":"IF(AK50>AF50,AV50,\"\")","v":""},"55-59",-10,"","",null,"55-59",-10,"","",{"$f":"IF(AU50>AP50,BF50,\"\")","v":""},"55-59",-10,"",""]
["60-64",-10,"","",null,"60-64",8.3000000000000007,3.1,4.3,null,null,"60-64",-10,"","",null,"60-64",-10,"","",null,"60-64",-10,{"$f":"IF(Q51<AM51,AA51,\"\")","v":""},"",null,"60-64",-10,"","",null,"60-64",-10,"","",null,"60-64",-10,"",""]
["65-69",-10,"","",{"$f":"IF(P52>K52,AA52,\"\")","v":""},"65-69",-10,"","",null,null,"65-69",-10,"","",{"$f":"IF(AA52>V52,AL52,\"\")","v":""},"65-69",-10,"","",null,"65-69",-10,"","",{"$f":"IF(AK52>AF52,AV52,\"\")","v":""},"65-69",-10,"","",null,"65-69",-10,"","",{"$f":"IF(AU52>AP52,BF52,\"\")","v":""},"65-69",-10,"",""]
["70-74",-10,"","",{"$f":"IF(P53>K53,AA53,\"\")","v":""},"70-74",-10,"","",null,null,"70-74",-10,"","",{"$f":"IF(AA53>V53,AL53,\"\")","v":""},"70-74",-10,"","",null,"70-74",19.100000000000001,5.7,7.4,{"$f":"IF(AK53>AF53,AV53,\"\")","v":""},"70-74",-10,"","",null,"70-74",-10,"","",{"$f":"IF(AU53>AP53,BF53,\"\")","v":""},"70-74",-10,"",""]
[]
[]
[]
[]
["EASR chart titles:"]
["Males",{"$f":"\"All cause mortality, males all ages, \"&E8&\", 2012\"","v":"All cause mortality, males all ages, Coastal and Countryside local authorities, 2012"}]
["Females",{"$f":"\"All cause mortality, females all ages, \"&E8&\", 2012\"","v":"All cause mortality, females all ages, Coastal and Countryside local authorities, 2012"}]
[null,{"$f":"IF(D29=D24,\"*Note: not all local authorities are labelled on the axis\",IF(D29=6.1,\"*Note: not all local authorities are labelled on the axis\",\"\"))","v":"*Note: not all local authorities are labelled on the axis"}]
[]
["ASR chart titles:"]
["Males",{"$f":"\"All cause mortality & excess deaths, males under 75, \"&A36&\", \"&E8&\" group, 2012\"","v":"All cause mortality & excess deaths, males under 75, Isle of Anglesey, Coastal and Countryside local authorities group, 2012"}]
["Females",{"$f":"\"All cause mortality & excess deaths, females under 75, \"&A36&\", \"&E8&\" group, 2012\"","v":"All cause mortality & excess deaths, females under 75, Isle of Anglesey, Coastal and Countryside local authorities group, 2012"}]
[]
[]
["ASR WALES chart titles:"]
["Males",{"$f":"\"All cause mortality & excess deaths, males under 75, \"&A36&\" and \"&E10&\" , 2012\"","v":"All cause mortality & excess deaths, males under 75, Isle of Anglesey and Wales , 2012"}]
["Females",{"$f":"\"All cause mortality & excess deaths, females under 75, \"&A36&\" and \"&E10&\", 2012\"","v":"All cause mortality & excess deaths, females under 75, Isle of Anglesey and Wales, 2012"}]

{"sheet":"EASR Charts Controls","index":5,"n_rows":111,"n_cols":30,"rows_kept":111,"cut":false,"hidden":true,"merged":[]}
["LAs ordered from Best in class to worst",null,null,null,null,null,null,null,null,null,null,null,null,null,{"$f":"CONCATENATE('Controls Sheet'!A36,\" (\",ROUND(VLOOKUP('Controls Sheet'!A36,'EASR lookup'!C5:I273,6,FALSE),0),\")\")","v":"Isle of Anglesey (637)"},null,null,null,null,null,null,{"$f":"CONCATENATE('Controls Sheet'!A36,\" (\",ROUND(VLOOKUP('Controls Sheet'!A36,'EASR lookup'!C5:I273,7,FALSE),0),\")\")","v":"Isle of Anglesey (431)"}]
["Males",null,null,null,null,null,"Females",null,null,null,null,null,null,null,"Males",null,null,null,null,null,null,"Females"]
[1.1000000000000001,5.7,6.1,7.11,7.12,null,1.1000000000000001,5.7,6.1,7.11,7.12,null,null,null,"LA","EASR","ldiff","udiff","Selected LA EASR",{"$f":"\"Best 5 in peer group combined (\"&'Controls Sheet'!G8&\")\"","v":"Best 5 in peer group combined (502)"},"Wales (666)","LA","EASR","ldiff","udiff","Selected LA EASR",{"$f":"\"Best 5 in peer group combined (\"&'Controls Sheet'!H8&\")\"","v":"Best 5 in peer group combined (360)"},"Wales (485)","Number of rows",{"$f":"VLOOKUP('Controls Sheet'!D8,'Controls Sheet'!$D$2:$G$6,4,FALSE)","v":54}]
["Southend-on-Sea","East Cambridgeshire","Christchurch","Redcar and Cleveland","Banbridge",null,"Exeter","Cotswold","Purbeck","North Tyneside","Larne",null,null,null,{"$f":"IF(INDEX($A$4:$E$111,,'Controls Sheet'!$F$8)=0,\"\",INDEX($A$4:$E$111,,'Controls Sheet'!$F$8))","v":"Christchurch"},{"$f":"IF(ISERROR(VLOOKUP($O4,'EASR lookup'!$C$5:$I$273,6,FALSE)),\"\",VLOOKUP($O4,'EASR lookup'!$C$5:$I$273,6,FALSE))","v":438.1},{"$f":"IF(O4='Controls Sheet'!$C$8,VLOOKUP(O4,'EASR lookup'!$C$5:$M$273,8,FALSE),\"\")","v":""},{"$f":"IF(O4='Controls Sheet'!$C$8,VLOOKUP(O4,'EASR lookup'!$C$5:$M$273,9,FALSE),\"\")","v":""},{"$f":"IF(O4='Controls Sheet'!$C$8,'EASR Charts Controls'!P4,\"\")","v":""},{"$f":"IF(P4=\"\",\"\",VLOOKUP('Controls Sheet'!$D$8,'Controls Sheet'!$D$2:$I$6,5,FALSE))","v":501.9},{"$f":"IF(P4=\"\",\"\",666.4)","v":666.4},{"$f":"IF(INDEX($G$4:$K$111,,'Controls Sheet'!$F$8)=0,\"\",INDEX($G$4:$K$111,,'Controls Sheet'!$F$8))","v":"Purbeck"},{"$f":"IF(ISERROR(VLOOKUP($V4,'EASR lookup'!$C$5:$I$273,7,FALSE)),\"\",VLOOKUP($V4,'EASR lookup'!$C$5:$I$273,7,FALSE))","v":304.2},{"$f":"IF(V4='Controls Sheet'!$C$8,VLOOKUP(V4,'EASR lookup'!$C$5:$M$273,10,FALSE),\"\")","v":""},{"$f":"IF(V4='Controls Sheet'!$C$8,VLOOKUP(V4,'EASR lookup'!$C$5:$M$273,11,FALSE),\"\")","v":""},{"$f":"IF(V4='Controls Sheet'!$C$8,'EASR Charts Controls'!W4,\"\")","v":""},{"$f":"IF(W4=\"\",\"\",VLOOKUP('Controls Sheet'!$D$8,'Controls Sheet'!$D$2:$I$6,6,FALSE))","v":360.3},{"$f":"IF(W4=\"\",\"\",484.5)","v":484.5}]
["Eastbourne","South Northamptonshire","Purbeck","Darlington","Carrickfergus",null,"Norwich","East Dorset","Christchurch","Darlington","Erewash",null,null,null,{"$f":"IF(INDEX($A$4:$E$111,,'Controls Sheet'!$F$8)=0,\"\",INDEX($A$4:$E$111,,'Controls Sheet'!$F$8))","v":"Purbeck"},{"$f":"IF(ISERROR(VLOOKUP($O5,'EASR lookup'!$C$5:$I$273,6,FALSE)),\"\",VLOOKUP($O5,'EASR lookup'!$C$5:$I$273,6,FALSE))","v":494.2},{"$f":"IF(O5='Controls Sheet'!$C$8,VLOOKUP(O5,'EASR lookup'!$C$5:$M$273,8,FALSE),\"\")","v":""},{"$f":"IF(O5='Controls Sheet'!$C$8,VLOOKUP(O5,'EASR lookup'!$C$5:$M$273,9,FALSE),\"\")","v":""},{"$f":"IF(O5='Controls Sheet'!$C$8,'EASR Charts Controls'!P5,\"\")","v":""},{"$f":"IF(P5=\"\",\"\",VLOOKUP('Controls Sheet'!$D$8,'Controls Sheet'!$D$2:$I$6,5,FALSE))","v":501.9},{"$f":"IF(P5=\"\",\"\",666.4)","v":666.4},{"$f":"IF(INDEX($G$4:$K$111,,'Controls Sheet'!$F$8)=0,\"\",INDEX($G$4:$K$111,,'Controls Sheet'!$F$8))","v":"Christchurch"},{"$f":"IF(ISERROR(VLOOKUP($V5,'EASR lookup'!$C$5:$I$273,7,FALSE)),\"\",VLOOKUP($V5,'EASR lookup'!$C$5:$I$273,7,FALSE))","v":330.7},{"$f":"IF(V5='Controls Sheet'!$C$8,VLOOKUP(V5,'EASR lookup'!$C$5:$M$273,10,FALSE),\"\")","v":""},{"$f":"IF(V5='Controls Sheet'!$C$8,VLOOKUP(V5,'EASR lookup'!$C$5:$M$273,11,FALSE),\"\")","v":""},{"$f":"IF(V5='Controls Sheet'!$C$8,'EASR Charts Controls'!W5,\"\")","v":""},{"$f":"IF(W5=\"\",\"\",VLOOKUP('Controls Sheet'!$D$8,'Controls Sheet'!$D$2:$I$6,6,FALSE))","v":360.3},{"$f":"IF(W5=\"\",\"\",484.5)","v":484.5}]
["Exeter","Babergh","South Lakeland","East Lothian","North East Derbyshire",null,"Worthing","East Cambridgeshire","Chichester","Barrow-in-Furness","Havant",null,null,null,{"$f":"IF(INDEX($A$4:$E$111,,'Controls Sheet'!$F$8)=0,\"\",INDEX($A$4:$E$111,,'Controls Sheet'!$F$8))","v":"South Lakeland"},{"$f":"IF(ISERROR(VLOOKUP($O6,'EASR lookup'!$C$5:$I$273,6,FALSE)),\"\",VLOOKUP($O6,'EASR lookup'!$C$5:$I$273,6,FALSE))","v":513.70000000000005},{"$f":"IF(O6='Controls Sheet'!$C$8,VLOOKUP(O6,'EASR lookup'!$C$5:$M$273,8,FALSE),\"\")","v":""},{"$f":"IF(O6='Controls Sheet'!$C$8,VLOOKUP(O6,'EASR lookup'!$C$5:$M$273,9,FALSE),\"\")","v":""},{"$f":"IF(O6='Controls Sheet'!$C$8,'EASR Charts Controls'!P6,\"\")","v":""},{"$f":"IF(P6=\"\",\"\",VLOOKUP('Controls Sheet'!$D$8,'Controls Sheet'!$D$2:$I$6,5,FALSE))","v":501.9},666.4,{"$f":"IF(INDEX($G$4:$K$111,,'Controls Sheet'!$F$8)=0,\"\",INDEX($G$4:$K$111,,'Controls Sheet'!$F$8))","v":"Chichester"},{"$f":"IF(ISERROR(VLOOKUP($V6,'EASR lookup'!$C$5:$I$273,7,FALSE)),\"\",VLOOKUP($V6,'EASR lookup'!$C$5:$I$273,7,FALSE))","v":377.6},{"$f":"IF(V6='Controls Sheet'!$C$8,VLOOKUP(V6,'EASR lookup'!$C$5:$M$273,10,FALSE),\"\")","v":""},{"$f":"IF(V6='Controls Sheet'!$C$8,VLOOKUP(V6,'EASR lookup'!$C$5:$M$273,11,FALSE),\"\")","v":""},{"$f":"IF(V6='Controls Sheet'!$C$8,'EASR Charts Controls'!W6,\"\")","v":""},{"$f":"IF(W6=\"\",\"\",VLOOKUP('Controls Sheet'!$D$8,'Controls Sheet'!$D$2:$I$6,6,FALSE))","v":360.3},484.5]
["Norwich","Mid Suffolk","Craven","Wirral","Swale",null,"Bristol","Rutland","West Devon","Copeland","Amber Valley",null,null,null,{"$f":"IF(INDEX($A$4:$E$111,,'Controls Sheet'!$F$8)=0,\"\",INDEX($A$4:$E$111,,'Controls Sheet'!$F$8))","v":"Craven"},{"$f":"IF(ISERROR(VLOOKUP($O7,'EASR lookup'!$C$5:$I$273,6,FALSE)),\"\",VLOOKUP($O7,'EASR lookup'!$C$5:$I$273,6,FALSE))","v":514.79999999999995},{"$f":"IF(O7='Controls Sheet'!$C$8,VLOOKUP(O7,'EASR lookup'!$C$5:$M$273,8,FALSE),\"\")","v":""},{"$f":"IF(O7='Controls Sheet'!$C$8,VLOOKUP(O7,'EASR lookup'!$C$5:$M$273,9,FALSE),\"\")","v":""},{"$f":"IF(O7='Controls Sheet'!$C$8,'EASR Charts Controls'!P7,\"\")","v":""},{"$f":"IF(P7=\"\",\"\",VLOOKUP('Controls Sheet'!$D$8,'Controls Sheet'!$D$2:$I$6,5,FALSE))","v":501.9},666.4,{"$f":"IF(INDEX($G$4:$K$111,,'Controls Sheet'!$F$8)=0,\"\",INDEX($G$4:$K$111,,'Controls Sheet'!$F$8))","v":"West Devon"},{"$f":"IF(ISERROR(VLOOKUP($V7,'EASR lookup'!$C$5:$I$273,7,FALSE)),\"\",VLOOKUP($V7,'EASR lookup'!$C$5:$I$273,7,FALSE))","v":377.8},{"$f":"IF(V7='Controls Sheet'!$C$8,VLOOKUP(V7,'EASR lookup'!$C$5:$M$273,10,FALSE),\"\")","v":""},{"$f":"IF(V7='Controls Sheet'!$C$8,VLOOKUP(V7,'EASR lookup'!$C$5:$M$273,11,FALSE),\"\")","v":""},{"$f":"IF(V7='Controls Sheet'!$C$8,'EASR Charts Controls'!W7,\"\")","v":""},{"$f":"IF(W7=\"\",\"\",VLOOKUP('Controls Sheet'!$D$8,'Controls Sheet'!$D$2:$I$6,6,FALSE))","v":360.3},484.5]
["Bournemouth","East Dorset","Chichester","North Tyneside","Havant",null,"Southend-on-Sea","North Dorset","South Hams","Sefton","Dudley",null,null,null,{"$f":"IF(INDEX($A$4:$E$111,,'Controls Sheet'!$F$8)=0,\"\",INDEX($A$4:$E$111,,'Controls Sheet'!$F$8))","v":"Chichester"},{"$f":"IF(ISERROR(VLOOKUP($O8,'EASR lookup'!$C$5:$I$273,6,FALSE)),\"\",VLOOKUP($O8,'EASR lookup'!$C$5:$I$273,6,FALSE))","v":521.4},{"$f":"IF(O8='Controls Sheet'!$C$8,VLOOKUP(O8,'EASR lookup'!$C$5:$M$273,8,FALSE),\"\")","v":""},{"$f":"IF(O8='Controls Sheet'!$C$8,VLOOKUP(O8,'EASR lookup'!$C$5:$M$273,9,FALSE),\"\")","v":""},{"$f":"IF(O8='Controls Sheet'!$C$8,'EASR Charts Controls'!P8,\"\")","v":""},{"$f":"IF(P8=\"\",\"\",VLOOKUP('Controls Sheet'!$D$8,'Controls Sheet'!$D$2:$I$6,5,FALSE))","v":501.9},666.4,{"$f":"IF(INDEX($G$4:$K$111,,'Controls Sheet'!$F$8)=0,\"\",INDEX($G$4:$K$111,,'Controls Sheet'!$F$8))","v":"South Hams"},{"$f":"IF(ISERROR(VLOOKUP($V8,'EASR lookup'!$C$5:$I$273,7,FALSE)),\"\",VLOOKUP($V8,'EASR lookup'!$C$5:$I$273,7,FALSE))","v":379.5},{"$f":"IF(V8='Controls Sheet'!$C$8,VLOOKUP(V8,'EASR lookup'!$C$5:$M$273,10,FALSE),\"\")","v":""},{"$f":"IF(V8='Controls Sheet'!$C$8,VLOOKUP(V8,'EASR lookup'!$C$5:$M$273,11,FALSE),\"\")","v":""},{"$f":"IF(V8='Controls Sheet'!$C$8,'EASR Charts Controls'!W8,\"\")","v":""},{"$f":"IF(W8=\"\",\"\",VLOOKUP('Controls Sheet'!$D$8,'Controls Sheet'!$D$2:$I$6,6,FALSE))","v":360.3},484.5]
["Sheffield","Mid Devon","South Hams","Merthyr Tydfil","Tamworth",null,"Eastbourne","South Norfolk","West Dorset","Swansea","East Staffordshire",null,null,null,{"$f":"IF(INDEX($A$4:$E$111,,'Controls Sheet'!$F$8)=0,\"\",INDEX($A$4:$E$111,,'Controls Sheet'!$F$8))","v":"South Hams"},{"$f":"IF(ISERROR(VLOOKUP($O9,'EASR lookup'!$C$5:$I$273,6,FALSE)),\"\",VLOOKUP($O9,'EASR lookup'!$C$5:$I$273,6,FALSE))","v":538.6},{"$f":"IF(O9='Controls Sheet'!$C$8,VLOOKUP(O9,'EASR lookup'!$C$5:$M$273,8,FALSE),\"\")","v":""},{"$f":"IF(O9='Controls Sheet'!$C$8,VLOOKUP(O9,'EASR lookup'!$C$5:$M$273,9,FALSE),\"\")","v":""},{"$f":"IF(O9='Controls Sheet'!$C$8,'EASR Charts Controls'!P9,\"\")","v":""},{"$f":"IF(P9=\"\",\"\",VLOOKUP('Controls Sheet'!$D$8,'Controls Sheet'!$D$2:$I$6,5,FALSE))","v":501.9},666.4,{"$f":"IF(INDEX($G$4:$K$111,,'Controls Sheet'!$F$8)=0,\"\",INDEX($G$4:$K$111,,'Controls Sheet'!$F$8))","v":"West Dorset"},{"$f":"IF(ISERROR(VLOOKUP($V9,'EASR lookup'!$C$5:$I$273,7,FALSE)),\"\",VLOOKUP($V9,'EASR lookup'!$C$5:$I$273,7,FALSE))","v":381.5},{"$f":"IF(V9='Controls Sheet'!$C$8,VLOOKUP(V9,'EASR lookup'!$C$5:$M$273,10,FALSE),\"\")","v":""},{"$f":"IF(V9='Controls Sheet'!$C$8,VLOOKUP(V9,'EASR lookup'!$C$5:$M$273,11,FALSE),\"\")","v":""},{"$f":"IF(V9='Controls Sheet'!$C$8,'EASR Charts Controls'!W9,\"\")","v":""},{"$f":"IF(W9=\"\",\"\",VLOOKUP('Controls Sheet'!$D$8,'Controls Sheet'!$D$2:$I$6,6,FALSE))","v":360.3},484.5]
["Portsmouth","New Forest","West Dorset","South Ayrshire","Amber Valley",null,"Brighton and Hove","Hambleton","North Norfolk","Redcar and Cleveland","Banbridge",null,null,null,{"$f":"IF(INDEX($A$4:$E$111,,'Controls Sheet'!$F$8)=0,\"\",INDEX($A$4:$E$111,,'Controls Sheet'!$F$8))","v":"West Dorset"},{"$f":"IF(ISERROR(VLOOKUP($O10,'EASR lookup'!$C$5:$I$273,6,FALSE)),\"\",VLOOKUP($O10,'EASR lookup'!$C$5:$I$273,6,FALSE))","v":540.70000000000005},{"$f":"IF(O10='Controls Sheet'!$C$8,VLOOKUP(O10,'EASR lookup'!$C$5:$M$273,8,FALSE),\"\")","v":""},{"$f":"IF(O10='Controls Sheet'!$C$8,VLOOKUP(O10,'EASR lookup'!$C$5:$M$273,9,FALSE),\"\")","v":""},{"$f":"IF(O10='Controls Sheet'!$C$8,'EASR Charts Controls'!P10,\"\")","v":""},{"$f":"IF(P10=\"\",\"\",VLOOKUP('Controls Sheet'!$D$8,'Controls Sheet'!$D$2:$I$6,5,FALSE))","v":501.9},666.4,{"$f":"IF(INDEX($G$4:$K$111,,'Controls Sheet'!$F$8)=0,\"\",INDEX($G$4:$K$111,,'Controls Sheet'!$F$8))","v":"North Norfolk"},{"$f":"IF(ISERROR(VLOOKUP($V10,'EASR lookup'!$C$5:$I$273,7,FALSE)),\"\",VLOOKUP($V10,'EASR lookup'!$C$5:$I$273,7,FALSE))","v":383.7},{"$f":"IF(V10='Controls Sheet'!$C$8,VLOOKUP(V10,'EASR lookup'!$C$5:$M$273,10,FALSE),\"\")","v":""},{"$f":"IF(V10='Controls Sheet'!$C$8,VLOOKUP(V10,'EASR lookup'!$C$5:$M$273,11,FALSE),\"\")","v":""},{"$f":"IF(V10='Controls Sheet'!$C$8,'EASR Charts Controls'!W10,\"\")","v":""},{"$f":"IF(W10=\"\",\"\",VLOOKUP('Controls Sheet'!$D$8,'Controls Sheet'!$D$2:$I$6,6,FALSE))","v":360.3},484.5]
["Lincoln","South Norfolk","Eden","Sefton","Erewash",null,"Cardiff","New Forest","Ceredigion","Wirral","Lisburn",null,null,null,{"$f":"IF(INDEX($A$4:$E$111,,'Controls Sheet'!$F$8)=0,\"\",INDEX($A$4:$E$111,,'Controls Sheet'!$F$8))","v":"Eden"},{"$f":"IF(ISERROR(VLOOKUP($O11,'EASR lookup'!$C$5:$I$273,6,FALSE)),\"\",VLOOKUP($O11,'EASR lookup'!$C$5:$I$273,6,FALSE))","v":543.29999999999995},{"$f":"IF(O11='Controls Sheet'!$C$8,VLOOKUP(O11,'EASR lookup'!$C$5:$M$273,8,FALSE),\"\")","v":""},{"$f":"IF(O11='Controls Sheet'!$C$8,VLOOKUP(O11,'EASR lookup'!$C$5:$M$273,9,FALSE),\"\")","v":""},{"$f":"IF(O11='Controls Sheet'!$C$8,'EASR Charts Controls'!P11,\"\")","v":""},{"$f":"IF(P11=\"\",\"\",VLOOKUP('Controls Sheet'!$D$8,'Controls Sheet'!$D$2:$I$6,5,FALSE))","v":501.9},666.4,{"$f":"IF(INDEX($G$4:$K$111,,'Controls Sheet'!$F$8)=0,\"\",INDEX($G$4:$K$111,,'Controls Sheet'!$F$8))","v":"Ceredigion"},{"$f":"IF(ISERROR(VLOOKUP($V11,'EASR lookup'!$C$5:$I$273,7,FALSE)),\"\",VLOOKUP($V11,'EASR lookup'!$C$5:$I$273,7,FALSE))","v":389},{"$f":"IF(V11='Controls Sheet'!$C$8,VLOOKUP(V11,'EASR lookup'!$C$5:$M$273,10,FALSE),\"\")","v":""},{"$f":"IF(V11='Controls Sheet'!$C$8,VLOOKUP(V11,'EASR lookup'!$C$5:$M$273,11,FALSE),\"\")","v":""},{"$f":"IF(V11='Controls Sheet'!$C$8,'EASR Charts Controls'!W11,\"\")","v":""},{"$f":"IF(W11=\"\",\"\",VLOOKUP('Controls Sheet'!$D$8,'Controls Sheet'!$D$2:$I$6,6,FALSE))","v":360.3},484.5]
["Bristol","Bath and North East Somerset","Ceredigion","Barrow-in-Furness","East Staffordshire",null,"Bournemouth","Eastleigh","Eden","Newport","Swale",null,null,null,{"$f":"IF(INDEX($A$4:$E$111,,'Controls Sheet'!$F$8)=0,\"\",INDEX($A$4:$E$111,,'Controls Sheet'!$F$8))","v":"Ceredigion"},{"$f":"IF(ISERROR(VLOOKUP($O12,'EASR lookup'!$C$5:$I$273,6,FALSE)),\"\",VLOOKUP($O12,'EASR lookup'!$C$5:$I$273,6,FALSE))","v":547.70000000000005},{"$f":"IF(O12='Controls Sheet'!$C$8,VLOOKUP(O12,'EASR lookup'!$C$5:$M$273,8,FALSE),\"\")","v":""},{"$f":"IF(O12='Controls Sheet'!$C$8,VLOOKUP(O12,'EASR lookup'!$C$5:$M$273,9,FALSE),\"\")","v":""},{"$f":"IF(O12='Controls Sheet'!$C$8,'EASR Charts Controls'!P12,\"\")","v":""},{"$f":"IF(P12=\"\",\"\",VLOOKUP('Controls Sheet'!$D$8,'Controls Sheet'!$D$2:$I$6,5,FALSE))","v":501.9},666.4,{"$f":"IF(INDEX($G$4:$K$111,,'Controls Sheet'!$F$8)=0,\"\",INDEX($G$4:$K$111,,'Controls Sheet'!$F$8))","v":"Eden"},{"$f":"IF(ISERROR(VLOOKUP($V12,'EASR lookup'!$C$5:$I$273,7,FALSE)),\"\",VLOOKUP($V12,'EASR lookup'!$C$5:$I$273,7,FALSE))","v":393.2},{"$f":"IF(V12='Controls Sheet'!$C$8,VLOOKUP(V12,'EASR lookup'!$C$5:$M$273,10,FALSE),\"\")","v":""},{"$f":"IF(V12='Controls Sheet'!$C$8,VLOOKUP(V12,'EASR lookup'!$C$5:$M$273,11,FALSE),\"\")","v":""},{"$f":"IF(V12='Controls Sheet'!$C$8,'EASR Charts Controls'!W12,\"\")","v":""},{"$f":"IF(W12=\"\",\"\",VLOOKUP('Controls Sheet'!$D$8,'Controls Sheet'!$D$2:$I$6,6,FALSE))","v":360.3},484.5]
["Southampton","Eastleigh","East Devon","County Durham","Bassetlaw",null,"Sheffield","Mid Suffolk","Rother","St. Helens","North Lincolnshire",null,null,null,{"$f":"IF(INDEX($A$4:$E$111,,'Controls Sheet'!$F$8)=0,\"\",INDEX($A$4:$E$111,,'Controls Sheet'!$F$8))","v":"East Devon"},{"$f":"IF(ISERROR(VLOOKUP($O13,'EASR lookup'!$C$5:$I$273,6,FALSE)),\"\",VLOOKUP($O13,'EASR lookup'!$C$5:$I$273,6,FALSE))","v":558},{"$f":"IF(O13='Controls Sheet'!$C$8,VLOOKUP(O13,'EASR lookup'!$C$5:$M$273,8,FALSE),\"\")","v":""},{"$f":"IF(O13='Controls Sheet'!$C$8,VLOOKUP(O13,'EASR lookup'!$C$5:$M$273,9,FALSE),\"\")","v":""},{"$f":"IF(O13='Controls Sheet'!$C$8,'EASR Charts Controls'!P13,\"\")","v":""},{"$f":"IF(P13=\"\",\"\",VLOOKUP('Controls Sheet'!$D$8,'Controls Sheet'!$D$2:$I$6,5,FALSE))","v":501.9},666.4,{"$f":"IF(INDEX($G$4:$K$111,,'Controls Sheet'!$F$8)=0,\"\",INDEX($G$4:$K$111,,'Controls Sheet'!$F$8))","v":"Rother"},{"$f":"IF(ISERROR(VLOOKUP($V13,'EASR lookup'!$C$5:$I$273,7,FALSE)),\"\",VLOOKUP($V13,'EASR lookup'!$C$5:$I$273,7,FALSE))","v":393.4},{"$f":"IF(V13='Controls Sheet'!$C$8,VLOOKUP(V13,'EASR lookup'!$C$5:$M$273,10,FALSE),\"\")","v":""},{"$f":"IF(V13='Controls Sheet'!$C$8,VLOOKUP(V13,'EASR lookup'!$C$5:$M$273,11,FALSE),\"\")","v":""},{"$f":"IF(V13='Controls Sheet'!$C$8,'EASR Charts Controls'!W13,\"\")","v":""},{"$f":"IF(W13=\"\",\"\",VLOOKUP('Controls Sheet'!$D$8,'Controls Sheet'!$D$2:$I$6,6,FALSE))","v":360.3},484.5]
["Brighton and Hove","Ashford","Powys","Hartlepool","Ballymena",null,"Lancaster","Stratford-on-Avon","Craven","Hartlepool","Redditch",null,null,null,{"$f":"IF(INDEX($A$4:$E$111,,'Controls Sheet'!$F$8)=0,\"\",INDEX($A$4:$E$111,,'Controls Sheet'!$F$8))","v":"Powys"},{"$f":"IF(ISERROR(VLOOKUP($O14,'EASR lookup'!$C$5:$I$273,6,FALSE)),\"\",VLOOKUP($O14,'EASR lookup'!$C$5:$I$273,6,FALSE))","v":559},{"$f":"IF(O14='Controls Sheet'!$C$8,VLOOKUP(O14,'EASR lookup'!$C$5:$M$273,8,FALSE),\"\")","v":""},{"$f":"IF(O14='Controls Sheet'!$C$8,VLOOKUP(O14,'EASR lookup'!$C$5:$M$273,9,FALSE),\"\")","v":""},{"$f":"IF(O14='Controls Sheet'!$C$8,'EASR Charts Controls'!P14,\"\")","v":""},{"$f":"IF(P14=\"\",\"\",VLOOKUP('Controls Sheet'!$D$8,'Controls Sheet'!$D$2:$I$6,5,FALSE))","v":501.9},666.4,{"$f":"IF(INDEX($G$4:$K$111,,'Controls Sheet'!$F$8)=0,\"\",INDEX($G$4:$K$111,,'Controls Sheet'!$F$8))","v":"Craven"},{"$f":"IF(ISERROR(VLOOKUP($V14,'EASR lookup'!$C$5:$I$273,7,FALSE)),\"\",VLOOKUP($V14,'EASR lookup'!$C$5:$I$273,7,FALSE))","v":398.5},{"$f":"IF(V14='Controls Sheet'!$C$8,VLOOKUP(V14,'EASR lookup'!$C$5:$M$273,10,FALSE),\"\")","v":""},{"$f":"IF(V14='Controls Sheet'!$C$8,VLOOKUP(V14,'EASR lookup'!$C$5:$M$273,11,FALSE),\"\")","v":""},{"$f":"IF(V14='Controls Sheet'!$C$8,'EASR Charts Controls'!W14,\"\")","v":""},{"$f":"IF(W14=\"\",\"\",VLOOKUP('Controls Sheet'!$D$8,'Controls Sheet'!$D$2:$I$6,6,FALSE))","v":360.3},484.5]
["Worthing","Wealden","Orkney Islands","Caerphilly","Redditch",null,"Southampton","Lewes","East Devon","County Durham","Ballymena",null,null,null,{"$f":"IF(INDEX($A$4:$E$111,,'Controls Sheet'!$F$8)=0,\"\",INDEX($A$4:$E$111,,'Controls Sheet'!$F$8))","v":"Orkney Islands"},{"$f":"IF(ISERROR(VLOOKUP($O15,'EASR lookup'!$C$5:$I$273,6,FALSE)),\"\",VLOOKUP($O15,'EASR lookup'!$C$5:$I$273,6,FALSE))","v":562.20000000000005},{"$f":"IF(O15='Controls Sheet'!$C$8,VLOOKUP(O15,'EASR lookup'!$C$5:$M$273,8,FALSE),\"\")","v":""},{"$f":"IF(O15='Controls Sheet'!$C$8,VLOOKUP(O15,'EASR lookup'!$C$5:$M$273,9,FALSE),\"\")","v":""},{"$f":"IF(O15='Controls Sheet'!$C$8,'EASR Charts Controls'!P15,\"\")","v":""},{"$f":"IF(P15=\"\",\"\",VLOOKUP('Controls Sheet'!$D$8,'Controls Sheet'!$D$2:$I$6,5,FALSE))","v":501.9},666.4,{"$f":"IF(INDEX($G$4:$K$111,,'Controls Sheet'!$F$8)=0,\"\",INDEX($G$4:$K$111,,'Controls Sheet'!$F$8))","v":"East Devon"},{"$f":"IF(ISERROR(VLOOKUP($V15,'EASR lookup'!$C$5:$I$273,7,FALSE)),\"\",VLOOKUP($V15,'EASR lookup'!$C$5:$I$273,7,FALSE))","v":404},{"$f":"IF(V15='Controls Sheet'!$C$8,VLOOKUP(V15,'EASR lookup'!$C$5:$M$273,10,FALSE),\"\")","v":""},{"$f":"IF(V15='Controls Sheet'!$C$8,VLOOKUP(V15,'EASR lookup'!$C$5:$M$273,11,FALSE),\"\")","v":""},{"$f":"IF(V15='Controls Sheet'!$C$8,'EASR Charts Controls'!W15,\"\")","v":""},{"$f":"IF(W15=\"\",\"\",VLOOKUP('Controls Sheet'!$D$8,'Controls Sheet'!$D$2:$I$6,6,FALSE))","v":360.3},484.5]
["Hastings","Suffolk Coastal","Torridge","Copeland","Dudley",null,"Leeds","Rushcliffe","West Somerset","Caerphilly","Tamworth",null,null,null,{"$f":"IF(INDEX($A$4:$E$111,,'Controls Sheet'!$F$8)=0,\"\",INDEX($A$4:$E$111,,'Controls Sheet'!$F$8))","v":"Torridge"},{"$f":"IF(ISERROR(VLOOKUP($O16,'EASR lookup'!$C$5:$I$273,6,FALSE)),\"\",VLOOKUP($O16,'EASR lookup'!$C$5:$I$273,6,FALSE))","v":573.20000000000005},{"$f":"IF(O16='Controls Sheet'!$C$8,VLOOKUP(O16,'EASR lookup'!$C$5:$M$273,8,FALSE),\"\")","v":""},{"$f":"IF(O16='Controls Sheet'!$C$8,VLOOKUP(O16,'EASR lookup'!$C$5:$M$273,9,FALSE),\"\")","v":""},{"$f":"IF(O16='Controls Sheet'!$C$8,'EASR Charts Controls'!P16,\"\")","v":""},{"$f":"IF(P16=\"\",\"\",VLOOKUP('Controls Sheet'!$D$8,'Controls Sheet'!$D$2:$I$6,5,FALSE))","v":501.9},666.4,{"$f":"IF(INDEX($G$4:$K$111,,'Controls Sheet'!$F$8)=0,\"\",INDEX($G$4:$K$111,,'Controls Sheet'!$F$8))","v":"West Somerset"},{"$f":"IF(ISERROR(VLOOKUP($V16,'EASR lookup'!$C$5:$I$273,7,FALSE)),\"\",VLOOKUP($V16,'EASR lookup'!$C$5:$I$273,7,FALSE))","v":405.2},{"$f":"IF(V16='Controls Sheet'!$C$8,VLOOKUP(V16,'EASR lookup'!$C$5:$M$273,10,FALSE),\"\")","v":""},{"$f":"IF(V16='Controls Sheet'!$C$8,VLOOKUP(V16,'EASR lookup'!$C$5:$M$273,11,FALSE),\"\")","v":""},{"$f":"IF(V16='Controls Sheet'!$C$8,'EASR Charts Controls'!W16,\"\")","v":""},{"$f":"IF(W16=\"\",\"\",VLOOKUP('Controls Sheet'!$D$8,'Controls Sheet'!$D$2:$I$6,6,FALSE))","v":360.3},484.5]
["Cardiff","South Gloucestershire","Rother","Gateshead","Ards",null,"Portsmouth","Mendip","South Lakeland","East Lothian","Cannock Chase",null,null,null,{"$f":"IF(INDEX($A$4:$E$111,,'Controls Sheet'!$F$8)=0,\"\",INDEX($A$4:$E$111,,'Controls Sheet'!$F$8))","v":"Rother"},{"$f":"IF(ISERROR(VLOOKUP($O17,'EASR lookup'!$C$5:$I$273,6,FALSE)),\"\",VLOOKUP($O17,'EASR lookup'!$C$5:$I$273,6,FALSE))","v":579.1},{"$f":"IF(O17='Controls Sheet'!$C$8,VLOOKUP(O17,'EASR lookup'!$C$5:$M$273,8,FALSE),\"\")","v":""},{"$f":"IF(O17='Controls Sheet'!$C$8,VLOOKUP(O17,'EASR lookup'!$C$5:$M$273,9,FALSE),\"\")","v":""},{"$f":"IF(O17='Controls Sheet'!$C$8,'EASR Charts Controls'!P17,\"\")","v":""},{"$f":"IF(P17=\"\",\"\",VLOOKUP('Controls Sheet'!$D$8,'Controls Sheet'!$D$2:$I$6,5,FALSE))","v":501.9},666.4,{"$f":"IF(INDEX($G$4:$K$111,,'Controls Sheet'!$F$8)=0,\"\",INDEX($G$4:$K$111,,'Controls Sheet'!$F$8))","v":"South Lakeland"},{"$f":"IF(ISERROR(VLOOKUP($V17,'EASR lookup'!$C$5:$I$273,7,FALSE)),\"\",VLOOKUP($V17,'EASR lookup'!$C$5:$I$273,7,FALSE))","v":409.2},{"$f":"IF(V17='Controls Sheet'!$C$8,VLOOKUP(V17,'EASR lookup'!$C$5:$M$273,10,FALSE),\"\")","v":""},{"$f":"IF(V17='Controls Sheet'!$C$8,VLOOKUP(V17,'EASR lookup'!$C$5:$M$273,11,FALSE),\"\")","v":""},{"$f":"IF(V17='Controls Sheet'!$C$8,'EASR Charts Controls'!W17,\"\")","v":""},{"$f":"IF(W17=\"\",\"\",VLOOKUP('Controls Sheet'!$D$8,'Controls Sheet'!$D$2:$I$6,6,FALSE))","v":360.3},484.5]
["Plymouth","South Somerset","Isle of Wight","Newport","Flintshire",null,"Plymouth","Wealden","Shetland Islands","Midlothian","Newcastle-under-Lyme",null,null,null,{"$f":"IF(INDEX($A$4:$E$111,,'Controls Sheet'!$F$8)=0,\"\",INDEX($A$4:$E$111,,'Controls Sheet'!$F$8))","v":"Isle of Wight"},{"$f":"IF(ISERROR(VLOOKUP($O18,'EASR lookup'!$C$5:$I$273,6,FALSE)),\"\",VLOOKUP($O18,'EASR lookup'!$C$5:$I$273,6,FALSE))","v":587.1},{"$f":"IF(O18='Controls Sheet'!$C$8,VLOOKUP(O18,'EASR lookup'!$C$5:$M$273,8,FALSE),\"\")","v":""},{"$f":"IF(O18='Controls Sheet'!$C$8,VLOOKUP(O18,'EASR lookup'!$C$5:$M$273,9,FALSE),\"\")","v":""},{"$f":"IF(O18='Controls Sheet'!$C$8,'EASR Charts Controls'!P18,\"\")","v":""},{"$f":"IF(P18=\"\",\"\",VLOOKUP('Controls Sheet'!$D$8,'Controls Sheet'!$D$2:$I$6,5,FALSE))","v":501.9},666.4,{"$f":"IF(INDEX($G$4:$K$111,,'Controls Sheet'!$F$8)=0,\"\",INDEX($G$4:$K$111,,'Controls Sheet'!$F$8))","v":"Shetland Islands"},{"$f":"IF(ISERROR(VLOOKUP($V18,'EASR lookup'!$C$5:$I$273,7,FALSE)),\"\",VLOOKUP($V18,'EASR lookup'!$C$5:$I$273,7,FALSE))","v":413},{"$f":"IF(V18='Controls Sheet'!$C$8,VLOOKUP(V18,'EASR lookup'!$C$5:$M$273,10,FALSE),\"\")","v":""},{"$f":"IF(V18='Controls Sheet'!$C$8,VLOOKUP(V18,'EASR lookup'!$C$5:$M$273,11,FALSE),\"\")","v":""},{"$f":"IF(V18='Controls Sheet'!$C$8,'EASR Charts Controls'!W18,\"\")","v":""},{"$f":"IF(W18=\"\",\"\",VLOOKUP('Controls Sheet'!$D$8,'Controls Sheet'!$D$2:$I$6,6,FALSE))","v":360.3},484.5]
["Leeds","Richmondshire","Pembrokeshire","St. Helens","Newcastle-under-Lyme",null,"Edinburgh, City of","Blaby","Teignbridge","Torfaen","North East Derbyshire",null,null,null,{"$f":"IF(INDEX($A$4:$E$111,,'Controls Sheet'!$F$8)=0,\"\",INDEX($A$4:$E$111,,'Controls Sheet'!$F$8))","v":"Pembrokeshire"},{"$f":"IF(ISERROR(VLOOKUP($O19,'EASR lookup'!$C$5:$I$273,6,FALSE)),\"\",VLOOKUP($O19,'EASR lookup'!$C$5:$I$273,6,FALSE))","v":588.5},{"$f":"IF(O19='Controls Sheet'!$C$8,VLOOKUP(O19,'EASR lookup'!$C$5:$M$273,8,FALSE),\"\")","v":""},{"$f":"IF(O19='Controls Sheet'!$C$8,VLOOKUP(O19,'EASR lookup'!$C$5:$M$273,9,FALSE),\"\")","v":""},{"$f":"IF(O19='Controls Sheet'!$C$8,'EASR Charts Controls'!P19,\"\")","v":""},{"$f":"IF(P19=\"\",\"\",VLOOKUP('Controls Sheet'!$D$8,'Controls Sheet'!$D$2:$I$6,5,FALSE))","v":501.9},666.4,{"$f":"IF(INDEX($G$4:$K$111,,'Controls Sheet'!$F$8)=0,\"\",INDEX($G$4:$K$111,,'Controls Sheet'!$F$8))","v":"Teignbridge"},{"$f":"IF(ISERROR(VLOOKUP($V19,'EASR lookup'!$C$5:$I$273,7,FALSE)),\"\",VLOOKUP($V19,'EASR lookup'!$C$5:$I$273,7,FALSE))","v":417.1},{"$f":"IF(V19='Controls Sheet'!$C$8,VLOOKUP(V19,'EASR lookup'!$C$5:$M$273,10,FALSE),\"\")","v":""},{"$f":"IF(V19='Controls Sheet'!$C$8,VLOOKUP(V19,'EASR lookup'!$C$5:$M$273,11,FALSE),\"\")","v":""},{"$f":"IF(V19='Controls Sheet'!$C$8,'EASR Charts Controls'!W19,\"\")","v":""},{"$f":"IF(W19=\"\",\"\",VLOOKUP('Controls Sheet'!$D$8,'Controls Sheet'!$D$2:$I$6,6,FALSE))","v":360.3},484.5]
["Edinburgh, City of","Derbyshire Dales","North Norfolk","Swansea","Craigavon",null,"Lincoln","Mid Devon","Powys","Neath Port Talbot","Coleraine",null,null,null,{"$f":"IF(INDEX($A$4:$E$111,,'Controls Sheet'!$F$8)=0,\"\",INDEX($A$4:$E$111,,'Controls Sheet'!$F$8))","v":"North Norfolk"},{"$f":"IF(ISERROR(VLOOKUP($O20,'EASR lookup'!$C$5:$I$273,6,FALSE)),\"\",VLOOKUP($O20,'EASR lookup'!$C$5:$I$273,6,FALSE))","v":591.20000000000005},{"$f":"IF(O20='Controls Sheet'!$C$8,VLOOKUP(O20,'EASR lookup'!$C$5:$M$273,8,FALSE),\"\")","v":""},{"$f":"IF(O20='Controls Sheet'!$C$8,VLOOKUP(O20,'EASR lookup'!$C$5:$M$273,9,FALSE),\"\")","v":""},{"$f":"IF(O20='Controls Sheet'!$C$8,'EASR Charts Controls'!P20,\"\")","v":""},{"$f":"IF(P20=\"\",\"\",VLOOKUP('Controls Sheet'!$D$8,'Controls Sheet'!$D$2:$I$6,5,FALSE))","v":501.9},666.4,{"$f":"IF(INDEX($G$4:$K$111,,'Controls Sheet'!$F$8)=0,\"\",INDEX($G$4:$K$111,,'Controls Sheet'!$F$8))","v":"Powys"},{"$f":"IF(ISERROR(VLOOKUP($V20,'EASR lookup'!$C$5:$I$273,7,FALSE)),\"\",VLOOKUP($V20,'EASR lookup'!$C$5:$I$273,7,FALSE))","v":422},{"$f":"IF(V20='Controls Sheet'!$C$8,VLOOKUP(V20,'EASR lookup'!$C$5:$M$273,10,FALSE),\"\")","v":""},{"$f":"IF(V20='Controls Sheet'!$C$8,VLOOKUP(V20,'EASR lookup'!$C$5:$M$273,11,FALSE),\"\")","v":""},{"$f":"IF(V20='Controls Sheet'!$C$8,'EASR Charts Controls'!W20,\"\")","v":""},{"$f":"IF(W20=\"\",\"\",VLOOKUP('Controls Sheet'!$D$8,'Controls Sheet'!$D$2:$I$6,6,FALSE))","v":360.3},484.5]
["Newcastle upon Tyne","Hambleton","West Somerset","Sunderland","Rossendale",null,"Newcastle upon Tyne","Wychavon","Cornwall, Isles of Scilly","South Tyneside","Nuneaton and Bedworth",null,null,null,{"$f":"IF(INDEX($A$4:$E$111,,'Controls Sheet'!$F$8)=0,\"\",INDEX($A$4:$E$111,,'Controls Sheet'!$F$8))","v":"West Somerset"},{"$f":"IF(ISERROR(VLOOKUP($O21,'EASR lookup'!$C$5:$I$273,6,FALSE)),\"\",VLOOKUP($O21,'EASR lookup'!$C$5:$I$273,6,FALSE))","v":601.1},{"$f":"IF(O21='Controls Sheet'!$C$8,VLOOKUP(O21,'EASR lookup'!$C$5:$M$273,8,FALSE),\"\")","v":""},{"$f":"IF(O21='Controls Sheet'!$C$8,VLOOKUP(O21,'EASR lookup'!$C$5:$M$273,9,FALSE),\"\")","v":""},{"$f":"IF(O21='Controls Sheet'!$C$8,'EASR Charts Controls'!P21,\"\")","v":""},{"$f":"IF(P21=\"\",\"\",VLOOKUP('Controls Sheet'!$D$8,'Controls Sheet'!$D$2:$I$6,5,FALSE))","v":501.9},666.4,{"$f":"IF(INDEX($G$4:$K$111,,'Controls Sheet'!$F$8)=0,\"\",INDEX($G$4:$K$111,,'Controls Sheet'!$F$8))","v":"Cornwall, Isles of Scilly"},{"$f":"IF(ISERROR(VLOOKUP($V21,'EASR lookup'!$C$5:$I$273,7,FALSE)),\"\",VLOOKUP($V21,'EASR lookup'!$C$5:$I$273,7,FALSE))","v":427.9},{"$f":"IF(V21='Controls Sheet'!$C$8,VLOOKUP(V21,'EASR lookup'!$C$5:$M$273,10,FALSE),\"\")","v":""},{"$f":"IF(V21='Controls Sheet'!$C$8,VLOOKUP(V21,'EASR lookup'!$C$5:$M$273,11,FALSE),\"\")","v":""},{"$f":"IF(V21='Controls Sheet'!$C$8,'EASR Charts Controls'!W21,\"\")","v":""},{"$f":"IF(W21=\"\",\"\",VLOOKUP('Controls Sheet'!$D$8,'Controls Sheet'!$D$2:$I$6,6,FALSE))","v":360.3},484.5]
["Lancaster","Blaby","Arun","Fife","Telford and Wrekin",null,"Hastings","South Gloucestershire","Arun","South Ayrshire","Stockton-on-Tees",null,null,null,{"$f":"IF(INDEX($A$4:$E$111,,'Controls Sheet'!$F$8)=0,\"\",INDEX($A$4:$E$111,,'Controls Sheet'!$F$8))","v":"Arun"},{"$f":"IF(ISERROR(VLOOKUP($O22,'EASR lookup'!$C$5:$I$273,6,FALSE)),\"\",VLOOKUP($O22,'EASR lookup'!$C$5:$I$273,6,FALSE))","v":601.29999999999995},{"$f":"IF(O22='Controls Sheet'!$C$8,VLOOKUP(O22,'EASR lookup'!$C$5:$M$273,8,FALSE),\"\")","v":""},{"$f":"IF(O22='Controls Sheet'!$C$8,VLOOKUP(O22,'EASR lookup'!$C$5:$M$273,9,FALSE),\"\")","v":""},{"$f":"IF(O22='Controls Sheet'!$C$8,'EASR Charts Controls'!P22,\"\")","v":""},{"$f":"IF(P22=\"\",\"\",VLOOKUP('Controls Sheet'!$D$8,'Controls Sheet'!$D$2:$I$6,5,FALSE))","v":501.9},666.4,{"$f":"IF(INDEX($G$4:$K$111,,'Controls Sheet'!$F$8)=0,\"\",INDEX($G$4:$K$111,,'Controls Sheet'!$F$8))","v":"Arun"},{"$f":"IF(ISERROR(VLOOKUP($V22,'EASR lookup'!$C$5:$I$273,7,FALSE)),\"\",VLOOKUP($V22,'EASR lookup'!$C$5:$I$273,7,FALSE))","v":430.5},{"$f":"IF(V22='Controls Sheet'!$C$8,VLOOKUP(V22,'EASR lookup'!$C$5:$M$273,10,FALSE),\"\")","v":""},{"$f":"IF(V22='Controls Sheet'!$C$8,VLOOKUP(V22,'EASR lookup'!$C$5:$M$273,11,FALSE),\"\")","v":""},{"$f":"IF(V22='Controls Sheet'!$C$8,'EASR Charts Controls'!W22,\"\")","v":""},{"$f":"IF(W22=\"\",\"\",VLOOKUP('Controls Sheet'!$D$8,'Controls Sheet'!$D$2:$I$6,6,FALSE))","v":360.3},484.5]
["Aberdeen City","Lewes","Shepway","Midlothian","Coleraine",null,"Aberdeen City","Babergh","Isle of Anglesey","Rhondda Cynon Taff","Wrexham",null,null,null,{"$f":"IF(INDEX($A$4:$E$111,,'Controls Sheet'!$F$8)=0,\"\",INDEX($A$4:$E$111,,'Controls Sheet'!$F$8))","v":"Shepway"},{"$f":"IF(ISERROR(VLOOKUP($O23,'EASR lookup'!$C$5:$I$273,6,FALSE)),\"\",VLOOKUP($O23,'EASR lookup'!$C$5:$I$273,6,FALSE))","v":601.29999999999995},{"$f":"IF(O23='Controls Sheet'!$C$8,VLOOKUP(O23,'EASR lookup'!$C$5:$M$273,8,FALSE),\"\")","v":""},{"$f":"IF(O23='Controls Sheet'!$C$8,VLOOKUP(O23,'EASR lookup'!$C$5:$M$273,9,FALSE),\"\")","v":""},{"$f":"IF(O23='Controls Sheet'!$C$8,'EASR Charts Controls'!P23,\"\")","v":""},{"$f":"IF(P23=\"\",\"\",VLOOKUP('Controls Sheet'!$D$8,'Controls Sheet'!$D$2:$I$6,5,FALSE))","v":501.9},666.4,{"$f":"IF(INDEX($G$4:$K$111,,'Controls Sheet'!$F$8)=0,\"\",INDEX($G$4:$K$111,,'Controls Sheet'!$F$8))","v":"Isle of Anglesey"},{"$f":"IF(ISERROR(VLOOKUP($V23,'EASR lookup'!$C$5:$I$273,7,FALSE)),\"\",VLOOKUP($V23,'EASR lookup'!$C$5:$I$273,7,FALSE))","v":430.5},{"$f":"IF(V23='Controls Sheet'!$C$8,VLOOKUP(V23,'EASR lookup'!$C$5:$M$273,10,FALSE),\"\")","v":48.4},{"$f":"IF(V23='Controls Sheet'!$C$8,VLOOKUP(V23,'EASR lookup'!$C$5:$M$273,11,FALSE),\"\")","v":52.1},{"$f":"IF(V23='Controls Sheet'!$C$8,'EASR Charts Controls'!W23,\"\")","v":430.5},{"$f":"IF(W23=\"\",\"\",VLOOKUP('Controls Sheet'!$D$8,'Controls Sheet'!$D$2:$I$6,6,FALSE))","v":360.3},484.5]
["Salford","Ribble Valley","Fylde","Knowsley","Lisburn",null,"Liverpool","Bath and North East Somerset","Waveney","Fife","Chesterfield",null,null,null,{"$f":"IF(INDEX($A$4:$E$111,,'Controls Sheet'!$F$8)=0,\"\",INDEX($A$4:$E$111,,'Controls Sheet'!$F$8))","v":"Fylde"},{"$f":"IF(ISERROR(VLOOKUP($O24,'EASR lookup'!$C$5:$I$273,6,FALSE)),\"\",VLOOKUP($O24,'EASR lookup'!$C$5:$I$273,6,FALSE))","v":601.70000000000005},{"$f":"IF(O24='Controls Sheet'!$C$8,VLOOKUP(O24,'EASR lookup'!$C$5:$M$273,8,FALSE),\"\")","v":""},{"$f":"IF(O24='Controls Sheet'!$C$8,VLOOKUP(O24,'EASR lookup'!$C$5:$M$273,9,FALSE),\"\")","v":""},{"$f":"IF(O24='Controls Sheet'!$C$8,'EASR Charts Controls'!P24,\"\")","v":""},{"$f":"IF(P24=\"\",\"\",VLOOKUP('Controls Sheet'!$D$8,'Controls Sheet'!$D$2:$I$6,5,FALSE))","v":501.9},666.4,{"$f":"IF(INDEX($G$4:$K$111,,'Controls Sheet'!$F$8)=0,\"\",INDEX($G$4:$K$111,,'Controls Sheet'!$F$8))","v":"Waveney"},{"$f":"IF(ISERROR(VLOOKUP($V24,'EASR lookup'!$C$5:$I$273,7,FALSE)),\"\",VLOOKUP($V24,'EASR lookup'!$C$5:$I$273,7,FALSE))","v":437.7},{"$f":"IF(V24='Controls Sheet'!$C$8,VLOOKUP(V24,'EASR lookup'!$C$5:$M$273,10,FALSE),\"\")","v":""},{"$f":"IF(V24='Controls Sheet'!$C$8,VLOOKUP(V24,'EASR lookup'!$C$5:$M$273,11,FALSE),\"\")","v":""},{"$f":"IF(V24='Controls Sheet'!$C$8,'EASR Charts Controls'!W24,\"\")","v":""},{"$f":"IF(W24=\"\",\"\",VLOOKUP('Controls Sheet'!$D$8,'Controls Sheet'!$D$2:$I$6,6,FALSE))","v":360.3},484.5]
["Liverpool","Melton","Cornwall, Isles of Scilly","Rhondda Cynon Taff","Cannock Chase",null,"Salford","Oadby and Wigston","Isle of Wight","Falkirk","Newtownabbey",null,null,null,{"$f":"IF(INDEX($A$4:$E$111,,'Controls Sheet'!$F$8)=0,\"\",INDEX($A$4:$E$111,,'Controls Sheet'!$F$8))","v":"Cornwall, Isles of Scilly"},{"$f":"IF(ISERROR(VLOOKUP($O25,'EASR lookup'!$C$5:$I$273,6,FALSE)),\"\",VLOOKUP($O25,'EASR lookup'!$C$5:$I$273,6,FALSE))","v":603.4},{"$f":"IF(O25='Controls Sheet'!$C$8,VLOOKUP(O25,'EASR lookup'!$C$5:$M$273,8,FALSE),\"\")","v":""},{"$f":"IF(O25='Controls Sheet'!$C$8,VLOOKUP(O25,'EASR lookup'!$C$5:$M$273,9,FALSE),\"\")","v":""},{"$f":"IF(O25='Controls Sheet'!$C$8,'EASR Charts Controls'!P25,\"\")","v":""},{"$f":"IF(P25=\"\",\"\",VLOOKUP('Controls Sheet'!$D$8,'Controls Sheet'!$D$2:$I$6,5,FALSE))","v":501.9},666.4,{"$f":"IF(INDEX($G$4:$K$111,,'Controls Sheet'!$F$8)=0,\"\",INDEX($G$4:$K$111,,'Controls Sheet'!$F$8))","v":"Isle of Wight"},{"$f":"IF(ISERROR(VLOOKUP($V25,'EASR lookup'!$C$5:$I$273,7,FALSE)),\"\",VLOOKUP($V25,'EASR lookup'!$C$5:$I$273,7,FALSE))","v":443.6},{"$f":"IF(V25='Controls Sheet'!$C$8,VLOOKUP(V25,'EASR lookup'!$C$5:$M$273,10,FALSE),\"\")","v":""},{"$f":"IF(V25='Controls Sheet'!$C$8,VLOOKUP(V25,'EASR lookup'!$C$5:$M$273,11,FALSE),\"\")","v":""},{"$f":"IF(V25='Controls Sheet'!$C$8,'EASR Charts Controls'!W25,\"\")","v":""},{"$f":"IF(W25=\"\",\"\",VLOOKUP('Controls Sheet'!$D$8,'Controls Sheet'!$D$2:$I$6,6,FALSE))","v":360.3},484.5]
["Dundee City","North Dorset","Aberdeenshire","Halton","Wrexham",null,"Dundee City","Warwick","Weymouth and Portland","Gateshead","Flintshire",null,null,null,{"$f":"IF(INDEX($A$4:$E$111,,'Controls Sheet'!$F$8)=0,\"\",INDEX($A$4:$E$111,,'Controls Sheet'!$F$8))","v":"Aberdeenshire"},{"$f":"IF(ISERROR(VLOOKUP($O26,'EASR lookup'!$C$5:$I$273,6,FALSE)),\"\",VLOOKUP($O26,'EASR lookup'!$C$5:$I$273,6,FALSE))","v":604.4},{"$f":"IF(O26='Controls Sheet'!$C$8,VLOOKUP(O26,'EASR lookup'!$C$5:$M$273,8,FALSE),\"\")","v":""},{"$f":"IF(O26='Controls Sheet'!$C$8,VLOOKUP(O26,'EASR lookup'!$C$5:$M$273,9,FALSE),\"\")","v":""},{"$f":"IF(O26='Controls Sheet'!$C$8,'EASR Charts Controls'!P26,\"\")","v":""},{"$f":"IF(P26=\"\",\"\",VLOOKUP('Controls Sheet'!$D$8,'Controls Sheet'!$D$2:$I$6,5,FALSE))","v":501.9},666.4,{"$f":"IF(INDEX($G$4:$K$111,,'Controls Sheet'!$F$8)=0,\"\",INDEX($G$4:$K$111,,'Controls Sheet'!$F$8))","v":"Weymouth and Portland"},{"$f":"IF(ISERROR(VLOOKUP($V26,'EASR lookup'!$C$5:$I$273,7,FALSE)),\"\",VLOOKUP($V26,'EASR lookup'!$C$5:$I$273,7,FALSE))","v":446.6},{"$f":"IF(V26='Controls Sheet'!$C$8,VLOOKUP(V26,'EASR lookup'!$C$5:$M$273,10,FALSE),\"\")","v":""},{"$f":"IF(V26='Controls Sheet'!$C$8,VLOOKUP(V26,'EASR lookup'!$C$5:$M$273,11,FALSE),\"\")","v":""},{"$f":"IF(V26='Controls Sheet'!$C$8,'EASR Charts Controls'!W26,\"\")","v":""},{"$f":"IF(W26=\"\",\"\",VLOOKUP('Controls Sheet'!$D$8,'Controls Sheet'!$D$2:$I$6,6,FALSE))","v":360.3},484.5]
["Glasgow City","St. Edmundsbury","Gwynedd","West Lothian","Stockton-on-Tees",null,"Glasgow City","Broadland","Shepway","North Ayrshire","Barnsley",null,null,null,{"$f":"IF(INDEX($A$4:$E$111,,'Controls Sheet'!$F$8)=0,\"\",INDEX($A$4:$E$111,,'Controls Sheet'!$F$8))","v":"Gwynedd"},{"$f":"IF(ISERROR(VLOOKUP($O27,'EASR lookup'!$C$5:$I$273,6,FALSE)),\"\",VLOOKUP($O27,'EASR lookup'!$C$5:$I$273,6,FALSE))","v":605},{"$f":"IF(O27='Controls Sheet'!$C$8,VLOOKUP(O27,'EASR lookup'!$C$5:$M$273,8,FALSE),\"\")","v":""},{"$f":"IF(O27='Controls Sheet'!$C$8,VLOOKUP(O27,'EASR lookup'!$C$5:$M$273,9,FALSE),\"\")","v":""},{"$f":"IF(O27='Controls Sheet'!$C$8,'EASR Charts Controls'!P27,\"\")","v":""},{"$f":"IF(P27=\"\",\"\",VLOOKUP('Controls Sheet'!$D$8,'Controls Sheet'!$D$2:$I$6,5,FALSE))","v":501.9},666.4,{"$f":"IF(INDEX($G$4:$K$111,,'Controls Sheet'!$F$8)=0,\"\",INDEX($G$4:$K$111,,'Controls Sheet'!$F$8))","v":"Shepway"},{"$f":"IF(ISERROR(VLOOKUP($V27,'EASR lookup'!$C$5:$I$273,7,FALSE)),\"\",VLOOKUP($V27,'EASR lookup'!$C$5:$I$273,7,FALSE))","v":447.1},{"$f":"IF(V27='Controls Sheet'!$C$8,VLOOKUP(V27,'EASR lookup'!$C$5:$M$273,10,FALSE),\"\")","v":""},{"$f":"IF(V27='Controls Sheet'!$C$8,VLOOKUP(V27,'EASR lookup'!$C$5:$M$273,11,FALSE),\"\")","v":""},{"$f":"IF(V27='Controls Sheet'!$C$8,'EASR Charts Controls'!W27,\"\")","v":""},{"$f":"IF(W27=\"\",\"\",VLOOKUP('Controls Sheet'!$D$8,'Controls Sheet'!$D$2:$I$6,6,FALSE))","v":360.3},484.5]
[null,"Oadby and Wigston","Ryedale","Clackmannanshire","Barnsley",null,null,"Suffolk Coastal","Conwy","East Ayrshire","Bassetlaw",null,null,null,{"$f":"IF(INDEX($A$4:$E$111,,'Controls Sheet'!$F$8)=0,\"\",INDEX($A$4:$E$111,,'Controls Sheet'!$F$8))","v":"Ryedale"},{"$f":"IF(ISERROR(VLOOKUP($O28,'EASR lookup'!$C$5:$I$273,6,FALSE)),\"\",VLOOKUP($O28,'EASR lookup'!$C$5:$I$273,6,FALSE))","v":606.5},{"$f":"IF(O28='Controls Sheet'!$C$8,VLOOKUP(O28,'EASR lookup'!$C$5:$M$273,8,FALSE),\"\")","v":""},{"$f":"IF(O28='Controls Sheet'!$C$8,VLOOKUP(O28,'EASR lookup'!$C$5:$M$273,9,FALSE),\"\")","v":""},{"$f":"IF(O28='Controls Sheet'!$C$8,'EASR Charts Controls'!P28,\"\")","v":""},{"$f":"IF(P28=\"\",\"\",VLOOKUP('Controls Sheet'!$D$8,'Controls Sheet'!$D$2:$I$6,5,FALSE))","v":501.9},666.4,{"$f":"IF(INDEX($G$4:$K$111,,'Controls Sheet'!$F$8)=0,\"\",INDEX($G$4:$K$111,,'Controls Sheet'!$F$8))","v":"Conwy"},{"$f":"IF(ISERROR(VLOOKUP($V28,'EASR lookup'!$C$5:$I$273,7,FALSE)),\"\",VLOOKUP($V28,'EASR lookup'!$C$5:$I$273,7,FALSE))","v":448.4},{"$f":"IF(V28='Controls Sheet'!$C$8,VLOOKUP(V28,'EASR lookup'!$C$5:$M$273,10,FALSE),\"\")","v":""},{"$f":"IF(V28='Controls Sheet'!$C$8,VLOOKUP(V28,'EASR lookup'!$C$5:$M$273,11,FALSE),\"\")","v":""},{"$f":"IF(V28='Controls Sheet'!$C$8,'EASR Charts Controls'!W28,\"\")","v":""},{"$f":"IF(W28=\"\",\"\",VLOOKUP('Controls Sheet'!$D$8,'Controls Sheet'!$D$2:$I$6,6,FALSE))","v":360.3},484.5]
[null,"Stratford-on-Avon","Conwy","Tameside","Newtownabbey",null,null,"Solihull","North Devon","Kingston upon Hull","Rossendale",null,null,null,{"$f":"IF(INDEX($A$4:$E$111,,'Controls Sheet'!$F$8)=0,\"\",INDEX($A$4:$E$111,,'Controls Sheet'!$F$8))","v":"Conwy"},{"$f":"IF(ISERROR(VLOOKUP($O29,'EASR lookup'!$C$5:$I$273,6,FALSE)),\"\",VLOOKUP($O29,'EASR lookup'!$C$5:$I$273,6,FALSE))","v":607.5},{"$f":"IF(O29='Controls Sheet'!$C$8,VLOOKUP(O29,'EASR lookup'!$C$5:$M$273,8,FALSE),\"\")","v":""},{"$f":"IF(O29='Controls Sheet'!$C$8,VLOOKUP(O29,'EASR lookup'!$C$5:$M$273,9,FALSE),\"\")","v":""},{"$f":"IF(O29='Controls Sheet'!$C$8,'EASR Charts Controls'!P29,\"\")","v":""},{"$f":"IF(P29=\"\",\"\",VLOOKUP('Controls Sheet'!$D$8,'Controls Sheet'!$D$2:$I$6,5,FALSE))","v":501.9},666.4,{"$f":"IF(INDEX($G$4:$K$111,,'Controls Sheet'!$F$8)=0,\"\",INDEX($G$4:$K$111,,'Controls Sheet'!$F$8))","v":"North Devon"},{"$f":"IF(ISERROR(VLOOKUP($V29,'EASR lookup'!$C$5:$I$273,7,FALSE)),\"\",VLOOKUP($V29,'EASR lookup'!$C$5:$I$273,7,FALSE))","v":451.4},{"$f":"IF(V29='Controls Sheet'!$C$8,VLOOKUP(V29,'EASR lookup'!$C$5:$M$273,10,FALSE),\"\")","v":""},{"$f":"IF(V29='Controls Sheet'!$C$8,VLOOKUP(V29,'EASR lookup'!$C$5:$M$273,11,FALSE),\"\")","v":""},{"$f":"IF(V29='Controls Sheet'!$C$8,'EASR Charts Controls'!W29,\"\")","v":""},{"$f":"IF(W29=\"\",\"\",VLOOKUP('Controls Sheet'!$D$8,'Controls Sheet'!$D$2:$I$6,6,FALSE))","v":360.3},484.5]
[null,"West Oxfordshire","Waveney","North Ayrshire","Antrim",null,null,"Derbyshire Dales","Scarborough","Stoke-on-Trent","Ards",null,null,null,{"$f":"IF(INDEX($A$4:$E$111,,'Controls Sheet'!$F$8)=0,\"\",INDEX($A$4:$E$111,,'Controls Sheet'!$F$8))","v":"Waveney"},{"$f":"IF(ISERROR(VLOOKUP($O30,'EASR lookup'!$C$5:$I$273,6,FALSE)),\"\",VLOOKUP($O30,'EASR lookup'!$C$5:$I$273,6,FALSE))","v":609.79999999999995},{"$f":"IF(O30='Controls Sheet'!$C$8,VLOOKUP(O30,'EASR lookup'!$C$5:$M$273,8,FALSE),\"\")","v":""},{"$f":"IF(O30='Controls Sheet'!$C$8,VLOOKUP(O30,'EASR lookup'!$C$5:$M$273,9,FALSE),\"\")","v":""},{"$f":"IF(O30='Controls Sheet'!$C$8,'EASR Charts Controls'!P30,\"\")","v":""},{"$f":"IF(P30=\"\",\"\",VLOOKUP('Controls Sheet'!$D$8,'Controls Sheet'!$D$2:$I$6,5,FALSE))","v":501.9},666.4,{"$f":"IF(INDEX($G$4:$K$111,,'Controls Sheet'!$F$8)=0,\"\",INDEX($G$4:$K$111,,'Controls Sheet'!$F$8))","v":"Scarborough"},{"$f":"IF(ISERROR(VLOOKUP($V30,'EASR lookup'!$C$5:$I$273,7,FALSE)),\"\",VLOOKUP($V30,'EASR lookup'!$C$5:$I$273,7,FALSE))","v":453.1},{"$f":"IF(V30='Controls Sheet'!$C$8,VLOOKUP(V30,'EASR lookup'!$C$5:$M$273,10,FALSE),\"\")","v":""},{"$f":"IF(V30='Controls Sheet'!$C$8,VLOOKUP(V30,'EASR lookup'!$C$5:$M$273,11,FALSE),\"\")","v":""},{"$f":"IF(V30='Controls Sheet'!$C$8,'EASR Charts Controls'!W30,\"\")","v":""},{"$f":"IF(W30=\"\",\"\",VLOOKUP('Controls Sheet'!$D$8,'Controls Sheet'!$D$2:$I$6,6,FALSE))","v":360.3},484.5]
[null,"Cotswold","North Devon","Falkirk","Chesterfield",null,null,"South Somerset","Torbay","Inverclyde","Craigavon",null,null,null,{"$f":"IF(INDEX($A$4:$E$111,,'Controls Sheet'!$F$8)=0,\"\",INDEX($A$4:$E$111,,'Controls Sheet'!$F$8))","v":"North Devon"},{"$f":"IF(ISERROR(VLOOKUP($O31,'EASR lookup'!$C$5:$I$273,6,FALSE)),\"\",VLOOKUP($O31,'EASR lookup'!$C$5:$I$273,6,FALSE))","v":610.4},{"$f":"IF(O31='Controls Sheet'!$C$8,VLOOKUP(O31,'EASR lookup'!$C$5:$M$273,8,FALSE),\"\")","v":""},{"$f":"IF(O31='Controls Sheet'!$C$8,VLOOKUP(O31,'EASR lookup'!$C$5:$M$273,9,FALSE),\"\")","v":""},{"$f":"IF(O31='Controls Sheet'!$C$8,'EASR Charts Controls'!P31,\"\")","v":""},{"$f":"IF(P31=\"\",\"\",VLOOKUP('Controls Sheet'!$D$8,'Controls Sheet'!$D$2:$I$6,5,FALSE))","v":501.9},666.4,{"$f":"IF(INDEX($G$4:$K$111,,'Controls Sheet'!$F$8)=0,\"\",INDEX($G$4:$K$111,,'Controls Sheet'!$F$8))","v":"Torbay"},{"$f":"IF(ISERROR(VLOOKUP($V31,'EASR lookup'!$C$5:$I$273,7,FALSE)),\"\",VLOOKUP($V31,'EASR lookup'!$C$5:$I$273,7,FALSE))","v":455.2},{"$f":"IF(V31='Controls Sheet'!$C$8,VLOOKUP(V31,'EASR lookup'!$C$5:$M$273,10,FALSE),\"\")","v":""},{"$f":"IF(V31='Controls Sheet'!$C$8,VLOOKUP(V31,'EASR lookup'!$C$5:$M$273,11,FALSE),\"\")","v":""},{"$f":"IF(V31='Controls Sheet'!$C$8,'EASR Charts Controls'!W31,\"\")","v":""},{"$f":"IF(W31=\"\",\"\",VLOOKUP('Controls Sheet'!$D$8,'Controls Sheet'!$D$2:$I$6,6,FALSE))","v":360.3},484.5]
[null,"East Renfrewshire","Teignbridge","Kingston upon Hull","Mansfield",null,null,"Fareham","Torridge","South Lanarkshire","Mansfield",null,null,null,{"$f":"IF(INDEX($A$4:$E$111,,'Controls Sheet'!$F$8)=0,\"\",INDEX($A$4:$E$111,,'Controls Sheet'!$F$8))","v":"Teignbridge"},{"$f":"IF(ISERROR(VLOOKUP($O32,'EASR lookup'!$C$5:$I$273,6,FALSE)),\"\",VLOOKUP($O32,'EASR lookup'!$C$5:$I$273,6,FALSE))","v":614.9},{"$f":"IF(O32='Controls Sheet'!$C$8,VLOOKUP(O32,'EASR lookup'!$C$5:$M$273,8,FALSE),\"\")","v":""},{"$f":"IF(O32='Controls Sheet'!$C$8,VLOOKUP(O32,'EASR lookup'!$C$5:$M$273,9,FALSE),\"\")","v":""},{"$f":"IF(O32='Controls Sheet'!$C$8,'EASR Charts Controls'!P32,\"\")","v":""},{"$f":"IF(P32=\"\",\"\",VLOOKUP('Controls Sheet'!$D$8,'Controls Sheet'!$D$2:$I$6,5,FALSE))","v":501.9},666.4,{"$f":"IF(INDEX($G$4:$K$111,,'Controls Sheet'!$F$8)=0,\"\",INDEX($G$4:$K$111,,'Controls Sheet'!$F$8))","v":"Torridge"},{"$f":"IF(ISERROR(VLOOKUP($V32,'EASR lookup'!$C$5:$I$273,7,FALSE)),\"\",VLOOKUP($V32,'EASR lookup'!$C$5:$I$273,7,FALSE))","v":457},{"$f":"IF(V32='Controls Sheet'!$C$8,VLOOKUP(V32,'EASR lookup'!$C$5:$M$273,10,FALSE),\"\")","v":""},{"$f":"IF(V32='Controls Sheet'!$C$8,VLOOKUP(V32,'EASR lookup'!$C$5:$M$273,11,FALSE),\"\")","v":""},{"$f":"IF(V32='Controls Sheet'!$C$8,'EASR Charts Controls'!W32,\"\")","v":""},{"$f":"IF(W32=\"\",\"\",VLOOKUP('Controls Sheet'!$D$8,'Controls Sheet'!$D$2:$I$6,6,FALSE))","v":360.3},484.5]
[null,"Rushcliffe","Torbay","Middlesbrough","Nuneaton and Bedworth",null,null,"County of Herefordshire","Ryedale","Sunderland","Ashfield",null,null,null,{"$f":"IF(INDEX($A$4:$E$111,,'Controls Sheet'!$F$8)=0,\"\",INDEX($A$4:$E$111,,'Controls Sheet'!$F$8))","v":"Torbay"},{"$f":"IF(ISERROR(VLOOKUP($O33,'EASR lookup'!$C$5:$I$273,6,FALSE)),\"\",VLOOKUP($O33,'EASR lookup'!$C$5:$I$273,6,FALSE))","v":615.1},{"$f":"IF(O33='Controls Sheet'!$C$8,VLOOKUP(O33,'EASR lookup'!$C$5:$M$273,8,FALSE),\"\")","v":""},{"$f":"IF(O33='Controls Sheet'!$C$8,VLOOKUP(O33,'EASR lookup'!$C$5:$M$273,9,FALSE),\"\")","v":""},{"$f":"IF(O33='Controls Sheet'!$C$8,'EASR Charts Controls'!P33,\"\")","v":""},{"$f":"IF(P33=\"\",\"\",VLOOKUP('Controls Sheet'!$D$8,'Controls Sheet'!$D$2:$I$6,5,FALSE))","v":501.9},666.4,{"$f":"IF(INDEX($G$4:$K$111,,'Controls Sheet'!$F$8)=0,\"\",INDEX($G$4:$K$111,,'Controls Sheet'!$F$8))","v":"Ryedale"},{"$f":"IF(ISERROR(VLOOKUP($V33,'EASR lookup'!$C$5:$I$273,7,FALSE)),\"\",VLOOKUP($V33,'EASR lookup'!$C$5:$I$273,7,FALSE))","v":457.1},{"$f":"IF(V33='Controls Sheet'!$C$8,VLOOKUP(V33,'EASR lookup'!$C$5:$M$273,10,FALSE),\"\")","v":""},{"$f":"IF(V33='Controls Sheet'!$C$8,VLOOKUP(V33,'EASR lookup'!$C$5:$M$273,11,FALSE),\"\")","v":""},{"$f":"IF(V33='Controls Sheet'!$C$8,'EASR Charts Controls'!W33,\"\")","v":""},{"$f":"IF(W33=\"\",\"\",VLOOKUP('Controls Sheet'!$D$8,'Controls Sheet'!$D$2:$I$6,6,FALSE))","v":360.3},484.5]
[null,"Fareham","Dover","Torfaen","Wakefield",null,null,"Ashford","Highland","Tameside","Rotherham",null,null,null,{"$f":"IF(INDEX($A$4:$E$111,,'Controls Sheet'!$F$8)=0,\"\",INDEX($A$4:$E$111,,'Controls Sheet'!$F$8))","v":"Dover"},{"$f":"IF(ISERROR(VLOOKUP($O34,'EASR lookup'!$C$5:$I$273,6,FALSE)),\"\",VLOOKUP($O34,'EASR lookup'!$C$5:$I$273,6,FALSE))","v":615.79999999999995},{"$f":"IF(O34='Controls Sheet'!$C$8,VLOOKUP(O34,'EASR lookup'!$C$5:$M$273,8,FALSE),\"\")","v":""},{"$f":"IF(O34='Controls Sheet'!$C$8,VLOOKUP(O34,'EASR lookup'!$C$5:$M$273,9,FALSE),\"\")","v":""},{"$f":"IF(O34='Controls Sheet'!$C$8,'EASR Charts Controls'!P34,\"\")","v":""},{"$f":"IF(P34=\"\",\"\",VLOOKUP('Controls Sheet'!$D$8,'Controls Sheet'!$D$2:$I$6,5,FALSE))","v":501.9},666.4,{"$f":"IF(INDEX($G$4:$K$111,,'Controls Sheet'!$F$8)=0,\"\",INDEX($G$4:$K$111,,'Controls Sheet'!$F$8))","v":"Highland"},{"$f":"IF(ISERROR(VLOOKUP($V34,'EASR lookup'!$C$5:$I$273,7,FALSE)),\"\",VLOOKUP($V34,'EASR lookup'!$C$5:$I$273,7,FALSE))","v":460.9},{"$f":"IF(V34='Controls Sheet'!$C$8,VLOOKUP(V34,'EASR lookup'!$C$5:$M$273,10,FALSE),\"\")","v":""},{"$f":"IF(V34='Controls Sheet'!$C$8,VLOOKUP(V34,'EASR lookup'!$C$5:$M$273,11,FALSE),\"\")","v":""},{"$f":"IF(V34='Controls Sheet'!$C$8,'EASR Charts Controls'!W34,\"\")","v":""},{"$f":"IF(W34=\"\",\"\",VLOOKUP('Controls Sheet'!$D$8,'Controls Sheet'!$D$2:$I$6,6,FALSE))","v":360.3},484.5]
[null,"Huntingdonshire","Scottish Borders","Neath Port Talbot","Ashfield",null,null,"Harborough","Dover","Belfast","Wakefield",null,null,null,{"$f":"IF(INDEX($A$4:$E$111,,'Controls Sheet'!$F$8)=0,\"\",INDEX($A$4:$E$111,,'Controls Sheet'!$F$8))","v":"Scottish Borders"},{"$f":"IF(ISERROR(VLOOKUP($O35,'EASR lookup'!$C$5:$I$273,6,FALSE)),\"\",VLOOKUP($O35,'EASR lookup'!$C$5:$I$273,6,FALSE))","v":625.20000000000005},{"$f":"IF(O35='Controls Sheet'!$C$8,VLOOKUP(O35,'EASR lookup'!$C$5:$M$273,8,FALSE),\"\")","v":""},{"$f":"IF(O35='Controls Sheet'!$C$8,VLOOKUP(O35,'EASR lookup'!$C$5:$M$273,9,FALSE),\"\")","v":""},{"$f":"IF(O35='Controls Sheet'!$C$8,'EASR Charts Controls'!P35,\"\")","v":""},{"$f":"IF(P35=\"\",\"\",VLOOKUP('Controls Sheet'!$D$8,'Controls Sheet'!$D$2:$I$6,5,FALSE))","v":501.9},666.4,{"$f":"IF(INDEX($G$4:$K$111,,'Controls Sheet'!$F$8)=0,\"\",INDEX($G$4:$K$111,,'Controls Sheet'!$F$8))","v":"Dover"},{"$f":"IF(ISERROR(VLOOKUP($V35,'EASR lookup'!$C$5:$I$273,7,FALSE)),\"\",VLOOKUP($V35,'EASR lookup'!$C$5:$I$273,7,FALSE))","v":466.8},{"$f":"IF(V35='Controls Sheet'!$C$8,VLOOKUP(V35,'EASR lookup'!$C$5:$M$273,10,FALSE),\"\")","v":""},{"$f":"IF(V35='Controls Sheet'!$C$8,VLOOKUP(V35,'EASR lookup'!$C$5:$M$273,11,FALSE),\"\")","v":""},{"$f":"IF(V35='Controls Sheet'!$C$8,'EASR Charts Controls'!W35,\"\")","v":""},{"$f":"IF(W35=\"\",\"\",VLOOKUP('Controls Sheet'!$D$8,'Controls Sheet'!$D$2:$I$6,6,FALSE))","v":360.3},484.5]
[null,"Sedgemoor","West Devon","South Tyneside","Larne",null,null,"Forest of Dean","East Lindsey","West Lothian","North East Lincolnshire",null,null,null,{"$f":"IF(INDEX($A$4:$E$111,,'Controls Sheet'!$F$8)=0,\"\",INDEX($A$4:$E$111,,'Controls Sheet'!$F$8))","v":"West Devon"},{"$f":"IF(ISERROR(VLOOKUP($O36,'EASR lookup'!$C$5:$I$273,6,FALSE)),\"\",VLOOKUP($O36,'EASR lookup'!$C$5:$I$273,6,FALSE))","v":635},{"$f":"IF(O36='Controls Sheet'!$C$8,VLOOKUP(O36,'EASR lookup'!$C$5:$M$273,8,FALSE),\"\")","v":""},{"$f":"IF(O36='Controls Sheet'!$C$8,VLOOKUP(O36,'EASR lookup'!$C$5:$M$273,9,FALSE),\"\")","v":""},{"$f":"IF(O36='Controls Sheet'!$C$8,'EASR Charts Controls'!P36,\"\")","v":""},{"$f":"IF(P36=\"\",\"\",VLOOKUP('Controls Sheet'!$D$8,'Controls Sheet'!$D$2:$I$6,5,FALSE))","v":501.9},666.4,{"$f":"IF(INDEX($G$4:$K$111,,'Controls Sheet'!$F$8)=0,\"\",INDEX($G$4:$K$111,,'Controls Sheet'!$F$8))","v":"East Lindsey"},{"$f":"IF(ISERROR(VLOOKUP($V36,'EASR lookup'!$C$5:$I$273,7,FALSE)),\"\",VLOOKUP($V36,'EASR lookup'!$C$5:$I$273,7,FALSE))","v":468},{"$f":"IF(V36='Controls Sheet'!$C$8,VLOOKUP(V36,'EASR lookup'!$C$5:$M$273,10,FALSE),\"\")","v":""},{"$f":"IF(V36='Controls Sheet'!$C$8,VLOOKUP(V36,'EASR lookup'!$C$5:$M$273,11,FALSE),\"\")","v":""},{"$f":"IF(V36='Controls Sheet'!$C$8,'EASR Charts Controls'!W36,\"\")","v":""},{"$f":"IF(W36=\"\",\"\",VLOOKUP('Controls Sheet'!$D$8,'Controls Sheet'!$D$2:$I$6,6,FALSE))","v":360.3},484.5]
[null,"Wychavon","Isle of Anglesey","Stoke-on-Trent","Rotherham",null,null,"South Northamptonshire","Perth & Kinross","Merthyr Tydfil","Doncaster",null,null,null,{"$f":"IF(INDEX($A$4:$E$111,,'Controls Sheet'!$F$8)=0,\"\",INDEX($A$4:$E$111,,'Controls Sheet'!$F$8))","v":"Isle of Anglesey"},{"$f":"IF(ISERROR(VLOOKUP($O37,'EASR lookup'!$C$5:$I$273,6,FALSE)),\"\",VLOOKUP($O37,'EASR lookup'!$C$5:$I$273,6,FALSE))","v":636.6},{"$f":"IF(O37='Controls Sheet'!$C$8,VLOOKUP(O37,'EASR lookup'!$C$5:$M$273,8,FALSE),\"\")","v":66.599999999999994},{"$f":"IF(O37='Controls Sheet'!$C$8,VLOOKUP(O37,'EASR lookup'!$C$5:$M$273,9,FALSE),\"\")","v":71.8},{"$f":"IF(O37='Controls Sheet'!$C$8,'EASR Charts Controls'!P37,\"\")","v":636.6},{"$f":"IF(P37=\"\",\"\",VLOOKUP('Controls Sheet'!$D$8,'Controls Sheet'!$D$2:$I$6,5,FALSE))","v":501.9},666.4,{"$f":"IF(INDEX($G$4:$K$111,,'Controls Sheet'!$F$8)=0,\"\",INDEX($G$4:$K$111,,'Controls Sheet'!$F$8))","v":"Perth & Kinross"},{"$f":"IF(ISERROR(VLOOKUP($V37,'EASR lookup'!$C$5:$I$273,7,FALSE)),\"\",VLOOKUP($V37,'EASR lookup'!$C$5:$I$273,7,FALSE))","v":468.7},{"$f":"IF(V37='Controls Sheet'!$C$8,VLOOKUP(V37,'EASR lookup'!$C$5:$M$273,10,FALSE),\"\")","v":""},{"$f":"IF(V37='Controls Sheet'!$C$8,VLOOKUP(V37,'EASR lookup'!$C$5:$M$273,11,FALSE),\"\")","v":""},{"$f":"IF(V37='Controls Sheet'!$C$8,'EASR Charts Controls'!W37,\"\")","v":""},{"$f":"IF(W37=\"\",\"\",VLOOKUP('Controls Sheet'!$D$8,'Controls Sheet'!$D$2:$I$6,6,FALSE))","v":360.3},484.5]
[null,"North Kesteven","Carmarthenshire","East Ayrshire","North Lincolnshire",null,null,"Shropshire","Fylde","Knowsley","Carrickfergus",null,null,null,{"$f":"IF(INDEX($A$4:$E$111,,'Controls Sheet'!$F$8)=0,\"\",INDEX($A$4:$E$111,,'Controls Sheet'!$F$8))","v":"Carmarthenshire"},{"$f":"IF(ISERROR(VLOOKUP($O38,'EASR lookup'!$C$5:$I$273,6,FALSE)),\"\",VLOOKUP($O38,'EASR lookup'!$C$5:$I$273,6,FALSE))","v":639.20000000000005},{"$f":"IF(O38='Controls Sheet'!$C$8,VLOOKUP(O38,'EASR lookup'!$C$5:$M$273,8,FALSE),\"\")","v":""},{"$f":"IF(O38='Controls Sheet'!$C$8,VLOOKUP(O38,'EASR lookup'!$C$5:$M$273,9,FALSE),\"\")","v":""},{"$f":"IF(O38='Controls Sheet'!$C$8,'EASR Charts Controls'!P38,\"\")","v":""},{"$f":"IF(P38=\"\",\"\",VLOOKUP('Controls Sheet'!$D$8,'Controls Sheet'!$D$2:$I$6,5,FALSE))","v":501.9},666.4,{"$f":"IF(INDEX($G$4:$K$111,,'Controls Sheet'!$F$8)=0,\"\",INDEX($G$4:$K$111,,'Controls Sheet'!$F$8))","v":"Fylde"},{"$f":"IF(ISERROR(VLOOKUP($V38,'EASR lookup'!$C$5:$I$273,7,FALSE)),\"\",VLOOKUP($V38,'EASR lookup'!$C$5:$I$273,7,FALSE))","v":469.1},{"$f":"IF(V38='Controls Sheet'!$C$8,VLOOKUP(V38,'EASR lookup'!$C$5:$M$273,10,FALSE),\"\")","v":""},{"$f":"IF(V38='Controls Sheet'!$C$8,VLOOKUP(V38,'EASR lookup'!$C$5:$M$273,11,FALSE),\"\")","v":""},{"$f":"IF(V38='Controls Sheet'!$C$8,'EASR Charts Controls'!W38,\"\")","v":""},{"$f":"IF(W38=\"\",\"\",VLOOKUP('Controls Sheet'!$D$8,'Controls Sheet'!$D$2:$I$6,6,FALSE))","v":360.3},484.5]
[null,"Mendip","Allerdale","South Lanarkshire","North East Lincolnshire",null,null,"Trafford","Pembrokeshire","Renfrewshire","Telford and Wrekin",null,null,null,{"$f":"IF(INDEX($A$4:$E$111,,'Controls Sheet'!$F$8)=0,\"\",INDEX($A$4:$E$111,,'Controls Sheet'!$F$8))","v":"Allerdale"},{"$f":"IF(ISERROR(VLOOKUP($O39,'EASR lookup'!$C$5:$I$273,6,FALSE)),\"\",VLOOKUP($O39,'EASR lookup'!$C$5:$I$273,6,FALSE))","v":639.29999999999995},{"$f":"IF(O39='Controls Sheet'!$C$8,VLOOKUP(O39,'EASR lookup'!$C$5:$M$273,8,FALSE),\"\")","v":""},{"$f":"IF(O39='Controls Sheet'!$C$8,VLOOKUP(O39,'EASR lookup'!$C$5:$M$273,9,FALSE),\"\")","v":""},{"$f":"IF(O39='Controls Sheet'!$C$8,'EASR Charts Controls'!P39,\"\")","v":""},{"$f":"IF(P39=\"\",\"\",VLOOKUP('Controls Sheet'!$D$8,'Controls Sheet'!$D$2:$I$6,5,FALSE))","v":501.9},666.4,{"$f":"IF(INDEX($G$4:$K$111,,'Controls Sheet'!$F$8)=0,\"\",INDEX($G$4:$K$111,,'Controls Sheet'!$F$8))","v":"Pembrokeshire"},{"$f":"IF(ISERROR(VLOOKUP($V39,'EASR lookup'!$C$5:$I$273,7,FALSE)),\"\",VLOOKUP($V39,'EASR lookup'!$C$5:$I$273,7,FALSE))","v":472},{"$f":"IF(V39='Controls Sheet'!$C$8,VLOOKUP(V39,'EASR lookup'!$C$5:$M$273,10,FALSE),\"\")","v":""},{"$f":"IF(V39='Controls Sheet'!$C$8,VLOOKUP(V39,'EASR lookup'!$C$5:$M$273,11,FALSE),\"\")","v":""},{"$f":"IF(V39='Controls Sheet'!$C$8,'EASR Charts Controls'!W39,\"\")","v":""},{"$f":"IF(W39=\"\",\"\",VLOOKUP('Controls Sheet'!$D$8,'Controls Sheet'!$D$2:$I$6,6,FALSE))","v":360.3},484.5]
[null,"Wiltshire","Tendring","Renfrewshire","Corby",null,null,"Ribble Valley","Great Yarmouth","Halton","Bolsover",null,null,null,{"$f":"IF(INDEX($A$4:$E$111,,'Controls Sheet'!$F$8)=0,\"\",INDEX($A$4:$E$111,,'Controls Sheet'!$F$8))","v":"Tendring"},{"$f":"IF(ISERROR(VLOOKUP($O40,'EASR lookup'!$C$5:$I$273,6,FALSE)),\"\",VLOOKUP($O40,'EASR lookup'!$C$5:$I$273,6,FALSE))","v":640.1},{"$f":"IF(O40='Controls Sheet'!$C$8,VLOOKUP(O40,'EASR lookup'!$C$5:$M$273,8,FALSE),\"\")","v":""},{"$f":"IF(O40='Controls Sheet'!$C$8,VLOOKUP(O40,'EASR lookup'!$C$5:$M$273,9,FALSE),\"\")","v":""},{"$f":"IF(O40='Controls Sheet'!$C$8,'EASR Charts Controls'!P40,\"\")","v":""},{"$f":"IF(P40=\"\",\"\",VLOOKUP('Controls Sheet'!$D$8,'Controls Sheet'!$D$2:$I$6,5,FALSE))","v":501.9},666.4,{"$f":"IF(INDEX($G$4:$K$111,,'Controls Sheet'!$F$8)=0,\"\",INDEX($G$4:$K$111,,'Controls Sheet'!$F$8))","v":"Great Yarmouth"},{"$f":"IF(ISERROR(VLOOKUP($V40,'EASR lookup'!$C$5:$I$273,7,FALSE)),\"\",VLOOKUP($V40,'EASR lookup'!$C$5:$I$273,7,FALSE))","v":474.2},{"$f":"IF(V40='Controls Sheet'!$C$8,VLOOKUP(V40,'EASR lookup'!$C$5:$M$273,10,FALSE),\"\")","v":""},{"$f":"IF(V40='Controls Sheet'!$C$8,VLOOKUP(V40,'EASR lookup'!$C$5:$M$273,11,FALSE),\"\")","v":""},{"$f":"IF(V40='Controls Sheet'!$C$8,'EASR Charts Controls'!W40,\"\")","v":""},{"$f":"IF(W40=\"\",\"\",VLOOKUP('Controls Sheet'!$D$8,'Controls Sheet'!$D$2:$I$6,6,FALSE))","v":360.3},484.5]
[null,"Broadland","Scarborough","Blaenau Gwent","Bolsover",null,null,"North Somerset","Thanet","Clackmannanshire","Bridgend",null,null,null,{"$f":"IF(INDEX($A$4:$E$111,,'Controls Sheet'!$F$8)=0,\"\",INDEX($A$4:$E$111,,'Controls Sheet'!$F$8))","v":"Scarborough"},{"$f":"IF(ISERROR(VLOOKUP($O41,'EASR lookup'!$C$5:$I$273,6,FALSE)),\"\",VLOOKUP($O41,'EASR lookup'!$C$5:$I$273,6,FALSE))","v":650.20000000000005},{"$f":"IF(O41='Controls Sheet'!$C$8,VLOOKUP(O41,'EASR lookup'!$C$5:$M$273,8,FALSE),\"\")","v":""},{"$f":"IF(O41='Controls Sheet'!$C$8,VLOOKUP(O41,'EASR lookup'!$C$5:$M$273,9,FALSE),\"\")","v":""},{"$f":"IF(O41='Controls Sheet'!$C$8,'EASR Charts Controls'!P41,\"\")","v":""},{"$f":"IF(P41=\"\",\"\",VLOOKUP('Controls Sheet'!$D$8,'Controls Sheet'!$D$2:$I$6,5,FALSE))","v":501.9},666.4,{"$f":"IF(INDEX($G$4:$K$111,,'Controls Sheet'!$F$8)=0,\"\",INDEX($G$4:$K$111,,'Controls Sheet'!$F$8))","v":"Thanet"},{"$f":"IF(ISERROR(VLOOKUP($V41,'EASR lookup'!$C$5:$I$273,7,FALSE)),\"\",VLOOKUP($V41,'EASR lookup'!$C$5:$I$273,7,FALSE))","v":479.1},{"$f":"IF(V41='Controls Sheet'!$C$8,VLOOKUP(V41,'EASR lookup'!$C$5:$M$273,10,FALSE),\"\")","v":""},{"$f":"IF(V41='Controls Sheet'!$C$8,VLOOKUP(V41,'EASR lookup'!$C$5:$M$273,11,FALSE),\"\")","v":""},{"$f":"IF(V41='Controls Sheet'!$C$8,'EASR Charts Controls'!W41,\"\")","v":""},{"$f":"IF(W41=\"\",\"\",VLOOKUP('Controls Sheet'!$D$8,'Controls Sheet'!$D$2:$I$6,6,FALSE))","v":360.3},484.5]
[null,"Cherwell","Carlisle","Inverclyde","Wigan",null,null,"Kings Lynn and West Norfolk","Carmarthenshire","Blaenau Gwent","Wigan",null,null,null,{"$f":"IF(INDEX($A$4:$E$111,,'Controls Sheet'!$F$8)=0,\"\",INDEX($A$4:$E$111,,'Controls Sheet'!$F$8))","v":"Carlisle"},{"$f":"IF(ISERROR(VLOOKUP($O42,'EASR lookup'!$C$5:$I$273,6,FALSE)),\"\",VLOOKUP($O42,'EASR lookup'!$C$5:$I$273,6,FALSE))","v":652.4},{"$f":"IF(O42='Controls Sheet'!$C$8,VLOOKUP(O42,'EASR lookup'!$C$5:$M$273,8,FALSE),\"\")","v":""},{"$f":"IF(O42='Controls Sheet'!$C$8,VLOOKUP(O42,'EASR lookup'!$C$5:$M$273,9,FALSE),\"\")","v":""},{"$f":"IF(O42='Controls Sheet'!$C$8,'EASR Charts Controls'!P42,\"\")","v":""},{"$f":"IF(P42=\"\",\"\",VLOOKUP('Controls Sheet'!$D$8,'Controls Sheet'!$D$2:$I$6,5,FALSE))","v":501.9},666.4,{"$f":"IF(INDEX($G$4:$K$111,,'Controls Sheet'!$F$8)=0,\"\",INDEX($G$4:$K$111,,'Controls Sheet'!$F$8))","v":"Carmarthenshire"},{"$f":"IF(ISERROR(VLOOKUP($V42,'EASR lookup'!$C$5:$I$273,7,FALSE)),\"\",VLOOKUP($V42,'EASR lookup'!$C$5:$I$273,7,FALSE))","v":481.3},{"$f":"IF(V42='Controls Sheet'!$C$8,VLOOKUP(V42,'EASR lookup'!$C$5:$M$273,10,FALSE),\"\")","v":""},{"$f":"IF(V42='Controls Sheet'!$C$8,VLOOKUP(V42,'EASR lookup'!$C$5:$M$273,11,FALSE),\"\")","v":""},{"$f":"IF(V42='Controls Sheet'!$C$8,'EASR Charts Controls'!W42,\"\")","v":""},{"$f":"IF(W42=\"\",\"\",VLOOKUP('Controls Sheet'!$D$8,'Controls Sheet'!$D$2:$I$6,6,FALSE))","v":360.3},484.5]
[null,"Taunton Deane","Perth & Kinross","North Lanarkshire","Bridgend",null,null,"Sedgemoor","Gwynedd","Middlesbrough","Antrim",null,null,null,{"$f":"IF(INDEX($A$4:$E$111,,'Controls Sheet'!$F$8)=0,\"\",INDEX($A$4:$E$111,,'Controls Sheet'!$F$8))","v":"Perth & Kinross"},{"$f":"IF(ISERROR(VLOOKUP($O43,'EASR lookup'!$C$5:$I$273,6,FALSE)),\"\",VLOOKUP($O43,'EASR lookup'!$C$5:$I$273,6,FALSE))","v":652.4},{"$f":"IF(O43='Controls Sheet'!$C$8,VLOOKUP(O43,'EASR lookup'!$C$5:$M$273,8,FALSE),\"\")","v":""},{"$f":"IF(O43='Controls Sheet'!$C$8,VLOOKUP(O43,'EASR lookup'!$C$5:$M$273,9,FALSE),\"\")","v":""},{"$f":"IF(O43='Controls Sheet'!$C$8,'EASR Charts Controls'!P43,\"\")","v":""},{"$f":"IF(P43=\"\",\"\",VLOOKUP('Controls Sheet'!$D$8,'Controls Sheet'!$D$2:$I$6,5,FALSE))","v":501.9},666.4,{"$f":"IF(INDEX($G$4:$K$111,,'Controls Sheet'!$F$8)=0,\"\",INDEX($G$4:$K$111,,'Controls Sheet'!$F$8))","v":"Gwynedd"},{"$f":"IF(ISERROR(VLOOKUP($V43,'EASR lookup'!$C$5:$I$273,7,FALSE)),\"\",VLOOKUP($V43,'EASR lookup'!$C$5:$I$273,7,FALSE))","v":488},{"$f":"IF(V43='Controls Sheet'!$C$8,VLOOKUP(V43,'EASR lookup'!$C$5:$M$273,10,FALSE),\"\")","v":""},{"$f":"IF(V43='Controls Sheet'!$C$8,VLOOKUP(V43,'EASR lookup'!$C$5:$M$273,11,FALSE),\"\")","v":""},{"$f":"IF(V43='Controls Sheet'!$C$8,'EASR Charts Controls'!W43,\"\")","v":""},{"$f":"IF(W43=\"\",\"\",VLOOKUP('Controls Sheet'!$D$8,'Controls Sheet'!$D$2:$I$6,6,FALSE))","v":360.3},484.5]
[null,"Cheltenham","Highland","Belfast","Doncaster",null,null,"Stafford","Aberdeenshire","North Lanarkshire","Corby",null,null,null,{"$f":"IF(INDEX($A$4:$E$111,,'Controls Sheet'!$F$8)=0,\"\",INDEX($A$4:$E$111,,'Controls Sheet'!$F$8))","v":"Highland"},{"$f":"IF(ISERROR(VLOOKUP($O44,'EASR lookup'!$C$5:$I$273,6,FALSE)),\"\",VLOOKUP($O44,'EASR lookup'!$C$5:$I$273,6,FALSE))","v":657.3},{"$f":"IF(O44='Controls Sheet'!$C$8,VLOOKUP(O44,'EASR lookup'!$C$5:$M$273,8,FALSE),\"\")","v":""},{"$f":"IF(O44='Controls Sheet'!$C$8,VLOOKUP(O44,'EASR lookup'!$C$5:$M$273,9,FALSE),\"\")","v":""},{"$f":"IF(O44='Controls Sheet'!$C$8,'EASR Charts Controls'!P44,\"\")","v":""},{"$f":"IF(P44=\"\",\"\",VLOOKUP('Controls Sheet'!$D$8,'Controls Sheet'!$D$2:$I$6,5,FALSE))","v":501.9},666.4,{"$f":"IF(INDEX($G$4:$K$111,,'Controls Sheet'!$F$8)=0,\"\",INDEX($G$4:$K$111,,'Controls Sheet'!$F$8))","v":"Aberdeenshire"},{"$f":"IF(ISERROR(VLOOKUP($V44,'EASR lookup'!$C$5:$I$273,7,FALSE)),\"\",VLOOKUP($V44,'EASR lookup'!$C$5:$I$273,7,FALSE))","v":495.6},{"$f":"IF(V44='Controls Sheet'!$C$8,VLOOKUP(V44,'EASR lookup'!$C$5:$M$273,10,FALSE),\"\")","v":""},{"$f":"IF(V44='Controls Sheet'!$C$8,VLOOKUP(V44,'EASR lookup'!$C$5:$M$273,11,FALSE),\"\")","v":""},{"$f":"IF(V44='Controls Sheet'!$C$8,'EASR Charts Controls'!W44,\"\")","v":""},{"$f":"IF(W44=\"\",\"\",VLOOKUP('Controls Sheet'!$D$8,'Controls Sheet'!$D$2:$I$6,6,FALSE))","v":360.3},484.5]
[null,"Maidstone","Weymouth and Portland","West Dunbartonshire",null,null,null,"Poole","Wyre","West Dunbartonshire",null,null,null,null,{"$f":"IF(INDEX($A$4:$E$111,,'Controls Sheet'!$F$8)=0,\"\",INDEX($A$4:$E$111,,'Controls Sheet'!$F$8))","v":"Weymouth and Portland"},{"$f":"IF(ISERROR(VLOOKUP($O45,'EASR lookup'!$C$5:$I$273,6,FALSE)),\"\",VLOOKUP($O45,'EASR lookup'!$C$5:$I$273,6,FALSE))","v":659.6},{"$f":"IF(O45='Controls Sheet'!$C$8,VLOOKUP(O45,'EASR lookup'!$C$5:$M$273,8,FALSE),\"\")","v":""},{"$f":"IF(O45='Controls Sheet'!$C$8,VLOOKUP(O45,'EASR lookup'!$C$5:$M$273,9,FALSE),\"\")","v":""},{"$f":"IF(O45='Controls Sheet'!$C$8,'EASR Charts Controls'!P45,\"\")","v":""},{"$f":"IF(P45=\"\",\"\",VLOOKUP('Controls Sheet'!$D$8,'Controls Sheet'!$D$2:$I$6,5,FALSE))","v":501.9},666.4,{"$f":"IF(INDEX($G$4:$K$111,,'Controls Sheet'!$F$8)=0,\"\",INDEX($G$4:$K$111,,'Controls Sheet'!$F$8))","v":"Wyre"},{"$f":"IF(ISERROR(VLOOKUP($V45,'EASR lookup'!$C$5:$I$273,7,FALSE)),\"\",VLOOKUP($V45,'EASR lookup'!$C$5:$I$273,7,FALSE))","v":498.4},{"$f":"IF(V45='Controls Sheet'!$C$8,VLOOKUP(V45,'EASR lookup'!$C$5:$M$273,10,FALSE),\"\")","v":""},{"$f":"IF(V45='Controls Sheet'!$C$8,VLOOKUP(V45,'EASR lookup'!$C$5:$M$273,11,FALSE),\"\")","v":""},{"$f":"IF(V45='Controls Sheet'!$C$8,'EASR Charts Controls'!W45,\"\")","v":""},{"$f":"IF(W45=\"\",\"\",VLOOKUP('Controls Sheet'!$D$8,'Controls Sheet'!$D$2:$I$6,6,FALSE))","v":360.3},484.5]
[null,"Charnwood","Angus",null,null,null,null,"Rugby","Tendring",null,null,null,null,null,{"$f":"IF(INDEX($A$4:$E$111,,'Controls Sheet'!$F$8)=0,\"\",INDEX($A$4:$E$111,,'Controls Sheet'!$F$8))","v":"Angus"},{"$f":"IF(ISERROR(VLOOKUP($O46,'EASR lookup'!$C$5:$I$273,6,FALSE)),\"\",VLOOKUP($O46,'EASR lookup'!$C$5:$I$273,6,FALSE))","v":661.4},{"$f":"IF(O46='Controls Sheet'!$C$8,VLOOKUP(O46,'EASR lookup'!$C$5:$M$273,8,FALSE),\"\")","v":""},{"$f":"IF(O46='Controls Sheet'!$C$8,VLOOKUP(O46,'EASR lookup'!$C$5:$M$273,9,FALSE),\"\")","v":""},{"$f":"IF(O46='Controls Sheet'!$C$8,'EASR Charts Controls'!P46,\"\")","v":""},{"$f":"IF(P46=\"\",\"\",VLOOKUP('Controls Sheet'!$D$8,'Controls Sheet'!$D$2:$I$6,5,FALSE))","v":501.9},666.4,{"$f":"IF(INDEX($G$4:$K$111,,'Controls Sheet'!$F$8)=0,\"\",INDEX($G$4:$K$111,,'Controls Sheet'!$F$8))","v":"Tendring"},{"$f":"IF(ISERROR(VLOOKUP($V46,'EASR lookup'!$C$5:$I$273,7,FALSE)),\"\",VLOOKUP($V46,'EASR lookup'!$C$5:$I$273,7,FALSE))","v":500.9},{"$f":"IF(V46='Controls Sheet'!$C$8,VLOOKUP(V46,'EASR lookup'!$C$5:$M$273,10,FALSE),\"\")","v":""},{"$f":"IF(V46='Controls Sheet'!$C$8,VLOOKUP(V46,'EASR lookup'!$C$5:$M$273,11,FALSE),\"\")","v":""},{"$f":"IF(V46='Controls Sheet'!$C$8,'EASR Charts Controls'!W46,\"\")","v":""},{"$f":"IF(W46=\"\",\"\",VLOOKUP('Controls Sheet'!$D$8,'Controls Sheet'!$D$2:$I$6,6,FALSE))","v":360.3},484.5]
[null,"Tewkesbury","Thanet",null,null,null,null,"Taunton Deane","Angus",null,null,null,null,null,{"$f":"IF(INDEX($A$4:$E$111,,'Controls Sheet'!$F$8)=0,\"\",INDEX($A$4:$E$111,,'Controls Sheet'!$F$8))","v":"Thanet"},{"$f":"IF(ISERROR(VLOOKUP($O47,'EASR lookup'!$C$5:$I$273,6,FALSE)),\"\",VLOOKUP($O47,'EASR lookup'!$C$5:$I$273,6,FALSE))","v":661.5},{"$f":"IF(O47='Controls Sheet'!$C$8,VLOOKUP(O47,'EASR lookup'!$C$5:$M$273,8,FALSE),\"\")","v":""},{"$f":"IF(O47='Controls Sheet'!$C$8,VLOOKUP(O47,'EASR lookup'!$C$5:$M$273,9,FALSE),\"\")","v":""},{"$f":"IF(O47='Controls Sheet'!$C$8,'EASR Charts Controls'!P47,\"\")","v":""},{"$f":"IF(P47=\"\",\"\",VLOOKUP('Controls Sheet'!$D$8,'Controls Sheet'!$D$2:$I$6,5,FALSE))","v":501.9},666.4,{"$f":"IF(INDEX($G$4:$K$111,,'Controls Sheet'!$F$8)=0,\"\",INDEX($G$4:$K$111,,'Controls Sheet'!$F$8))","v":"Angus"},{"$f":"IF(ISERROR(VLOOKUP($V47,'EASR lookup'!$C$5:$I$273,7,FALSE)),\"\",VLOOKUP($V47,'EASR lookup'!$C$5:$I$273,7,FALSE))","v":502.6},{"$f":"IF(V47='Controls Sheet'!$C$8,VLOOKUP(V47,'EASR lookup'!$C$5:$M$273,10,FALSE),\"\")","v":""},{"$f":"IF(V47='Controls Sheet'!$C$8,VLOOKUP(V47,'EASR lookup'!$C$5:$M$273,11,FALSE),\"\")","v":""},{"$f":"IF(V47='Controls Sheet'!$C$8,'EASR Charts Controls'!W47,\"\")","v":""},{"$f":"IF(W47=\"\",\"\",VLOOKUP('Controls Sheet'!$D$8,'Controls Sheet'!$D$2:$I$6,6,FALSE))","v":360.3},484.5]
[null,"Malvern Hills","Great Yarmouth",null,null,null,null,"Welwyn Hatfield","Carlisle",null,null,null,null,null,{"$f":"IF(INDEX($A$4:$E$111,,'Controls Sheet'!$F$8)=0,\"\",INDEX($A$4:$E$111,,'Controls Sheet'!$F$8))","v":"Great Yarmouth"},{"$f":"IF(ISERROR(VLOOKUP($O48,'EASR lookup'!$C$5:$I$273,6,FALSE)),\"\",VLOOKUP($O48,'EASR lookup'!$C$5:$I$273,6,FALSE))","v":670.7},{"$f":"IF(O48='Controls Sheet'!$C$8,VLOOKUP(O48,'EASR lookup'!$C$5:$M$273,8,FALSE),\"\")","v":""},{"$f":"IF(O48='Controls Sheet'!$C$8,VLOOKUP(O48,'EASR lookup'!$C$5:$M$273,9,FALSE),\"\")","v":""},{"$f":"IF(O48='Controls Sheet'!$C$8,'EASR Charts Controls'!P48,\"\")","v":""},{"$f":"IF(P48=\"\",\"\",VLOOKUP('Controls Sheet'!$D$8,'Controls Sheet'!$D$2:$I$6,5,FALSE))","v":501.9},666.4,{"$f":"IF(INDEX($G$4:$K$111,,'Controls Sheet'!$F$8)=0,\"\",INDEX($G$4:$K$111,,'Controls Sheet'!$F$8))","v":"Carlisle"},{"$f":"IF(ISERROR(VLOOKUP($V48,'EASR lookup'!$C$5:$I$273,7,FALSE)),\"\",VLOOKUP($V48,'EASR lookup'!$C$5:$I$273,7,FALSE))","v":502.7},{"$f":"IF(V48='Controls Sheet'!$C$8,VLOOKUP(V48,'EASR lookup'!$C$5:$M$273,10,FALSE),\"\")","v":""},{"$f":"IF(V48='Controls Sheet'!$C$8,VLOOKUP(V48,'EASR lookup'!$C$5:$M$273,11,FALSE),\"\")","v":""},{"$f":"IF(V48='Controls Sheet'!$C$8,'EASR Charts Controls'!W48,\"\")","v":""},{"$f":"IF(W48=\"\",\"\",VLOOKUP('Controls Sheet'!$D$8,'Controls Sheet'!$D$2:$I$6,6,FALSE))","v":360.3},484.5]
[null,"Gedling","Wyre",null,null,null,null,"Central Bedfordshire","Orkney Islands",null,null,null,null,null,{"$f":"IF(INDEX($A$4:$E$111,,'Controls Sheet'!$F$8)=0,\"\",INDEX($A$4:$E$111,,'Controls Sheet'!$F$8))","v":"Wyre"},{"$f":"IF(ISERROR(VLOOKUP($O49,'EASR lookup'!$C$5:$I$273,6,FALSE)),\"\",VLOOKUP($O49,'EASR lookup'!$C$5:$I$273,6,FALSE))","v":680},{"$f":"IF(O49='Controls Sheet'!$C$8,VLOOKUP(O49,'EASR lookup'!$C$5:$M$273,8,FALSE),\"\")","v":""},{"$f":"IF(O49='Controls Sheet'!$C$8,VLOOKUP(O49,'EASR lookup'!$C$5:$M$273,9,FALSE),\"\")","v":""},{"$f":"IF(O49='Controls Sheet'!$C$8,'EASR Charts Controls'!P49,\"\")","v":""},{"$f":"IF(P49=\"\",\"\",VLOOKUP('Controls Sheet'!$D$8,'Controls Sheet'!$D$2:$I$6,5,FALSE))","v":501.9},666.4,{"$f":"IF(INDEX($G$4:$K$111,,'Controls Sheet'!$F$8)=0,\"\",INDEX($G$4:$K$111,,'Controls Sheet'!$F$8))","v":"Orkney Islands"},{"$f":"IF(ISERROR(VLOOKUP($V49,'EASR lookup'!$C$5:$I$273,7,FALSE)),\"\",VLOOKUP($V49,'EASR lookup'!$C$5:$I$273,7,FALSE))","v":505.2},{"$f":"IF(V49='Controls Sheet'!$C$8,VLOOKUP(V49,'EASR lookup'!$C$5:$M$273,10,FALSE),\"\")","v":""},{"$f":"IF(V49='Controls Sheet'!$C$8,VLOOKUP(V49,'EASR lookup'!$C$5:$M$273,11,FALSE),\"\")","v":""},{"$f":"IF(V49='Controls Sheet'!$C$8,'EASR Charts Controls'!W49,\"\")","v":""},{"$f":"IF(W49=\"\",\"\",VLOOKUP('Controls Sheet'!$D$8,'Controls Sheet'!$D$2:$I$6,6,FALSE))","v":360.3},484.5]
[null,"Broxtowe","Denbighshire",null,null,null,null,"Monmouthshire","Dumfries & Galloway",null,null,null,null,null,{"$f":"IF(INDEX($A$4:$E$111,,'Controls Sheet'!$F$8)=0,\"\",INDEX($A$4:$E$111,,'Controls Sheet'!$F$8))","v":"Denbighshire"},{"$f":"IF(ISERROR(VLOOKUP($O50,'EASR lookup'!$C$5:$I$273,6,FALSE)),\"\",VLOOKUP($O50,'EASR lookup'!$C$5:$I$273,6,FALSE))","v":681.1},{"$f":"IF(O50='Controls Sheet'!$C$8,VLOOKUP(O50,'EASR lookup'!$C$5:$M$273,8,FALSE),\"\")","v":""},{"$f":"IF(O50='Controls Sheet'!$C$8,VLOOKUP(O50,'EASR lookup'!$C$5:$M$273,9,FALSE),\"\")","v":""},{"$f":"IF(O50='Controls Sheet'!$C$8,'EASR Charts Controls'!P50,\"\")","v":""},{"$f":"IF(P50=\"\",\"\",VLOOKUP('Controls Sheet'!$D$8,'Controls Sheet'!$D$2:$I$6,5,FALSE))","v":501.9},666.4,{"$f":"IF(INDEX($G$4:$K$111,,'Controls Sheet'!$F$8)=0,\"\",INDEX($G$4:$K$111,,'Controls Sheet'!$F$8))","v":"Dumfries & Galloway"},{"$f":"IF(ISERROR(VLOOKUP($V50,'EASR lookup'!$C$5:$I$273,7,FALSE)),\"\",VLOOKUP($V50,'EASR lookup'!$C$5:$I$273,7,FALSE))","v":505.9},{"$f":"IF(V50='Controls Sheet'!$C$8,VLOOKUP(V50,'EASR lookup'!$C$5:$M$273,10,FALSE),\"\")","v":""},{"$f":"IF(V50='Controls Sheet'!$C$8,VLOOKUP(V50,'EASR lookup'!$C$5:$M$273,11,FALSE),\"\")","v":""},{"$f":"IF(V50='Controls Sheet'!$C$8,'EASR Charts Controls'!W50,\"\")","v":""},{"$f":"IF(W50=\"\",\"\",VLOOKUP('Controls Sheet'!$D$8,'Controls Sheet'!$D$2:$I$6,6,FALSE))","v":360.3},484.5]
[null,"Stafford","Dumfries & Galloway",null,null,null,null,"Wiltshire","Scottish Borders",null,null,null,null,null,{"$f":"IF(INDEX($A$4:$E$111,,'Controls Sheet'!$F$8)=0,\"\",INDEX($A$4:$E$111,,'Controls Sheet'!$F$8))","v":"Dumfries & Galloway"},{"$f":"IF(ISERROR(VLOOKUP($O51,'EASR lookup'!$C$5:$I$273,6,FALSE)),\"\",VLOOKUP($O51,'EASR lookup'!$C$5:$I$273,6,FALSE))","v":687.7},{"$f":"IF(O51='Controls Sheet'!$C$8,VLOOKUP(O51,'EASR lookup'!$C$5:$M$273,8,FALSE),\"\")","v":""},{"$f":"IF(O51='Controls Sheet'!$C$8,VLOOKUP(O51,'EASR lookup'!$C$5:$M$273,9,FALSE),\"\")","v":""},{"$f":"IF(O51='Controls Sheet'!$C$8,'EASR Charts Controls'!P51,\"\")","v":""},{"$f":"IF(P51=\"\",\"\",VLOOKUP('Controls Sheet'!$D$8,'Controls Sheet'!$D$2:$I$6,5,FALSE))","v":501.9},666.4,{"$f":"IF(INDEX($G$4:$K$111,,'Controls Sheet'!$F$8)=0,\"\",INDEX($G$4:$K$111,,'Controls Sheet'!$F$8))","v":"Scottish Borders"},{"$f":"IF(ISERROR(VLOOKUP($V51,'EASR lookup'!$C$5:$I$273,7,FALSE)),\"\",VLOOKUP($V51,'EASR lookup'!$C$5:$I$273,7,FALSE))","v":507.4},{"$f":"IF(V51='Controls Sheet'!$C$8,VLOOKUP(V51,'EASR lookup'!$C$5:$M$273,10,FALSE),\"\")","v":""},{"$f":"IF(V51='Controls Sheet'!$C$8,VLOOKUP(V51,'EASR lookup'!$C$5:$M$273,11,FALSE),\"\")","v":""},{"$f":"IF(V51='Controls Sheet'!$C$8,'EASR Charts Controls'!W51,\"\")","v":""},{"$f":"IF(W51=\"\",\"\",VLOOKUP('Controls Sheet'!$D$8,'Controls Sheet'!$D$2:$I$6,6,FALSE))","v":360.3},484.5]
[null,"Poole","East Lindsey",null,null,null,null,"Castlereagh","Allerdale",null,null,null,null,null,{"$f":"IF(INDEX($A$4:$E$111,,'Controls Sheet'!$F$8)=0,\"\",INDEX($A$4:$E$111,,'Controls Sheet'!$F$8))","v":"East Lindsey"},{"$f":"IF(ISERROR(VLOOKUP($O52,'EASR lookup'!$C$5:$I$273,6,FALSE)),\"\",VLOOKUP($O52,'EASR lookup'!$C$5:$I$273,6,FALSE))","v":691.5},{"$f":"IF(O52='Controls Sheet'!$C$8,VLOOKUP(O52,'EASR lookup'!$C$5:$M$273,8,FALSE),\"\")","v":""},{"$f":"IF(O52='Controls Sheet'!$C$8,VLOOKUP(O52,'EASR lookup'!$C$5:$M$273,9,FALSE),\"\")","v":""},{"$f":"IF(O52='Controls Sheet'!$C$8,'EASR Charts Controls'!P52,\"\")","v":""},{"$f":"IF(P52=\"\",\"\",VLOOKUP('Controls Sheet'!$D$8,'Controls Sheet'!$D$2:$I$6,5,FALSE))","v":501.9},666.4,{"$f":"IF(INDEX($G$4:$K$111,,'Controls Sheet'!$F$8)=0,\"\",INDEX($G$4:$K$111,,'Controls Sheet'!$F$8))","v":"Allerdale"},{"$f":"IF(ISERROR(VLOOKUP($V52,'EASR lookup'!$C$5:$I$273,7,FALSE)),\"\",VLOOKUP($V52,'EASR lookup'!$C$5:$I$273,7,FALSE))","v":507.7},{"$f":"IF(V52='Controls Sheet'!$C$8,VLOOKUP(V52,'EASR lookup'!$C$5:$M$273,10,FALSE),\"\")","v":""},{"$f":"IF(V52='Controls Sheet'!$C$8,VLOOKUP(V52,'EASR lookup'!$C$5:$M$273,11,FALSE),\"\")","v":""},{"$f":"IF(V52='Controls Sheet'!$C$8,'EASR Charts Controls'!W52,\"\")","v":""},{"$f":"IF(W52=\"\",\"\",VLOOKUP('Controls Sheet'!$D$8,'Controls Sheet'!$D$2:$I$6,6,FALSE))","v":360.3},484.5]
[null,"Cheshire East","Moray",null,null,null,null,"Maldon","Moray",null,null,null,null,null,{"$f":"IF(INDEX($A$4:$E$111,,'Controls Sheet'!$F$8)=0,\"\",INDEX($A$4:$E$111,,'Controls Sheet'!$F$8))","v":"Moray"},{"$f":"IF(ISERROR(VLOOKUP($O53,'EASR lookup'!$C$5:$I$273,6,FALSE)),\"\",VLOOKUP($O53,'EASR lookup'!$C$5:$I$273,6,FALSE))","v":709},{"$f":"IF(O53='Controls Sheet'!$C$8,VLOOKUP(O53,'EASR lookup'!$C$5:$M$273,8,FALSE),\"\")","v":""},{"$f":"IF(O53='Controls Sheet'!$C$8,VLOOKUP(O53,'EASR lookup'!$C$5:$M$273,9,FALSE),\"\")","v":""},{"$f":"IF(O53='Controls Sheet'!$C$8,'EASR Charts Controls'!P53,\"\")","v":""},{"$f":"IF(P53=\"\",\"\",VLOOKUP('Controls Sheet'!$D$8,'Controls Sheet'!$D$2:$I$6,5,FALSE))","v":501.9},666.4,{"$f":"IF(INDEX($G$4:$K$111,,'Controls Sheet'!$F$8)=0,\"\",INDEX($G$4:$K$111,,'Controls Sheet'!$F$8))","v":"Moray"},{"$f":"IF(ISERROR(VLOOKUP($V53,'EASR lookup'!$C$5:$I$273,7,FALSE)),\"\",VLOOKUP($V53,'EASR lookup'!$C$5:$I$273,7,FALSE))","v":531.20000000000005},{"$f":"IF(V53='Controls Sheet'!$C$8,VLOOKUP(V53,'EASR lookup'!$C$5:$M$273,10,FALSE),\"\")","v":""},{"$f":"IF(V53='Controls Sheet'!$C$8,VLOOKUP(V53,'EASR lookup'!$C$5:$M$273,11,FALSE),\"\")","v":""},{"$f":"IF(V53='Controls Sheet'!$C$8,'EASR Charts Controls'!W53,\"\")","v":""},{"$f":"IF(W53=\"\",\"\",VLOOKUP('Controls Sheet'!$D$8,'Controls Sheet'!$D$2:$I$6,6,FALSE))","v":360.3},484.5]
[null,"Maldon","Shetland Islands",null,null,null,null,"East Dunbartonshire","Eilean Siar",null,null,null,null,null,{"$f":"IF(INDEX($A$4:$E$111,,'Controls Sheet'!$F$8)=0,\"\",INDEX($A$4:$E$111,,'Controls Sheet'!$F$8))","v":"Shetland Islands"},{"$f":"IF(ISERROR(VLOOKUP($O54,'EASR lookup'!$C$5:$I$273,6,FALSE)),\"\",VLOOKUP($O54,'EASR lookup'!$C$5:$I$273,6,FALSE))","v":714.8},{"$f":"IF(O54='Controls Sheet'!$C$8,VLOOKUP(O54,'EASR lookup'!$C$5:$M$273,8,FALSE),\"\")","v":""},{"$f":"IF(O54='Controls Sheet'!$C$8,VLOOKUP(O54,'EASR lookup'!$C$5:$M$273,9,FALSE),\"\")","v":""},{"$f":"IF(O54='Controls Sheet'!$C$8,'EASR Charts Controls'!P54,\"\")","v":""},{"$f":"IF(P54=\"\",\"\",VLOOKUP('Controls Sheet'!$D$8,'Controls Sheet'!$D$2:$I$6,5,FALSE))","v":501.9},666.4,{"$f":"IF(INDEX($G$4:$K$111,,'Controls Sheet'!$F$8)=0,\"\",INDEX($G$4:$K$111,,'Controls Sheet'!$F$8))","v":"Eilean Siar"},{"$f":"IF(ISERROR(VLOOKUP($V54,'EASR lookup'!$C$5:$I$273,7,FALSE)),\"\",VLOOKUP($V54,'EASR lookup'!$C$5:$I$273,7,FALSE))","v":532.70000000000005},{"$f":"IF(V54='Controls Sheet'!$C$8,VLOOKUP(V54,'EASR lookup'!$C$5:$M$273,10,FALSE),\"\")","v":""},{"$f":"IF(V54='Controls Sheet'!$C$8,VLOOKUP(V54,'EASR lookup'!$C$5:$M$273,11,FALSE),\"\")","v":""},{"$f":"IF(V54='Controls Sheet'!$C$8,'EASR Charts Controls'!W54,\"\")","v":""},{"$f":"IF(W54=\"\",\"\",VLOOKUP('Controls Sheet'!$D$8,'Controls Sheet'!$D$2:$I$6,6,FALSE))","v":360.3},484.5]
[null,"Central Bedfordshire","Argyll & Bute",null,null,null,null,"Harrogate","Argyll & Bute",null,null,null,null,null,{"$f":"IF(INDEX($A$4:$E$111,,'Controls Sheet'!$F$8)=0,\"\",INDEX($A$4:$E$111,,'Controls Sheet'!$F$8))","v":"Argyll & Bute"},{"$f":"IF(ISERROR(VLOOKUP($O55,'EASR lookup'!$C$5:$I$273,6,FALSE)),\"\",VLOOKUP($O55,'EASR lookup'!$C$5:$I$273,6,FALSE))","v":717.8},{"$f":"IF(O55='Controls Sheet'!$C$8,VLOOKUP(O55,'EASR lookup'!$C$5:$M$273,8,FALSE),\"\")","v":""},{"$f":"IF(O55='Controls Sheet'!$C$8,VLOOKUP(O55,'EASR lookup'!$C$5:$M$273,9,FALSE),\"\")","v":""},{"$f":"IF(O55='Controls Sheet'!$C$8,'EASR Charts Controls'!P55,\"\")","v":""},{"$f":"IF(P55=\"\",\"\",VLOOKUP('Controls Sheet'!$D$8,'Controls Sheet'!$D$2:$I$6,5,FALSE))","v":501.9},666.4,{"$f":"IF(INDEX($G$4:$K$111,,'Controls Sheet'!$F$8)=0,\"\",INDEX($G$4:$K$111,,'Controls Sheet'!$F$8))","v":"Argyll & Bute"},{"$f":"IF(ISERROR(VLOOKUP($V55,'EASR lookup'!$C$5:$I$273,7,FALSE)),\"\",VLOOKUP($V55,'EASR lookup'!$C$5:$I$273,7,FALSE))","v":533.29999999999995},{"$f":"IF(V55='Controls Sheet'!$C$8,VLOOKUP(V55,'EASR lookup'!$C$5:$M$273,10,FALSE),\"\")","v":""},{"$f":"IF(V55='Controls Sheet'!$C$8,VLOOKUP(V55,'EASR lookup'!$C$5:$M$273,11,FALSE),\"\")","v":""},{"$f":"IF(V55='Controls Sheet'!$C$8,'EASR Charts Controls'!W55,\"\")","v":""},{"$f":"IF(W55=\"\",\"\",VLOOKUP('Controls Sheet'!$D$8,'Controls Sheet'!$D$2:$I$6,6,FALSE))","v":360.3},484.5]
[null,"Breckland","Eilean Siar",null,null,null,null,"Cheltenham","Denbighshire",null,null,null,null,null,{"$f":"IF(INDEX($A$4:$E$111,,'Controls Sheet'!$F$8)=0,\"\",INDEX($A$4:$E$111,,'Controls Sheet'!$F$8))","v":"Eilean Siar"},{"$f":"IF(ISERROR(VLOOKUP($O56,'EASR lookup'!$C$5:$I$273,6,FALSE)),\"\",VLOOKUP($O56,'EASR lookup'!$C$5:$I$273,6,FALSE))","v":817.3},{"$f":"IF(O56='Controls Sheet'!$C$8,VLOOKUP(O56,'EASR lookup'!$C$5:$M$273,8,FALSE),\"\")","v":""},{"$f":"IF(O56='Controls Sheet'!$C$8,VLOOKUP(O56,'EASR lookup'!$C$5:$M$273,9,FALSE),\"\")","v":""},{"$f":"IF(O56='Controls Sheet'!$C$8,'EASR Charts Controls'!P56,\"\")","v":""},{"$f":"IF(P56=\"\",\"\",VLOOKUP('Controls Sheet'!$D$8,'Controls Sheet'!$D$2:$I$6,5,FALSE))","v":501.9},666.4,{"$f":"IF(INDEX($G$4:$K$111,,'Controls Sheet'!$F$8)=0,\"\",INDEX($G$4:$K$111,,'Controls Sheet'!$F$8))","v":"Denbighshire"},{"$f":"IF(ISERROR(VLOOKUP($V56,'EASR lookup'!$C$5:$I$273,7,FALSE)),\"\",VLOOKUP($V56,'EASR lookup'!$C$5:$I$273,7,FALSE))","v":547.70000000000005},{"$f":"IF(V56='Controls Sheet'!$C$8,VLOOKUP(V56,'EASR lookup'!$C$5:$M$273,10,FALSE),\"\")","v":""},{"$f":"IF(V56='Controls Sheet'!$C$8,VLOOKUP(V56,'EASR lookup'!$C$5:$M$273,11,FALSE),\"\")","v":""},{"$f":"IF(V56='Controls Sheet'!$C$8,'EASR Charts Controls'!W56,\"\")","v":""},{"$f":"IF(W56=\"\",\"\",VLOOKUP('Controls Sheet'!$D$8,'Controls Sheet'!$D$2:$I$6,6,FALSE))","v":360.3},484.5]
[null,"East Dunbartonshire","Blackpool",null,null,null,null,"North Down","Blackpool",null,null,null,null,null,{"$f":"IF(INDEX($A$4:$E$111,,'Controls Sheet'!$F$8)=0,\"\",INDEX($A$4:$E$111,,'Controls Sheet'!$F$8))","v":"Blackpool"},{"$f":"IF(ISERROR(VLOOKUP($O57,'EASR lookup'!$C$5:$I$273,6,FALSE)),\"\",VLOOKUP($O57,'EASR lookup'!$C$5:$I$273,6,FALSE))","v":879.3},{"$f":"IF(O57='Controls Sheet'!$C$8,VLOOKUP(O57,'EASR lookup'!$C$5:$M$273,8,FALSE),\"\")","v":""},{"$f":"IF(O57='Controls Sheet'!$C$8,VLOOKUP(O57,'EASR lookup'!$C$5:$M$273,9,FALSE),\"\")","v":""},{"$f":"IF(O57='Controls Sheet'!$C$8,'EASR Charts Controls'!P57,\"\")","v":""},{"$f":"IF(P57=\"\",\"\",VLOOKUP('Controls Sheet'!$D$8,'Controls Sheet'!$D$2:$I$6,5,FALSE))","v":501.9},666.4,{"$f":"IF(INDEX($G$4:$K$111,,'Controls Sheet'!$F$8)=0,\"\",INDEX($G$4:$K$111,,'Controls Sheet'!$F$8))","v":"Blackpool"},{"$f":"IF(ISERROR(VLOOKUP($V57,'EASR lookup'!$C$5:$I$273,7,FALSE)),\"\",VLOOKUP($V57,'EASR lookup'!$C$5:$I$273,7,FALSE))","v":576.6},{"$f":"IF(V57='Controls Sheet'!$C$8,VLOOKUP(V57,'EASR lookup'!$C$5:$M$273,10,FALSE),\"\")","v":""},{"$f":"IF(V57='Controls Sheet'!$C$8,VLOOKUP(V57,'EASR lookup'!$C$5:$M$273,11,FALSE),\"\")","v":""},{"$f":"IF(V57='Controls Sheet'!$C$8,'EASR Charts Controls'!W57,\"\")","v":""},{"$f":"IF(W57=\"\",\"\",VLOOKUP('Controls Sheet'!$D$8,'Controls Sheet'!$D$2:$I$6,6,FALSE))","v":360.3},484.5]
[null,"Solihull",null,null,null,null,null,"South Kesteven",null,null,null,null,null,null,{"$f":"IF(INDEX($A$4:$E$111,,'Controls Sheet'!$F$8)=0,\"\",INDEX($A$4:$E$111,,'Controls Sheet'!$F$8))","v":""},{"$f":"IF(ISERROR(VLOOKUP($O58,'EASR lookup'!$C$5:$I$273,6,FALSE)),\"\",VLOOKUP($O58,'EASR lookup'!$C$5:$I$273,6,FALSE))","v":""},{"$f":"IF(O58='Controls Sheet'!$C$8,VLOOKUP(O58,'EASR lookup'!$C$5:$M$273,8,FALSE),\"\")","v":""},{"$f":"IF(O58='Controls Sheet'!$C$8,VLOOKUP(O58,'EASR lookup'!$C$5:$M$273,9,FALSE),\"\")","v":""},{"$f":"IF(O58='Controls Sheet'!$C$8,'EASR Charts Controls'!P58,\"\")","v":""},{"$f":"IF(P58=\"\",\"\",VLOOKUP('Controls Sheet'!$D$8,'Controls Sheet'!$D$2:$I$6,5,FALSE))","v":""},"",{"$f":"IF(INDEX($G$4:$K$111,,'Controls Sheet'!$F$8)=0,\"\",INDEX($G$4:$K$111,,'Controls Sheet'!$F$8))","v":""},{"$f":"IF(ISERROR(VLOOKUP($V58,'EASR lookup'!$C$5:$I$273,7,FALSE)),\"\",VLOOKUP($V58,'EASR lookup'!$C$5:$I$273,7,FALSE))","v":""},{"$f":"IF(V58='Controls Sheet'!$C$8,VLOOKUP(V58,'EASR lookup'!$C$5:$M$273,10,FALSE),\"\")","v":""},{"$f":"IF(V58='Controls Sheet'!$C$8,VLOOKUP(V58,'EASR lookup'!$C$5:$M$273,11,FALSE),\"\")","v":""},{"$f":"IF(V58='Controls Sheet'!$C$8,'EASR Charts Controls'!W58,\"\")","v":""},{"$f":"IF(W58=\"\",\"\",VLOOKUP('Controls Sheet'!$D$8,'Controls Sheet'!$D$2:$I$6,6,FALSE))","v":""},""]
[null,"Harrogate",null,null,null,null,null,"Colchester",null,null,null,null,null,null,{"$f":"IF(INDEX($A$4:$E$111,,'Controls Sheet'!$F$8)=0,\"\",INDEX($A$4:$E$111,,'Controls Sheet'!$F$8))","v":""},{"$f":"IF(ISERROR(VLOOKUP($O59,'EASR lookup'!$C$5:$I$273,6,FALSE)),\"\",VLOOKUP($O59,'EASR lookup'!$C$5:$I$273,6,FALSE))","v":""},{"$f":"IF(O59='Controls Sheet'!$C$8,VLOOKUP(O59,'EASR lookup'!$C$5:$M$273,8,FALSE),\"\")","v":""},{"$f":"IF(O59='Controls Sheet'!$C$8,VLOOKUP(O59,'EASR lookup'!$C$5:$M$273,9,FALSE),\"\")","v":""},{"$f":"IF(O59='Controls Sheet'!$C$8,'EASR Charts Controls'!P59,\"\")","v":""},{"$f":"IF(P59=\"\",\"\",VLOOKUP('Controls Sheet'!$D$8,'Controls Sheet'!$D$2:$I$6,5,FALSE))","v":""},"",{"$f":"IF(INDEX($G$4:$K$111,,'Controls Sheet'!$F$8)=0,\"\",INDEX($G$4:$K$111,,'Controls Sheet'!$F$8))","v":""},{"$f":"IF(ISERROR(VLOOKUP($V59,'EASR lookup'!$C$5:$I$273,7,FALSE)),\"\",VLOOKUP($V59,'EASR lookup'!$C$5:$I$273,7,FALSE))","v":""},{"$f":"IF(V59='Controls Sheet'!$C$8,VLOOKUP(V59,'EASR lookup'!$C$5:$M$273,10,FALSE),\"\")","v":""},{"$f":"IF(V59='Controls Sheet'!$C$8,VLOOKUP(V59,'EASR lookup'!$C$5:$M$273,11,FALSE),\"\")","v":""},{"$f":"IF(V59='Controls Sheet'!$C$8,'EASR Charts Controls'!W59,\"\")","v":""},{"$f":"IF(W59=\"\",\"\",VLOOKUP('Controls Sheet'!$D$8,'Controls Sheet'!$D$2:$I$6,6,FALSE))","v":""},""]
[null,"Harborough",null,null,null,null,null,"East Northamptonshire",null,null,null,null,null,null,{"$f":"IF(INDEX($A$4:$E$111,,'Controls Sheet'!$F$8)=0,\"\",INDEX($A$4:$E$111,,'Controls Sheet'!$F$8))","v":""},{"$f":"IF(ISERROR(VLOOKUP($O60,'EASR lookup'!$C$5:$I$273,6,FALSE)),\"\",VLOOKUP($O60,'EASR lookup'!$C$5:$I$273,6,FALSE))","v":""},{"$f":"IF(O60='Controls Sheet'!$C$8,VLOOKUP(O60,'EASR lookup'!$C$5:$M$273,8,FALSE),\"\")","v":""},{"$f":"IF(O60='Controls Sheet'!$C$8,VLOOKUP(O60,'EASR lookup'!$C$5:$M$273,9,FALSE),\"\")","v":""},{"$f":"IF(O60='Controls Sheet'!$C$8,'EASR Charts Controls'!P60,\"\")","v":""},{"$f":"IF(P60=\"\",\"\",VLOOKUP('Controls Sheet'!$D$8,'Controls Sheet'!$D$2:$I$6,5,FALSE))","v":""},"",{"$f":"IF(INDEX($G$4:$K$111,,'Controls Sheet'!$F$8)=0,\"\",INDEX($G$4:$K$111,,'Controls Sheet'!$F$8))","v":""},{"$f":"IF(ISERROR(VLOOKUP($V60,'EASR lookup'!$C$5:$I$273,7,FALSE)),\"\",VLOOKUP($V60,'EASR lookup'!$C$5:$I$273,7,FALSE))","v":""},{"$f":"IF(V60='Controls Sheet'!$C$8,VLOOKUP(V60,'EASR lookup'!$C$5:$M$273,10,FALSE),\"\")","v":""},{"$f":"IF(V60='Controls Sheet'!$C$8,VLOOKUP(V60,'EASR lookup'!$C$5:$M$273,11,FALSE),\"\")","v":""},{"$f":"IF(V60='Controls Sheet'!$C$8,'EASR Charts Controls'!W60,\"\")","v":""},{"$f":"IF(W60=\"\",\"\",VLOOKUP('Controls Sheet'!$D$8,'Controls Sheet'!$D$2:$I$6,6,FALSE))","v":""},""]
[null,"Rutland",null,null,null,null,null,"West Oxfordshire",null,null,null,null,null,null,{"$f":"IF(INDEX($A$4:$E$111,,'Controls Sheet'!$F$8)=0,\"\",INDEX($A$4:$E$111,,'Controls Sheet'!$F$8))","v":""},{"$f":"IF(ISERROR(VLOOKUP($O61,'EASR lookup'!$C$5:$I$273,6,FALSE)),\"\",VLOOKUP($O61,'EASR lookup'!$C$5:$I$273,6,FALSE))","v":""},{"$f":"IF(O61='Controls Sheet'!$C$8,VLOOKUP(O61,'EASR lookup'!$C$5:$M$273,8,FALSE),\"\")","v":""},{"$f":"IF(O61='Controls Sheet'!$C$8,VLOOKUP(O61,'EASR lookup'!$C$5:$M$273,9,FALSE),\"\")","v":""},{"$f":"IF(O61='Controls Sheet'!$C$8,'EASR Charts Controls'!P61,\"\")","v":""},{"$f":"IF(P61=\"\",\"\",VLOOKUP('Controls Sheet'!$D$8,'Controls Sheet'!$D$2:$I$6,5,FALSE))","v":""},"",{"$f":"IF(INDEX($G$4:$K$111,,'Controls Sheet'!$F$8)=0,\"\",INDEX($G$4:$K$111,,'Controls Sheet'!$F$8))","v":""},{"$f":"IF(ISERROR(VLOOKUP($V61,'EASR lookup'!$C$5:$I$273,7,FALSE)),\"\",VLOOKUP($V61,'EASR lookup'!$C$5:$I$273,7,FALSE))","v":""},{"$f":"IF(V61='Controls Sheet'!$C$8,VLOOKUP(V61,'EASR lookup'!$C$5:$M$273,10,FALSE),\"\")","v":""},{"$f":"IF(V61='Controls Sheet'!$C$8,VLOOKUP(V61,'EASR lookup'!$C$5:$M$273,11,FALSE),\"\")","v":""},{"$f":"IF(V61='Controls Sheet'!$C$8,'EASR Charts Controls'!W61,\"\")","v":""},{"$f":"IF(W61=\"\",\"\",VLOOKUP('Controls Sheet'!$D$8,'Controls Sheet'!$D$2:$I$6,6,FALSE))","v":""},""]
[null,"Canterbury",null,null,null,null,null,"Lichfield",null,null,null,null,null,null,{"$f":"IF(INDEX($A$4:$E$111,,'Controls Sheet'!$F$8)=0,\"\",INDEX($A$4:$E$111,,'Controls Sheet'!$F$8))","v":""},{"$f":"IF(ISERROR(VLOOKUP($O62,'EASR lookup'!$C$5:$I$273,6,FALSE)),\"\",VLOOKUP($O62,'EASR lookup'!$C$5:$I$273,6,FALSE))","v":""},{"$f":"IF(O62='Controls Sheet'!$C$8,VLOOKUP(O62,'EASR lookup'!$C$5:$M$273,8,FALSE),\"\")","v":""},{"$f":"IF(O62='Controls Sheet'!$C$8,VLOOKUP(O62,'EASR lookup'!$C$5:$M$273,9,FALSE),\"\")","v":""},{"$f":"IF(O62='Controls Sheet'!$C$8,'EASR Charts Controls'!P62,\"\")","v":""},{"$f":"IF(P62=\"\",\"\",VLOOKUP('Controls Sheet'!$D$8,'Controls Sheet'!$D$2:$I$6,5,FALSE))","v":""},"",{"$f":"IF(INDEX($G$4:$K$111,,'Controls Sheet'!$F$8)=0,\"\",INDEX($G$4:$K$111,,'Controls Sheet'!$F$8))","v":""},{"$f":"IF(ISERROR(VLOOKUP($V62,'EASR lookup'!$C$5:$I$273,7,FALSE)),\"\",VLOOKUP($V62,'EASR lookup'!$C$5:$I$273,7,FALSE))","v":""},{"$f":"IF(V62='Controls Sheet'!$C$8,VLOOKUP(V62,'EASR lookup'!$C$5:$M$273,10,FALSE),\"\")","v":""},{"$f":"IF(V62='Controls Sheet'!$C$8,VLOOKUP(V62,'EASR lookup'!$C$5:$M$273,11,FALSE),\"\")","v":""},{"$f":"IF(V62='Controls Sheet'!$C$8,'EASR Charts Controls'!W62,\"\")","v":""},{"$f":"IF(W62=\"\",\"\",VLOOKUP('Controls Sheet'!$D$8,'Controls Sheet'!$D$2:$I$6,6,FALSE))","v":""},""]
[null,"Hinckley and Bosworth",null,null,null,null,null,"Huntingdonshire",null,null,null,null,null,null,{"$f":"IF(INDEX($A$4:$E$111,,'Controls Sheet'!$F$8)=0,\"\",INDEX($A$4:$E$111,,'Controls Sheet'!$F$8))","v":""},{"$f":"IF(ISERROR(VLOOKUP($O63,'EASR lookup'!$C$5:$I$273,6,FALSE)),\"\",VLOOKUP($O63,'EASR lookup'!$C$5:$I$273,6,FALSE))","v":""},{"$f":"IF(O63='Controls Sheet'!$C$8,VLOOKUP(O63,'EASR lookup'!$C$5:$M$273,8,FALSE),\"\")","v":""},{"$f":"IF(O63='Controls Sheet'!$C$8,VLOOKUP(O63,'EASR lookup'!$C$5:$M$273,9,FALSE),\"\")","v":""},{"$f":"IF(O63='Controls Sheet'!$C$8,'EASR Charts Controls'!P63,\"\")","v":""},{"$f":"IF(P63=\"\",\"\",VLOOKUP('Controls Sheet'!$D$8,'Controls Sheet'!$D$2:$I$6,5,FALSE))","v":""},"",{"$f":"IF(INDEX($G$4:$K$111,,'Controls Sheet'!$F$8)=0,\"\",INDEX($G$4:$K$111,,'Controls Sheet'!$F$8))","v":""},{"$f":"IF(ISERROR(VLOOKUP($V63,'EASR lookup'!$C$5:$I$273,7,FALSE)),\"\",VLOOKUP($V63,'EASR lookup'!$C$5:$I$273,7,FALSE))","v":""},{"$f":"IF(V63='Controls Sheet'!$C$8,VLOOKUP(V63,'EASR lookup'!$C$5:$M$273,10,FALSE),\"\")","v":""},{"$f":"IF(V63='Controls Sheet'!$C$8,VLOOKUP(V63,'EASR lookup'!$C$5:$M$273,11,FALSE),\"\")","v":""},{"$f":"IF(V63='Controls Sheet'!$C$8,'EASR Charts Controls'!W63,\"\")","v":""},{"$f":"IF(W63=\"\",\"\",VLOOKUP('Controls Sheet'!$D$8,'Controls Sheet'!$D$2:$I$6,6,FALSE))","v":""},""]
[null,"South Ribble",null,null,null,null,null,"Hinckley and Bosworth",null,null,null,null,null,null,{"$f":"IF(INDEX($A$4:$E$111,,'Controls Sheet'!$F$8)=0,\"\",INDEX($A$4:$E$111,,'Controls Sheet'!$F$8))","v":""},{"$f":"IF(ISERROR(VLOOKUP($O64,'EASR lookup'!$C$5:$I$273,6,FALSE)),\"\",VLOOKUP($O64,'EASR lookup'!$C$5:$I$273,6,FALSE))","v":""},{"$f":"IF(O64='Controls Sheet'!$C$8,VLOOKUP(O64,'EASR lookup'!$C$5:$M$273,8,FALSE),\"\")","v":""},{"$f":"IF(O64='Controls Sheet'!$C$8,VLOOKUP(O64,'EASR lookup'!$C$5:$M$273,9,FALSE),\"\")","v":""},{"$f":"IF(O64='Controls Sheet'!$C$8,'EASR Charts Controls'!P64,\"\")","v":""},{"$f":"IF(P64=\"\",\"\",VLOOKUP('Controls Sheet'!$D$8,'Controls Sheet'!$D$2:$I$6,5,FALSE))","v":""},"",{"$f":"IF(INDEX($G$4:$K$111,,'Controls Sheet'!$F$8)=0,\"\",INDEX($G$4:$K$111,,'Controls Sheet'!$F$8))","v":""},{"$f":"IF(ISERROR(VLOOKUP($V64,'EASR lookup'!$C$5:$I$273,7,FALSE)),\"\",VLOOKUP($V64,'EASR lookup'!$C$5:$I$273,7,FALSE))","v":""},{"$f":"IF(V64='Controls Sheet'!$C$8,VLOOKUP(V64,'EASR lookup'!$C$5:$M$273,10,FALSE),\"\")","v":""},{"$f":"IF(V64='Controls Sheet'!$C$8,VLOOKUP(V64,'EASR lookup'!$C$5:$M$273,11,FALSE),\"\")","v":""},{"$f":"IF(V64='Controls Sheet'!$C$8,'EASR Charts Controls'!W64,\"\")","v":""},{"$f":"IF(W64=\"\",\"\",VLOOKUP('Controls Sheet'!$D$8,'Controls Sheet'!$D$2:$I$6,6,FALSE))","v":""},""]
[null,"Lichfield",null,null,null,null,null,"Broxtowe",null,null,null,null,null,null,{"$f":"IF(INDEX($A$4:$E$111,,'Controls Sheet'!$F$8)=0,\"\",INDEX($A$4:$E$111,,'Controls Sheet'!$F$8))","v":""},{"$f":"IF(ISERROR(VLOOKUP($O65,'EASR lookup'!$C$5:$I$273,6,FALSE)),\"\",VLOOKUP($O65,'EASR lookup'!$C$5:$I$273,6,FALSE))","v":""},{"$f":"IF(O65='Controls Sheet'!$C$8,VLOOKUP(O65,'EASR lookup'!$C$5:$M$273,8,FALSE),\"\")","v":""},{"$f":"IF(O65='Controls Sheet'!$C$8,VLOOKUP(O65,'EASR lookup'!$C$5:$M$273,9,FALSE),\"\")","v":""},{"$f":"IF(O65='Controls Sheet'!$C$8,'EASR Charts Controls'!P65,\"\")","v":""},{"$f":"IF(P65=\"\",\"\",VLOOKUP('Controls Sheet'!$D$8,'Controls Sheet'!$D$2:$I$6,5,FALSE))","v":""},"",{"$f":"IF(INDEX($G$4:$K$111,,'Controls Sheet'!$F$8)=0,\"\",INDEX($G$4:$K$111,,'Controls Sheet'!$F$8))","v":""},{"$f":"IF(ISERROR(VLOOKUP($V65,'EASR lookup'!$C$5:$I$273,7,FALSE)),\"\",VLOOKUP($V65,'EASR lookup'!$C$5:$I$273,7,FALSE))","v":""},{"$f":"IF(V65='Controls Sheet'!$C$8,VLOOKUP(V65,'EASR lookup'!$C$5:$M$273,10,FALSE),\"\")","v":""},{"$f":"IF(V65='Controls Sheet'!$C$8,VLOOKUP(V65,'EASR lookup'!$C$5:$M$273,11,FALSE),\"\")","v":""},{"$f":"IF(V65='Controls Sheet'!$C$8,'EASR Charts Controls'!W65,\"\")","v":""},{"$f":"IF(W65=\"\",\"\",VLOOKUP('Controls Sheet'!$D$8,'Controls Sheet'!$D$2:$I$6,6,FALSE))","v":""},""]
[null,"North Somerset",null,null,null,null,null,"Bromsgrove",null,null,null,null,null,null,{"$f":"IF(INDEX($A$4:$E$111,,'Controls Sheet'!$F$8)=0,\"\",INDEX($A$4:$E$111,,'Controls Sheet'!$F$8))","v":""},{"$f":"IF(ISERROR(VLOOKUP($O66,'EASR lookup'!$C$5:$I$273,6,FALSE)),\"\",VLOOKUP($O66,'EASR lookup'!$C$5:$I$273,6,FALSE))","v":""},{"$f":"IF(O66='Controls Sheet'!$C$8,VLOOKUP(O66,'EASR lookup'!$C$5:$M$273,8,FALSE),\"\")","v":""},{"$f":"IF(O66='Controls Sheet'!$C$8,VLOOKUP(O66,'EASR lookup'!$C$5:$M$273,9,FALSE),\"\")","v":""},{"$f":"IF(O66='Controls Sheet'!$C$8,'EASR Charts Controls'!P66,\"\")","v":""},{"$f":"IF(P66=\"\",\"\",VLOOKUP('Controls Sheet'!$D$8,'Controls Sheet'!$D$2:$I$6,5,FALSE))","v":""},"",{"$f":"IF(INDEX($G$4:$K$111,,'Controls Sheet'!$F$8)=0,\"\",INDEX($G$4:$K$111,,'Controls Sheet'!$F$8))","v":""},{"$f":"IF(ISERROR(VLOOKUP($V66,'EASR lookup'!$C$5:$I$273,7,FALSE)),\"\",VLOOKUP($V66,'EASR lookup'!$C$5:$I$273,7,FALSE))","v":""},{"$f":"IF(V66='Controls Sheet'!$C$8,VLOOKUP(V66,'EASR lookup'!$C$5:$M$273,10,FALSE),\"\")","v":""},{"$f":"IF(V66='Controls Sheet'!$C$8,VLOOKUP(V66,'EASR lookup'!$C$5:$M$273,11,FALSE),\"\")","v":""},{"$f":"IF(V66='Controls Sheet'!$C$8,'EASR Charts Controls'!W66,\"\")","v":""},{"$f":"IF(W66=\"\",\"\",VLOOKUP('Controls Sheet'!$D$8,'Controls Sheet'!$D$2:$I$6,6,FALSE))","v":""},""]
[null,"Kings Lynn and West Norfolk",null,null,null,null,null,"Tewkesbury",null,null,null,null,null,null,{"$f":"IF(INDEX($A$4:$E$111,,'Controls Sheet'!$F$8)=0,\"\",INDEX($A$4:$E$111,,'Controls Sheet'!$F$8))","v":""},{"$f":"IF(ISERROR(VLOOKUP($O67,'EASR lookup'!$C$5:$I$273,6,FALSE)),\"\",VLOOKUP($O67,'EASR lookup'!$C$5:$I$273,6,FALSE))","v":""},{"$f":"IF(O67='Controls Sheet'!$C$8,VLOOKUP(O67,'EASR lookup'!$C$5:$M$273,8,FALSE),\"\")","v":""},{"$f":"IF(O67='Controls Sheet'!$C$8,VLOOKUP(O67,'EASR lookup'!$C$5:$M$273,9,FALSE),\"\")","v":""},{"$f":"IF(O67='Controls Sheet'!$C$8,'EASR Charts Controls'!P67,\"\")","v":""},{"$f":"IF(P67=\"\",\"\",VLOOKUP('Controls Sheet'!$D$8,'Controls Sheet'!$D$2:$I$6,5,FALSE))","v":""},"",{"$f":"IF(INDEX($G$4:$K$111,,'Controls Sheet'!$F$8)=0,\"\",INDEX($G$4:$K$111,,'Controls Sheet'!$F$8))","v":""},{"$f":"IF(ISERROR(VLOOKUP($V67,'EASR lookup'!$C$5:$I$273,7,FALSE)),\"\",VLOOKUP($V67,'EASR lookup'!$C$5:$I$273,7,FALSE))","v":""},{"$f":"IF(V67='Controls Sheet'!$C$8,VLOOKUP(V67,'EASR lookup'!$C$5:$M$273,10,FALSE),\"\")","v":""},{"$f":"IF(V67='Controls Sheet'!$C$8,VLOOKUP(V67,'EASR lookup'!$C$5:$M$273,11,FALSE),\"\")","v":""},{"$f":"IF(V67='Controls Sheet'!$C$8,'EASR Charts Controls'!W67,\"\")","v":""},{"$f":"IF(W67=\"\",\"\",VLOOKUP('Controls Sheet'!$D$8,'Controls Sheet'!$D$2:$I$6,6,FALSE))","v":""},""]
[null,"County of Herefordshire",null,null,null,null,null,"York",null,null,null,null,null,null,{"$f":"IF(INDEX($A$4:$E$111,,'Controls Sheet'!$F$8)=0,\"\",INDEX($A$4:$E$111,,'Controls Sheet'!$F$8))","v":""},{"$f":"IF(ISERROR(VLOOKUP($O68,'EASR lookup'!$C$5:$I$273,6,FALSE)),\"\",VLOOKUP($O68,'EASR lookup'!$C$5:$I$273,6,FALSE))","v":""},{"$f":"IF(O68='Controls Sheet'!$C$8,VLOOKUP(O68,'EASR lookup'!$C$5:$M$273,8,FALSE),\"\")","v":""},{"$f":"IF(O68='Controls Sheet'!$C$8,VLOOKUP(O68,'EASR lookup'!$C$5:$M$273,9,FALSE),\"\")","v":""},{"$f":"IF(O68='Controls Sheet'!$C$8,'EASR Charts Controls'!P68,\"\")","v":""},{"$f":"IF(P68=\"\",\"\",VLOOKUP('Controls Sheet'!$D$8,'Controls Sheet'!$D$2:$I$6,5,FALSE))","v":""},"",{"$f":"IF(INDEX($G$4:$K$111,,'Controls Sheet'!$F$8)=0,\"\",INDEX($G$4:$K$111,,'Controls Sheet'!$F$8))","v":""},{"$f":"IF(ISERROR(VLOOKUP($V68,'EASR lookup'!$C$5:$I$273,7,FALSE)),\"\",VLOOKUP($V68,'EASR lookup'!$C$5:$I$273,7,FALSE))","v":""},{"$f":"IF(V68='Controls Sheet'!$C$8,VLOOKUP(V68,'EASR lookup'!$C$5:$M$273,10,FALSE),\"\")","v":""},{"$f":"IF(V68='Controls Sheet'!$C$8,VLOOKUP(V68,'EASR lookup'!$C$5:$M$273,11,FALSE),\"\")","v":""},{"$f":"IF(V68='Controls Sheet'!$C$8,'EASR Charts Controls'!W68,\"\")","v":""},{"$f":"IF(W68=\"\",\"\",VLOOKUP('Controls Sheet'!$D$8,'Controls Sheet'!$D$2:$I$6,6,FALSE))","v":""},""]
[null,"Warwick",null,null,null,null,null,"Breckland",null,null,null,null,null,null,{"$f":"IF(INDEX($A$4:$E$111,,'Controls Sheet'!$F$8)=0,\"\",INDEX($A$4:$E$111,,'Controls Sheet'!$F$8))","v":""},{"$f":"IF(ISERROR(VLOOKUP($O69,'EASR lookup'!$C$5:$I$273,6,FALSE)),\"\",VLOOKUP($O69,'EASR lookup'!$C$5:$I$273,6,FALSE))","v":""},{"$f":"IF(O69='Controls Sheet'!$C$8,VLOOKUP(O69,'EASR lookup'!$C$5:$M$273,8,FALSE),\"\")","v":""},{"$f":"IF(O69='Controls Sheet'!$C$8,VLOOKUP(O69,'EASR lookup'!$C$5:$M$273,9,FALSE),\"\")","v":""},{"$f":"IF(O69='Controls Sheet'!$C$8,'EASR Charts Controls'!P69,\"\")","v":""},{"$f":"IF(P69=\"\",\"\",VLOOKUP('Controls Sheet'!$D$8,'Controls Sheet'!$D$2:$I$6,5,FALSE))","v":""},{"$f":"IF(P69=\"\",\"\",666.4)","v":""},{"$f":"IF(INDEX($G$4:$K$111,,'Controls Sheet'!$F$8)=0,\"\",INDEX($G$4:$K$111,,'Controls Sheet'!$F$8))","v":""},{"$f":"IF(ISERROR(VLOOKUP($V69,'EASR lookup'!$C$5:$I$273,7,FALSE)),\"\",VLOOKUP($V69,'EASR lookup'!$C$5:$I$273,7,FALSE))","v":""},{"$f":"IF(V69='Controls Sheet'!$C$8,VLOOKUP(V69,'EASR lookup'!$C$5:$M$273,10,FALSE),\"\")","v":""},{"$f":"IF(V69='Controls Sheet'!$C$8,VLOOKUP(V69,'EASR lookup'!$C$5:$M$273,11,FALSE),\"\")","v":""},{"$f":"IF(V69='Controls Sheet'!$C$8,'EASR Charts Controls'!W69,\"\")","v":""},{"$f":"IF(W69=\"\",\"\",VLOOKUP('Controls Sheet'!$D$8,'Controls Sheet'!$D$2:$I$6,6,FALSE))","v":""},{"$f":"IF(W69=\"\",\"\",484.5)","v":""}]
[null,"Adur",null,null,null,null,null,"Maidstone",null,null,null,null,null,null,{"$f":"IF(INDEX($A$4:$E$111,,'Controls Sheet'!$F$8)=0,\"\",INDEX($A$4:$E$111,,'Controls Sheet'!$F$8))","v":""},{"$f":"IF(ISERROR(VLOOKUP($O70,'EASR lookup'!$C$5:$I$273,6,FALSE)),\"\",VLOOKUP($O70,'EASR lookup'!$C$5:$I$273,6,FALSE))","v":""},{"$f":"IF(O70='Controls Sheet'!$C$8,VLOOKUP(O70,'EASR lookup'!$C$5:$M$273,8,FALSE),\"\")","v":""},{"$f":"IF(O70='Controls Sheet'!$C$8,VLOOKUP(O70,'EASR lookup'!$C$5:$M$273,9,FALSE),\"\")","v":""},{"$f":"IF(O70='Controls Sheet'!$C$8,'EASR Charts Controls'!P70,\"\")","v":""},{"$f":"IF(P70=\"\",\"\",VLOOKUP('Controls Sheet'!$D$8,'Controls Sheet'!$D$2:$I$6,5,FALSE))","v":""},"",{"$f":"IF(INDEX($G$4:$K$111,,'Controls Sheet'!$F$8)=0,\"\",INDEX($G$4:$K$111,,'Controls Sheet'!$F$8))","v":""},{"$f":"IF(ISERROR(VLOOKUP($V70,'EASR lookup'!$C$5:$I$273,7,FALSE)),\"\",VLOOKUP($V70,'EASR lookup'!$C$5:$I$273,7,FALSE))","v":""},{"$f":"IF(V70='Controls Sheet'!$C$8,VLOOKUP(V70,'EASR lookup'!$C$5:$M$273,10,FALSE),\"\")","v":""},{"$f":"IF(V70='Controls Sheet'!$C$8,VLOOKUP(V70,'EASR lookup'!$C$5:$M$273,11,FALSE),\"\")","v":""},{"$f":"IF(V70='Controls Sheet'!$C$8,'EASR Charts Controls'!W70,\"\")","v":""},{"$f":"IF(W70=\"\",\"\",VLOOKUP('Controls Sheet'!$D$8,'Controls Sheet'!$D$2:$I$6,6,FALSE))","v":""},""]
[null,"Castle Point",null,null,null,null,null,"Wyre Forest",null,null,null,null,null,null,{"$f":"IF(INDEX($A$4:$E$111,,'Controls Sheet'!$F$8)=0,\"\",INDEX($A$4:$E$111,,'Controls Sheet'!$F$8))","v":""},{"$f":"IF(ISERROR(VLOOKUP($O71,'EASR lookup'!$C$5:$I$273,6,FALSE)),\"\",VLOOKUP($O71,'EASR lookup'!$C$5:$I$273,6,FALSE))","v":""},{"$f":"IF(O71='Controls Sheet'!$C$8,VLOOKUP(O71,'EASR lookup'!$C$5:$M$273,8,FALSE),\"\")","v":""},{"$f":"IF(O71='Controls Sheet'!$C$8,VLOOKUP(O71,'EASR lookup'!$C$5:$M$273,9,FALSE),\"\")","v":""},{"$f":"IF(O71='Controls Sheet'!$C$8,'EASR Charts Controls'!P71,\"\")","v":""},{"$f":"IF(P71=\"\",\"\",VLOOKUP('Controls Sheet'!$D$8,'Controls Sheet'!$D$2:$I$6,5,FALSE))","v":""},"",{"$f":"IF(INDEX($G$4:$K$111,,'Controls Sheet'!$F$8)=0,\"\",INDEX($G$4:$K$111,,'Controls Sheet'!$F$8))","v":""},{"$f":"IF(ISERROR(VLOOKUP($V71,'EASR lookup'!$C$5:$I$273,7,FALSE)),\"\",VLOOKUP($V71,'EASR lookup'!$C$5:$I$273,7,FALSE))","v":""},{"$f":"IF(V71='Controls Sheet'!$C$8,VLOOKUP(V71,'EASR lookup'!$C$5:$M$273,10,FALSE),\"\")","v":""},{"$f":"IF(V71='Controls Sheet'!$C$8,VLOOKUP(V71,'EASR lookup'!$C$5:$M$273,11,FALSE),\"\")","v":""},{"$f":"IF(V71='Controls Sheet'!$C$8,'EASR Charts Controls'!W71,\"\")","v":""},{"$f":"IF(W71=\"\",\"\",VLOOKUP('Controls Sheet'!$D$8,'Controls Sheet'!$D$2:$I$6,6,FALSE))","v":""},""]
[null,"East Northamptonshire",null,null,null,null,null,"St. Edmundsbury",null,null,null,null,null,null,{"$f":"IF(INDEX($A$4:$E$111,,'Controls Sheet'!$F$8)=0,\"\",INDEX($A$4:$E$111,,'Controls Sheet'!$F$8))","v":""},{"$f":"IF(ISERROR(VLOOKUP($O72,'EASR lookup'!$C$5:$I$273,6,FALSE)),\"\",VLOOKUP($O72,'EASR lookup'!$C$5:$I$273,6,FALSE))","v":""},{"$f":"IF(O72='Controls Sheet'!$C$8,VLOOKUP(O72,'EASR lookup'!$C$5:$M$273,8,FALSE),\"\")","v":""},{"$f":"IF(O72='Controls Sheet'!$C$8,VLOOKUP(O72,'EASR lookup'!$C$5:$M$273,9,FALSE),\"\")","v":""},{"$f":"IF(O72='Controls Sheet'!$C$8,'EASR Charts Controls'!P72,\"\")","v":""},{"$f":"IF(P72=\"\",\"\",VLOOKUP('Controls Sheet'!$D$8,'Controls Sheet'!$D$2:$I$6,5,FALSE))","v":""},"",{"$f":"IF(INDEX($G$4:$K$111,,'Controls Sheet'!$F$8)=0,\"\",INDEX($G$4:$K$111,,'Controls Sheet'!$F$8))","v":""},{"$f":"IF(ISERROR(VLOOKUP($V72,'EASR lookup'!$C$5:$I$273,7,FALSE)),\"\",VLOOKUP($V72,'EASR lookup'!$C$5:$I$273,7,FALSE))","v":""},{"$f":"IF(V72='Controls Sheet'!$C$8,VLOOKUP(V72,'EASR lookup'!$C$5:$M$273,10,FALSE),\"\")","v":""},{"$f":"IF(V72='Controls Sheet'!$C$8,VLOOKUP(V72,'EASR lookup'!$C$5:$M$273,11,FALSE),\"\")","v":""},{"$f":"IF(V72='Controls Sheet'!$C$8,'EASR Charts Controls'!W72,\"\")","v":""},{"$f":"IF(W72=\"\",\"\",VLOOKUP('Controls Sheet'!$D$8,'Controls Sheet'!$D$2:$I$6,6,FALSE))","v":""},""]
[null,"Stroud",null,null,null,null,null,"Malvern Hills",null,null,null,null,null,null,{"$f":"IF(INDEX($A$4:$E$111,,'Controls Sheet'!$F$8)=0,\"\",INDEX($A$4:$E$111,,'Controls Sheet'!$F$8))","v":""},{"$f":"IF(ISERROR(VLOOKUP($O73,'EASR lookup'!$C$5:$I$273,6,FALSE)),\"\",VLOOKUP($O73,'EASR lookup'!$C$5:$I$273,6,FALSE))","v":""},{"$f":"IF(O73='Controls Sheet'!$C$8,VLOOKUP(O73,'EASR lookup'!$C$5:$M$273,8,FALSE),\"\")","v":""},{"$f":"IF(O73='Controls Sheet'!$C$8,VLOOKUP(O73,'EASR lookup'!$C$5:$M$273,9,FALSE),\"\")","v":""},{"$f":"IF(O73='Controls Sheet'!$C$8,'EASR Charts Controls'!P73,\"\")","v":""},{"$f":"IF(P73=\"\",\"\",VLOOKUP('Controls Sheet'!$D$8,'Controls Sheet'!$D$2:$I$6,5,FALSE))","v":""},"",{"$f":"IF(INDEX($G$4:$K$111,,'Controls Sheet'!$F$8)=0,\"\",INDEX($G$4:$K$111,,'Controls Sheet'!$F$8))","v":""},{"$f":"IF(ISERROR(VLOOKUP($V73,'EASR lookup'!$C$5:$I$273,7,FALSE)),\"\",VLOOKUP($V73,'EASR lookup'!$C$5:$I$273,7,FALSE))","v":""},{"$f":"IF(V73='Controls Sheet'!$C$8,VLOOKUP(V73,'EASR lookup'!$C$5:$M$273,10,FALSE),\"\")","v":""},{"$f":"IF(V73='Controls Sheet'!$C$8,VLOOKUP(V73,'EASR lookup'!$C$5:$M$273,11,FALSE),\"\")","v":""},{"$f":"IF(V73='Controls Sheet'!$C$8,'EASR Charts Controls'!W73,\"\")","v":""},{"$f":"IF(W73=\"\",\"\",VLOOKUP('Controls Sheet'!$D$8,'Controls Sheet'!$D$2:$I$6,6,FALSE))","v":""},""]
[null,"Shropshire",null,null,null,null,null,"West Lancashire",null,null,null,null,null,null,{"$f":"IF(INDEX($A$4:$E$111,,'Controls Sheet'!$F$8)=0,\"\",INDEX($A$4:$E$111,,'Controls Sheet'!$F$8))","v":""},{"$f":"IF(ISERROR(VLOOKUP($O74,'EASR lookup'!$C$5:$I$273,6,FALSE)),\"\",VLOOKUP($O74,'EASR lookup'!$C$5:$I$273,6,FALSE))","v":""},{"$f":"IF(O74='Controls Sheet'!$C$8,VLOOKUP(O74,'EASR lookup'!$C$5:$M$273,8,FALSE),\"\")","v":""},{"$f":"IF(O74='Controls Sheet'!$C$8,VLOOKUP(O74,'EASR lookup'!$C$5:$M$273,9,FALSE),\"\")","v":""},{"$f":"IF(O74='Controls Sheet'!$C$8,'EASR Charts Controls'!P74,\"\")","v":""},{"$f":"IF(P74=\"\",\"\",VLOOKUP('Controls Sheet'!$D$8,'Controls Sheet'!$D$2:$I$6,5,FALSE))","v":""},"",{"$f":"IF(INDEX($G$4:$K$111,,'Controls Sheet'!$F$8)=0,\"\",INDEX($G$4:$K$111,,'Controls Sheet'!$F$8))","v":""},{"$f":"IF(ISERROR(VLOOKUP($V74,'EASR lookup'!$C$5:$I$273,7,FALSE)),\"\",VLOOKUP($V74,'EASR lookup'!$C$5:$I$273,7,FALSE))","v":""},{"$f":"IF(V74='Controls Sheet'!$C$8,VLOOKUP(V74,'EASR lookup'!$C$5:$M$273,10,FALSE),\"\")","v":""},{"$f":"IF(V74='Controls Sheet'!$C$8,VLOOKUP(V74,'EASR lookup'!$C$5:$M$273,11,FALSE),\"\")","v":""},{"$f":"IF(V74='Controls Sheet'!$C$8,'EASR Charts Controls'!W74,\"\")","v":""},{"$f":"IF(W74=\"\",\"\",VLOOKUP('Controls Sheet'!$D$8,'Controls Sheet'!$D$2:$I$6,6,FALSE))","v":""},""]
[null,"High Peak",null,null,null,null,null,"Cherwell",null,null,null,null,null,null,{"$f":"IF(INDEX($A$4:$E$111,,'Controls Sheet'!$F$8)=0,\"\",INDEX($A$4:$E$111,,'Controls Sheet'!$F$8))","v":""},{"$f":"IF(ISERROR(VLOOKUP($O75,'EASR lookup'!$C$5:$I$273,6,FALSE)),\"\",VLOOKUP($O75,'EASR lookup'!$C$5:$I$273,6,FALSE))","v":""},{"$f":"IF(O75='Controls Sheet'!$C$8,VLOOKUP(O75,'EASR lookup'!$C$5:$M$273,8,FALSE),\"\")","v":""},{"$f":"IF(O75='Controls Sheet'!$C$8,VLOOKUP(O75,'EASR lookup'!$C$5:$M$273,9,FALSE),\"\")","v":""},{"$f":"IF(O75='Controls Sheet'!$C$8,'EASR Charts Controls'!P75,\"\")","v":""},{"$f":"IF(P75=\"\",\"\",VLOOKUP('Controls Sheet'!$D$8,'Controls Sheet'!$D$2:$I$6,5,FALSE))","v":""},"",{"$f":"IF(INDEX($G$4:$K$111,,'Controls Sheet'!$F$8)=0,\"\",INDEX($G$4:$K$111,,'Controls Sheet'!$F$8))","v":""},{"$f":"IF(ISERROR(VLOOKUP($V75,'EASR lookup'!$C$5:$I$273,7,FALSE)),\"\",VLOOKUP($V75,'EASR lookup'!$C$5:$I$273,7,FALSE))","v":""},{"$f":"IF(V75='Controls Sheet'!$C$8,VLOOKUP(V75,'EASR lookup'!$C$5:$M$273,10,FALSE),\"\")","v":""},{"$f":"IF(V75='Controls Sheet'!$C$8,VLOOKUP(V75,'EASR lookup'!$C$5:$M$273,11,FALSE),\"\")","v":""},{"$f":"IF(V75='Controls Sheet'!$C$8,'EASR Charts Controls'!W75,\"\")","v":""},{"$f":"IF(W75=\"\",\"\",VLOOKUP('Controls Sheet'!$D$8,'Controls Sheet'!$D$2:$I$6,6,FALSE))","v":""},""]
[null,"East Riding of Yorks",null,null,null,null,null,"Staffordshire Moorlands",null,null,null,null,null,null,{"$f":"IF(INDEX($A$4:$E$111,,'Controls Sheet'!$F$8)=0,\"\",INDEX($A$4:$E$111,,'Controls Sheet'!$F$8))","v":""},{"$f":"IF(ISERROR(VLOOKUP($O76,'EASR lookup'!$C$5:$I$273,6,FALSE)),\"\",VLOOKUP($O76,'EASR lookup'!$C$5:$I$273,6,FALSE))","v":""},{"$f":"IF(O76='Controls Sheet'!$C$8,VLOOKUP(O76,'EASR lookup'!$C$5:$M$273,8,FALSE),\"\")","v":""},{"$f":"IF(O76='Controls Sheet'!$C$8,VLOOKUP(O76,'EASR lookup'!$C$5:$M$273,9,FALSE),\"\")","v":""},{"$f":"IF(O76='Controls Sheet'!$C$8,'EASR Charts Controls'!P76,\"\")","v":""},{"$f":"IF(P76=\"\",\"\",VLOOKUP('Controls Sheet'!$D$8,'Controls Sheet'!$D$2:$I$6,5,FALSE))","v":""},"",{"$f":"IF(INDEX($G$4:$K$111,,'Controls Sheet'!$F$8)=0,\"\",INDEX($G$4:$K$111,,'Controls Sheet'!$F$8))","v":""},{"$f":"IF(ISERROR(VLOOKUP($V76,'EASR lookup'!$C$5:$I$273,7,FALSE)),\"\",VLOOKUP($V76,'EASR lookup'!$C$5:$I$273,7,FALSE))","v":""},{"$f":"IF(V76='Controls Sheet'!$C$8,VLOOKUP(V76,'EASR lookup'!$C$5:$M$273,10,FALSE),\"\")","v":""},{"$f":"IF(V76='Controls Sheet'!$C$8,VLOOKUP(V76,'EASR lookup'!$C$5:$M$273,11,FALSE),\"\")","v":""},{"$f":"IF(V76='Controls Sheet'!$C$8,'EASR Charts Controls'!W76,\"\")","v":""},{"$f":"IF(W76=\"\",\"\",VLOOKUP('Controls Sheet'!$D$8,'Controls Sheet'!$D$2:$I$6,6,FALSE))","v":""},""]
[null,"Fenland",null,null,null,null,null,"Richmondshire",null,null,null,null,null,null,{"$f":"IF(INDEX($A$4:$E$111,,'Controls Sheet'!$F$8)=0,\"\",INDEX($A$4:$E$111,,'Controls Sheet'!$F$8))","v":""},{"$f":"IF(ISERROR(VLOOKUP($O77,'EASR lookup'!$C$5:$I$273,6,FALSE)),\"\",VLOOKUP($O77,'EASR lookup'!$C$5:$I$273,6,FALSE))","v":""},{"$f":"IF(O77='Controls Sheet'!$C$8,VLOOKUP(O77,'EASR lookup'!$C$5:$M$273,8,FALSE),\"\")","v":""},{"$f":"IF(O77='Controls Sheet'!$C$8,VLOOKUP(O77,'EASR lookup'!$C$5:$M$273,9,FALSE),\"\")","v":""},{"$f":"IF(O77='Controls Sheet'!$C$8,'EASR Charts Controls'!P77,\"\")","v":""},{"$f":"IF(P77=\"\",\"\",VLOOKUP('Controls Sheet'!$D$8,'Controls Sheet'!$D$2:$I$6,5,FALSE))","v":""},"",{"$f":"IF(INDEX($G$4:$K$111,,'Controls Sheet'!$F$8)=0,\"\",INDEX($G$4:$K$111,,'Controls Sheet'!$F$8))","v":""},{"$f":"IF(ISERROR(VLOOKUP($V77,'EASR lookup'!$C$5:$I$273,7,FALSE)),\"\",VLOOKUP($V77,'EASR lookup'!$C$5:$I$273,7,FALSE))","v":""},{"$f":"IF(V77='Controls Sheet'!$C$8,VLOOKUP(V77,'EASR lookup'!$C$5:$M$273,10,FALSE),\"\")","v":""},{"$f":"IF(V77='Controls Sheet'!$C$8,VLOOKUP(V77,'EASR lookup'!$C$5:$M$273,11,FALSE),\"\")","v":""},{"$f":"IF(V77='Controls Sheet'!$C$8,'EASR Charts Controls'!W77,\"\")","v":""},{"$f":"IF(W77=\"\",\"\",VLOOKUP('Controls Sheet'!$D$8,'Controls Sheet'!$D$2:$I$6,6,FALSE))","v":""},""]
[null,"South Holland",null,null,null,null,null,"Kettering",null,null,null,null,null,null,{"$f":"IF(INDEX($A$4:$E$111,,'Controls Sheet'!$F$8)=0,\"\",INDEX($A$4:$E$111,,'Controls Sheet'!$F$8))","v":""},{"$f":"IF(ISERROR(VLOOKUP($O78,'EASR lookup'!$C$5:$I$273,6,FALSE)),\"\",VLOOKUP($O78,'EASR lookup'!$C$5:$I$273,6,FALSE))","v":""},{"$f":"IF(O78='Controls Sheet'!$C$8,VLOOKUP(O78,'EASR lookup'!$C$5:$M$273,8,FALSE),\"\")","v":""},{"$f":"IF(O78='Controls Sheet'!$C$8,VLOOKUP(O78,'EASR lookup'!$C$5:$M$273,9,FALSE),\"\")","v":""},{"$f":"IF(O78='Controls Sheet'!$C$8,'EASR Charts Controls'!P78,\"\")","v":""},{"$f":"IF(P78=\"\",\"\",VLOOKUP('Controls Sheet'!$D$8,'Controls Sheet'!$D$2:$I$6,5,FALSE))","v":""},"",{"$f":"IF(INDEX($G$4:$K$111,,'Controls Sheet'!$F$8)=0,\"\",INDEX($G$4:$K$111,,'Controls Sheet'!$F$8))","v":""},{"$f":"IF(ISERROR(VLOOKUP($V78,'EASR lookup'!$C$5:$I$273,7,FALSE)),\"\",VLOOKUP($V78,'EASR lookup'!$C$5:$I$273,7,FALSE))","v":""},{"$f":"IF(V78='Controls Sheet'!$C$8,VLOOKUP(V78,'EASR lookup'!$C$5:$M$273,10,FALSE),\"\")","v":""},{"$f":"IF(V78='Controls Sheet'!$C$8,VLOOKUP(V78,'EASR lookup'!$C$5:$M$273,11,FALSE),\"\")","v":""},{"$f":"IF(V78='Controls Sheet'!$C$8,'EASR Charts Controls'!W78,\"\")","v":""},{"$f":"IF(W78=\"\",\"\",VLOOKUP('Controls Sheet'!$D$8,'Controls Sheet'!$D$2:$I$6,6,FALSE))","v":""},""]
[null,"Staffordshire Moorlands",null,null,null,null,null,"Cheshire East",null,null,null,null,null,null,{"$f":"IF(INDEX($A$4:$E$111,,'Controls Sheet'!$F$8)=0,\"\",INDEX($A$4:$E$111,,'Controls Sheet'!$F$8))","v":""},{"$f":"IF(ISERROR(VLOOKUP($O79,'EASR lookup'!$C$5:$I$273,6,FALSE)),\"\",VLOOKUP($O79,'EASR lookup'!$C$5:$I$273,6,FALSE))","v":""},{"$f":"IF(O79='Controls Sheet'!$C$8,VLOOKUP(O79,'EASR lookup'!$C$5:$M$273,8,FALSE),\"\")","v":""},{"$f":"IF(O79='Controls Sheet'!$C$8,VLOOKUP(O79,'EASR lookup'!$C$5:$M$273,9,FALSE),\"\")","v":""},{"$f":"IF(O79='Controls Sheet'!$C$8,'EASR Charts Controls'!P79,\"\")","v":""},{"$f":"IF(P79=\"\",\"\",VLOOKUP('Controls Sheet'!$D$8,'Controls Sheet'!$D$2:$I$6,5,FALSE))","v":""},"",{"$f":"IF(INDEX($G$4:$K$111,,'Controls Sheet'!$F$8)=0,\"\",INDEX($G$4:$K$111,,'Controls Sheet'!$F$8))","v":""},{"$f":"IF(ISERROR(VLOOKUP($V79,'EASR lookup'!$C$5:$I$273,7,FALSE)),\"\",VLOOKUP($V79,'EASR lookup'!$C$5:$I$273,7,FALSE))","v":""},{"$f":"IF(V79='Controls Sheet'!$C$8,VLOOKUP(V79,'EASR lookup'!$C$5:$M$273,10,FALSE),\"\")","v":""},{"$f":"IF(V79='Controls Sheet'!$C$8,VLOOKUP(V79,'EASR lookup'!$C$5:$M$273,11,FALSE),\"\")","v":""},{"$f":"IF(V79='Controls Sheet'!$C$8,'EASR Charts Controls'!W79,\"\")","v":""},{"$f":"IF(W79=\"\",\"\",VLOOKUP('Controls Sheet'!$D$8,'Controls Sheet'!$D$2:$I$6,6,FALSE))","v":""},""]
[null,"Stockport",null,null,null,null,null,"North Warwickshire",null,null,null,null,null,null,{"$f":"IF(INDEX($A$4:$E$111,,'Controls Sheet'!$F$8)=0,\"\",INDEX($A$4:$E$111,,'Controls Sheet'!$F$8))","v":""},{"$f":"IF(ISERROR(VLOOKUP($O80,'EASR lookup'!$C$5:$I$273,6,FALSE)),\"\",VLOOKUP($O80,'EASR lookup'!$C$5:$I$273,6,FALSE))","v":""},{"$f":"IF(O80='Controls Sheet'!$C$8,VLOOKUP(O80,'EASR lookup'!$C$5:$M$273,8,FALSE),\"\")","v":""},{"$f":"IF(O80='Controls Sheet'!$C$8,VLOOKUP(O80,'EASR lookup'!$C$5:$M$273,9,FALSE),\"\")","v":""},{"$f":"IF(O80='Controls Sheet'!$C$8,'EASR Charts Controls'!P80,\"\")","v":""},{"$f":"IF(P80=\"\",\"\",VLOOKUP('Controls Sheet'!$D$8,'Controls Sheet'!$D$2:$I$6,5,FALSE))","v":""},"",{"$f":"IF(INDEX($G$4:$K$111,,'Controls Sheet'!$F$8)=0,\"\",INDEX($G$4:$K$111,,'Controls Sheet'!$F$8))","v":""},{"$f":"IF(ISERROR(VLOOKUP($V80,'EASR lookup'!$C$5:$I$273,7,FALSE)),\"\",VLOOKUP($V80,'EASR lookup'!$C$5:$I$273,7,FALSE))","v":""},{"$f":"IF(V80='Controls Sheet'!$C$8,VLOOKUP(V80,'EASR lookup'!$C$5:$M$273,10,FALSE),\"\")","v":""},{"$f":"IF(V80='Controls Sheet'!$C$8,VLOOKUP(V80,'EASR lookup'!$C$5:$M$273,11,FALSE),\"\")","v":""},{"$f":"IF(V80='Controls Sheet'!$C$8,'EASR Charts Controls'!W80,\"\")","v":""},{"$f":"IF(W80=\"\",\"\",VLOOKUP('Controls Sheet'!$D$8,'Controls Sheet'!$D$2:$I$6,6,FALSE))","v":""},""]
[null,"South Kesteven",null,null,null,null,null,"Adur",null,null,null,null,null,null,{"$f":"IF(INDEX($A$4:$E$111,,'Controls Sheet'!$F$8)=0,\"\",INDEX($A$4:$E$111,,'Controls Sheet'!$F$8))","v":""},{"$f":"IF(ISERROR(VLOOKUP($O81,'EASR lookup'!$C$5:$I$273,6,FALSE)),\"\",VLOOKUP($O81,'EASR lookup'!$C$5:$I$273,6,FALSE))","v":""},{"$f":"IF(O81='Controls Sheet'!$C$8,VLOOKUP(O81,'EASR lookup'!$C$5:$M$273,8,FALSE),\"\")","v":""},{"$f":"IF(O81='Controls Sheet'!$C$8,VLOOKUP(O81,'EASR lookup'!$C$5:$M$273,9,FALSE),\"\")","v":""},{"$f":"IF(O81='Controls Sheet'!$C$8,'EASR Charts Controls'!P81,\"\")","v":""},{"$f":"IF(P81=\"\",\"\",VLOOKUP('Controls Sheet'!$D$8,'Controls Sheet'!$D$2:$I$6,5,FALSE))","v":""},"",{"$f":"IF(INDEX($G$4:$K$111,,'Controls Sheet'!$F$8)=0,\"\",INDEX($G$4:$K$111,,'Controls Sheet'!$F$8))","v":""},{"$f":"IF(ISERROR(VLOOKUP($V81,'EASR lookup'!$C$5:$I$273,7,FALSE)),\"\",VLOOKUP($V81,'EASR lookup'!$C$5:$I$273,7,FALSE))","v":""},{"$f":"IF(V81='Controls Sheet'!$C$8,VLOOKUP(V81,'EASR lookup'!$C$5:$M$273,10,FALSE),\"\")","v":""},{"$f":"IF(V81='Controls Sheet'!$C$8,VLOOKUP(V81,'EASR lookup'!$C$5:$M$273,11,FALSE),\"\")","v":""},{"$f":"IF(V81='Controls Sheet'!$C$8,'EASR Charts Controls'!W81,\"\")","v":""},{"$f":"IF(W81=\"\",\"\",VLOOKUP('Controls Sheet'!$D$8,'Controls Sheet'!$D$2:$I$6,6,FALSE))","v":""},""]
[null,"Monmouthshire",null,null,null,null,null,"Canterbury",null,null,null,null,null,null,{"$f":"IF(INDEX($A$4:$E$111,,'Controls Sheet'!$F$8)=0,\"\",INDEX($A$4:$E$111,,'Controls Sheet'!$F$8))","v":""},{"$f":"IF(ISERROR(VLOOKUP($O82,'EASR lookup'!$C$5:$I$273,6,FALSE)),\"\",VLOOKUP($O82,'EASR lookup'!$C$5:$I$273,6,FALSE))","v":""},{"$f":"IF(O82='Controls Sheet'!$C$8,VLOOKUP(O82,'EASR lookup'!$C$5:$M$273,8,FALSE),\"\")","v":""},{"$f":"IF(O82='Controls Sheet'!$C$8,VLOOKUP(O82,'EASR lookup'!$C$5:$M$273,9,FALSE),\"\")","v":""},{"$f":"IF(O82='Controls Sheet'!$C$8,'EASR Charts Controls'!P82,\"\")","v":""},{"$f":"IF(P82=\"\",\"\",VLOOKUP('Controls Sheet'!$D$8,'Controls Sheet'!$D$2:$I$6,5,FALSE))","v":""},"",{"$f":"IF(INDEX($G$4:$K$111,,'Controls Sheet'!$F$8)=0,\"\",INDEX($G$4:$K$111,,'Controls Sheet'!$F$8))","v":""},{"$f":"IF(ISERROR(VLOOKUP($V82,'EASR lookup'!$C$5:$I$273,7,FALSE)),\"\",VLOOKUP($V82,'EASR lookup'!$C$5:$I$273,7,FALSE))","v":""},{"$f":"IF(V82='Controls Sheet'!$C$8,VLOOKUP(V82,'EASR lookup'!$C$5:$M$273,10,FALSE),\"\")","v":""},{"$f":"IF(V82='Controls Sheet'!$C$8,VLOOKUP(V82,'EASR lookup'!$C$5:$M$273,11,FALSE),\"\")","v":""},{"$f":"IF(V82='Controls Sheet'!$C$8,'EASR Charts Controls'!W82,\"\")","v":""},{"$f":"IF(W82=\"\",\"\",VLOOKUP('Controls Sheet'!$D$8,'Controls Sheet'!$D$2:$I$6,6,FALSE))","v":""},""]
[null,"West Lindsey",null,null,null,null,null,"Vale of Glamorgan",null,null,null,null,null,null,{"$f":"IF(INDEX($A$4:$E$111,,'Controls Sheet'!$F$8)=0,\"\",INDEX($A$4:$E$111,,'Controls Sheet'!$F$8))","v":""},{"$f":"IF(ISERROR(VLOOKUP($O83,'EASR lookup'!$C$5:$I$273,6,FALSE)),\"\",VLOOKUP($O83,'EASR lookup'!$C$5:$I$273,6,FALSE))","v":""},{"$f":"IF(O83='Controls Sheet'!$C$8,VLOOKUP(O83,'EASR lookup'!$C$5:$M$273,8,FALSE),\"\")","v":""},{"$f":"IF(O83='Controls Sheet'!$C$8,VLOOKUP(O83,'EASR lookup'!$C$5:$M$273,9,FALSE),\"\")","v":""},{"$f":"IF(O83='Controls Sheet'!$C$8,'EASR Charts Controls'!P83,\"\")","v":""},{"$f":"IF(P83=\"\",\"\",VLOOKUP('Controls Sheet'!$D$8,'Controls Sheet'!$D$2:$I$6,5,FALSE))","v":""},"",{"$f":"IF(INDEX($G$4:$K$111,,'Controls Sheet'!$F$8)=0,\"\",INDEX($G$4:$K$111,,'Controls Sheet'!$F$8))","v":""},{"$f":"IF(ISERROR(VLOOKUP($V83,'EASR lookup'!$C$5:$I$273,7,FALSE)),\"\",VLOOKUP($V83,'EASR lookup'!$C$5:$I$273,7,FALSE))","v":""},{"$f":"IF(V83='Controls Sheet'!$C$8,VLOOKUP(V83,'EASR lookup'!$C$5:$M$273,10,FALSE),\"\")","v":""},{"$f":"IF(V83='Controls Sheet'!$C$8,VLOOKUP(V83,'EASR lookup'!$C$5:$M$273,11,FALSE),\"\")","v":""},{"$f":"IF(V83='Controls Sheet'!$C$8,'EASR Charts Controls'!W83,\"\")","v":""},{"$f":"IF(W83=\"\",\"\",VLOOKUP('Controls Sheet'!$D$8,'Controls Sheet'!$D$2:$I$6,6,FALSE))","v":""},""]
[null,"Colchester",null,null,null,null,null,"Boston",null,null,null,null,null,null,{"$f":"IF(INDEX($A$4:$E$111,,'Controls Sheet'!$F$8)=0,\"\",INDEX($A$4:$E$111,,'Controls Sheet'!$F$8))","v":""},{"$f":"IF(ISERROR(VLOOKUP($O84,'EASR lookup'!$C$5:$I$273,6,FALSE)),\"\",VLOOKUP($O84,'EASR lookup'!$C$5:$I$273,6,FALSE))","v":""},{"$f":"IF(O84='Controls Sheet'!$C$8,VLOOKUP(O84,'EASR lookup'!$C$5:$M$273,8,FALSE),\"\")","v":""},{"$f":"IF(O84='Controls Sheet'!$C$8,VLOOKUP(O84,'EASR lookup'!$C$5:$M$273,9,FALSE),\"\")","v":""},{"$f":"IF(O84='Controls Sheet'!$C$8,'EASR Charts Controls'!P84,\"\")","v":""},{"$f":"IF(P84=\"\",\"\",VLOOKUP('Controls Sheet'!$D$8,'Controls Sheet'!$D$2:$I$6,5,FALSE))","v":""},"",{"$f":"IF(INDEX($G$4:$K$111,,'Controls Sheet'!$F$8)=0,\"\",INDEX($G$4:$K$111,,'Controls Sheet'!$F$8))","v":""},{"$f":"IF(ISERROR(VLOOKUP($V84,'EASR lookup'!$C$5:$I$273,7,FALSE)),\"\",VLOOKUP($V84,'EASR lookup'!$C$5:$I$273,7,FALSE))","v":""},{"$f":"IF(V84='Controls Sheet'!$C$8,VLOOKUP(V84,'EASR lookup'!$C$5:$M$273,10,FALSE),\"\")","v":""},{"$f":"IF(V84='Controls Sheet'!$C$8,VLOOKUP(V84,'EASR lookup'!$C$5:$M$273,11,FALSE),\"\")","v":""},{"$f":"IF(V84='Controls Sheet'!$C$8,'EASR Charts Controls'!W84,\"\")","v":""},{"$f":"IF(W84=\"\",\"\",VLOOKUP('Controls Sheet'!$D$8,'Controls Sheet'!$D$2:$I$6,6,FALSE))","v":""},""]
[null,"Chorley",null,null,null,null,null,"Stroud",null,null,null,null,null,null,{"$f":"IF(INDEX($A$4:$E$111,,'Controls Sheet'!$F$8)=0,\"\",INDEX($A$4:$E$111,,'Controls Sheet'!$F$8))","v":""},{"$f":"IF(ISERROR(VLOOKUP($O85,'EASR lookup'!$C$5:$I$273,6,FALSE)),\"\",VLOOKUP($O85,'EASR lookup'!$C$5:$I$273,6,FALSE))","v":""},{"$f":"IF(O85='Controls Sheet'!$C$8,VLOOKUP(O85,'EASR lookup'!$C$5:$M$273,8,FALSE),\"\")","v":""},{"$f":"IF(O85='Controls Sheet'!$C$8,VLOOKUP(O85,'EASR lookup'!$C$5:$M$273,9,FALSE),\"\")","v":""},{"$f":"IF(O85='Controls Sheet'!$C$8,'EASR Charts Controls'!P85,\"\")","v":""},{"$f":"IF(P85=\"\",\"\",VLOOKUP('Controls Sheet'!$D$8,'Controls Sheet'!$D$2:$I$6,5,FALSE))","v":""},"",{"$f":"IF(INDEX($G$4:$K$111,,'Controls Sheet'!$F$8)=0,\"\",INDEX($G$4:$K$111,,'Controls Sheet'!$F$8))","v":""},{"$f":"IF(ISERROR(VLOOKUP($V85,'EASR lookup'!$C$5:$I$273,7,FALSE)),\"\",VLOOKUP($V85,'EASR lookup'!$C$5:$I$273,7,FALSE))","v":""},{"$f":"IF(V85='Controls Sheet'!$C$8,VLOOKUP(V85,'EASR lookup'!$C$5:$M$273,10,FALSE),\"\")","v":""},{"$f":"IF(V85='Controls Sheet'!$C$8,VLOOKUP(V85,'EASR lookup'!$C$5:$M$273,11,FALSE),\"\")","v":""},{"$f":"IF(V85='Controls Sheet'!$C$8,'EASR Charts Controls'!W85,\"\")","v":""},{"$f":"IF(W85=\"\",\"\",VLOOKUP('Controls Sheet'!$D$8,'Controls Sheet'!$D$2:$I$6,6,FALSE))","v":""},""]
[null,"West Lancashire",null,null,null,null,null,"West Lindsey",null,null,null,null,null,null,{"$f":"IF(INDEX($A$4:$E$111,,'Controls Sheet'!$F$8)=0,\"\",INDEX($A$4:$E$111,,'Controls Sheet'!$F$8))","v":""},{"$f":"IF(ISERROR(VLOOKUP($O86,'EASR lookup'!$C$5:$I$273,6,FALSE)),\"\",VLOOKUP($O86,'EASR lookup'!$C$5:$I$273,6,FALSE))","v":""},{"$f":"IF(O86='Controls Sheet'!$C$8,VLOOKUP(O86,'EASR lookup'!$C$5:$M$273,8,FALSE),\"\")","v":""},{"$f":"IF(O86='Controls Sheet'!$C$8,VLOOKUP(O86,'EASR lookup'!$C$5:$M$273,9,FALSE),\"\")","v":""},{"$f":"IF(O86='Controls Sheet'!$C$8,'EASR Charts Controls'!P86,\"\")","v":""},{"$f":"IF(P86=\"\",\"\",VLOOKUP('Controls Sheet'!$D$8,'Controls Sheet'!$D$2:$I$6,5,FALSE))","v":""},"",{"$f":"IF(INDEX($G$4:$K$111,,'Controls Sheet'!$F$8)=0,\"\",INDEX($G$4:$K$111,,'Controls Sheet'!$F$8))","v":""},{"$f":"IF(ISERROR(VLOOKUP($V86,'EASR lookup'!$C$5:$I$273,7,FALSE)),\"\",VLOOKUP($V86,'EASR lookup'!$C$5:$I$273,7,FALSE))","v":""},{"$f":"IF(V86='Controls Sheet'!$C$8,VLOOKUP(V86,'EASR lookup'!$C$5:$M$273,10,FALSE),\"\")","v":""},{"$f":"IF(V86='Controls Sheet'!$C$8,VLOOKUP(V86,'EASR lookup'!$C$5:$M$273,11,FALSE),\"\")","v":""},{"$f":"IF(V86='Controls Sheet'!$C$8,'EASR Charts Controls'!W86,\"\")","v":""},{"$f":"IF(W86=\"\",\"\",VLOOKUP('Controls Sheet'!$D$8,'Controls Sheet'!$D$2:$I$6,6,FALSE))","v":""},""]
[null,"North Down",null,null,null,null,null,"Charnwood",null,null,null,null,null,null,{"$f":"IF(INDEX($A$4:$E$111,,'Controls Sheet'!$F$8)=0,\"\",INDEX($A$4:$E$111,,'Controls Sheet'!$F$8))","v":""},{"$f":"IF(ISERROR(VLOOKUP($O87,'EASR lookup'!$C$5:$I$273,6,FALSE)),\"\",VLOOKUP($O87,'EASR lookup'!$C$5:$I$273,6,FALSE))","v":""},{"$f":"IF(O87='Controls Sheet'!$C$8,VLOOKUP(O87,'EASR lookup'!$C$5:$M$273,8,FALSE),\"\")","v":""},{"$f":"IF(O87='Controls Sheet'!$C$8,VLOOKUP(O87,'EASR lookup'!$C$5:$M$273,9,FALSE),\"\")","v":""},{"$f":"IF(O87='Controls Sheet'!$C$8,'EASR Charts Controls'!P87,\"\")","v":""},{"$f":"IF(P87=\"\",\"\",VLOOKUP('Controls Sheet'!$D$8,'Controls Sheet'!$D$2:$I$6,5,FALSE))","v":""},"",{"$f":"IF(INDEX($G$4:$K$111,,'Controls Sheet'!$F$8)=0,\"\",INDEX($G$4:$K$111,,'Controls Sheet'!$F$8))","v":""},{"$f":"IF(ISERROR(VLOOKUP($V87,'EASR lookup'!$C$5:$I$273,7,FALSE)),\"\",VLOOKUP($V87,'EASR lookup'!$C$5:$I$273,7,FALSE))","v":""},{"$f":"IF(V87='Controls Sheet'!$C$8,VLOOKUP(V87,'EASR lookup'!$C$5:$M$273,10,FALSE),\"\")","v":""},{"$f":"IF(V87='Controls Sheet'!$C$8,VLOOKUP(V87,'EASR lookup'!$C$5:$M$273,11,FALSE),\"\")","v":""},{"$f":"IF(V87='Controls Sheet'!$C$8,'EASR Charts Controls'!W87,\"\")","v":""},{"$f":"IF(W87=\"\",\"\",VLOOKUP('Controls Sheet'!$D$8,'Controls Sheet'!$D$2:$I$6,6,FALSE))","v":""},""]
[null,"Welwyn Hatfield",null,null,null,null,null,"Melton",null,null,null,null,null,null,{"$f":"IF(INDEX($A$4:$E$111,,'Controls Sheet'!$F$8)=0,\"\",INDEX($A$4:$E$111,,'Controls Sheet'!$F$8))","v":""},{"$f":"IF(ISERROR(VLOOKUP($O88,'EASR lookup'!$C$5:$I$273,6,FALSE)),\"\",VLOOKUP($O88,'EASR lookup'!$C$5:$I$273,6,FALSE))","v":""},{"$f":"IF(O88='Controls Sheet'!$C$8,VLOOKUP(O88,'EASR lookup'!$C$5:$M$273,8,FALSE),\"\")","v":""},{"$f":"IF(O88='Controls Sheet'!$C$8,VLOOKUP(O88,'EASR lookup'!$C$5:$M$273,9,FALSE),\"\")","v":""},{"$f":"IF(O88='Controls Sheet'!$C$8,'EASR Charts Controls'!P88,\"\")","v":""},{"$f":"IF(P88=\"\",\"\",VLOOKUP('Controls Sheet'!$D$8,'Controls Sheet'!$D$2:$I$6,5,FALSE))","v":""},"",{"$f":"IF(INDEX($G$4:$K$111,,'Controls Sheet'!$F$8)=0,\"\",INDEX($G$4:$K$111,,'Controls Sheet'!$F$8))","v":""},{"$f":"IF(ISERROR(VLOOKUP($V88,'EASR lookup'!$C$5:$I$273,7,FALSE)),\"\",VLOOKUP($V88,'EASR lookup'!$C$5:$I$273,7,FALSE))","v":""},{"$f":"IF(V88='Controls Sheet'!$C$8,VLOOKUP(V88,'EASR lookup'!$C$5:$M$273,10,FALSE),\"\")","v":""},{"$f":"IF(V88='Controls Sheet'!$C$8,VLOOKUP(V88,'EASR lookup'!$C$5:$M$273,11,FALSE),\"\")","v":""},{"$f":"IF(V88='Controls Sheet'!$C$8,'EASR Charts Controls'!W88,\"\")","v":""},{"$f":"IF(W88=\"\",\"\",VLOOKUP('Controls Sheet'!$D$8,'Controls Sheet'!$D$2:$I$6,6,FALSE))","v":""},""]
[null,"Rugby",null,null,null,null,null,"South Holland",null,null,null,null,null,null,{"$f":"IF(INDEX($A$4:$E$111,,'Controls Sheet'!$F$8)=0,\"\",INDEX($A$4:$E$111,,'Controls Sheet'!$F$8))","v":""},{"$f":"IF(ISERROR(VLOOKUP($O89,'EASR lookup'!$C$5:$I$273,6,FALSE)),\"\",VLOOKUP($O89,'EASR lookup'!$C$5:$I$273,6,FALSE))","v":""},{"$f":"IF(O89='Controls Sheet'!$C$8,VLOOKUP(O89,'EASR lookup'!$C$5:$M$273,8,FALSE),\"\")","v":""},{"$f":"IF(O89='Controls Sheet'!$C$8,VLOOKUP(O89,'EASR lookup'!$C$5:$M$273,9,FALSE),\"\")","v":""},{"$f":"IF(O89='Controls Sheet'!$C$8,'EASR Charts Controls'!P89,\"\")","v":""},{"$f":"IF(P89=\"\",\"\",VLOOKUP('Controls Sheet'!$D$8,'Controls Sheet'!$D$2:$I$6,5,FALSE))","v":""},"",{"$f":"IF(INDEX($G$4:$K$111,,'Controls Sheet'!$F$8)=0,\"\",INDEX($G$4:$K$111,,'Controls Sheet'!$F$8))","v":""},{"$f":"IF(ISERROR(VLOOKUP($V89,'EASR lookup'!$C$5:$I$273,7,FALSE)),\"\",VLOOKUP($V89,'EASR lookup'!$C$5:$I$273,7,FALSE))","v":""},{"$f":"IF(V89='Controls Sheet'!$C$8,VLOOKUP(V89,'EASR lookup'!$C$5:$M$273,10,FALSE),\"\")","v":""},{"$f":"IF(V89='Controls Sheet'!$C$8,VLOOKUP(V89,'EASR lookup'!$C$5:$M$273,11,FALSE),\"\")","v":""},{"$f":"IF(V89='Controls Sheet'!$C$8,'EASR Charts Controls'!W89,\"\")","v":""},{"$f":"IF(W89=\"\",\"\",VLOOKUP('Controls Sheet'!$D$8,'Controls Sheet'!$D$2:$I$6,6,FALSE))","v":""},""]
[null,"Vale of Glamorgan",null,null,null,null,null,"North West Leicestershire",null,null,null,null,null,null,{"$f":"IF(INDEX($A$4:$E$111,,'Controls Sheet'!$F$8)=0,\"\",INDEX($A$4:$E$111,,'Controls Sheet'!$F$8))","v":""},{"$f":"IF(ISERROR(VLOOKUP($O90,'EASR lookup'!$C$5:$I$273,6,FALSE)),\"\",VLOOKUP($O90,'EASR lookup'!$C$5:$I$273,6,FALSE))","v":""},{"$f":"IF(O90='Controls Sheet'!$C$8,VLOOKUP(O90,'EASR lookup'!$C$5:$M$273,8,FALSE),\"\")","v":""},{"$f":"IF(O90='Controls Sheet'!$C$8,VLOOKUP(O90,'EASR lookup'!$C$5:$M$273,9,FALSE),\"\")","v":""},{"$f":"IF(O90='Controls Sheet'!$C$8,'EASR Charts Controls'!P90,\"\")","v":""},{"$f":"IF(P90=\"\",\"\",VLOOKUP('Controls Sheet'!$D$8,'Controls Sheet'!$D$2:$I$6,5,FALSE))","v":""},"",{"$f":"IF(INDEX($G$4:$K$111,,'Controls Sheet'!$F$8)=0,\"\",INDEX($G$4:$K$111,,'Controls Sheet'!$F$8))","v":""},{"$f":"IF(ISERROR(VLOOKUP($V90,'EASR lookup'!$C$5:$I$273,7,FALSE)),\"\",VLOOKUP($V90,'EASR lookup'!$C$5:$I$273,7,FALSE))","v":""},{"$f":"IF(V90='Controls Sheet'!$C$8,VLOOKUP(V90,'EASR lookup'!$C$5:$M$273,10,FALSE),\"\")","v":""},{"$f":"IF(V90='Controls Sheet'!$C$8,VLOOKUP(V90,'EASR lookup'!$C$5:$M$273,11,FALSE),\"\")","v":""},{"$f":"IF(V90='Controls Sheet'!$C$8,'EASR Charts Controls'!W90,\"\")","v":""},{"$f":"IF(W90=\"\",\"\",VLOOKUP('Controls Sheet'!$D$8,'Controls Sheet'!$D$2:$I$6,6,FALSE))","v":""},""]
[null,"Trafford",null,null,null,null,null,"High Peak",null,null,null,null,null,null,{"$f":"IF(INDEX($A$4:$E$111,,'Controls Sheet'!$F$8)=0,\"\",INDEX($A$4:$E$111,,'Controls Sheet'!$F$8))","v":""},{"$f":"IF(ISERROR(VLOOKUP($O91,'EASR lookup'!$C$5:$I$273,6,FALSE)),\"\",VLOOKUP($O91,'EASR lookup'!$C$5:$I$273,6,FALSE))","v":""},{"$f":"IF(O91='Controls Sheet'!$C$8,VLOOKUP(O91,'EASR lookup'!$C$5:$M$273,8,FALSE),\"\")","v":""},{"$f":"IF(O91='Controls Sheet'!$C$8,VLOOKUP(O91,'EASR lookup'!$C$5:$M$273,9,FALSE),\"\")","v":""},{"$f":"IF(O91='Controls Sheet'!$C$8,'EASR Charts Controls'!P91,\"\")","v":""},{"$f":"IF(P91=\"\",\"\",VLOOKUP('Controls Sheet'!$D$8,'Controls Sheet'!$D$2:$I$6,5,FALSE))","v":""},"",{"$f":"IF(INDEX($G$4:$K$111,,'Controls Sheet'!$F$8)=0,\"\",INDEX($G$4:$K$111,,'Controls Sheet'!$F$8))","v":""},{"$f":"IF(ISERROR(VLOOKUP($V91,'EASR lookup'!$C$5:$I$273,7,FALSE)),\"\",VLOOKUP($V91,'EASR lookup'!$C$5:$I$273,7,FALSE))","v":""},{"$f":"IF(V91='Controls Sheet'!$C$8,VLOOKUP(V91,'EASR lookup'!$C$5:$M$273,10,FALSE),\"\")","v":""},{"$f":"IF(V91='Controls Sheet'!$C$8,VLOOKUP(V91,'EASR lookup'!$C$5:$M$273,11,FALSE),\"\")","v":""},{"$f":"IF(V91='Controls Sheet'!$C$8,'EASR Charts Controls'!W91,\"\")","v":""},{"$f":"IF(W91=\"\",\"\",VLOOKUP('Controls Sheet'!$D$8,'Controls Sheet'!$D$2:$I$6,6,FALSE))","v":""},""]
[null,"Forest of Dean",null,null,null,null,null,"Stockport",null,null,null,null,null,null,{"$f":"IF(INDEX($A$4:$E$111,,'Controls Sheet'!$F$8)=0,\"\",INDEX($A$4:$E$111,,'Controls Sheet'!$F$8))","v":""},{"$f":"IF(ISERROR(VLOOKUP($O92,'EASR lookup'!$C$5:$I$273,6,FALSE)),\"\",VLOOKUP($O92,'EASR lookup'!$C$5:$I$273,6,FALSE))","v":""},{"$f":"IF(O92='Controls Sheet'!$C$8,VLOOKUP(O92,'EASR lookup'!$C$5:$M$273,8,FALSE),\"\")","v":""},{"$f":"IF(O92='Controls Sheet'!$C$8,VLOOKUP(O92,'EASR lookup'!$C$5:$M$273,9,FALSE),\"\")","v":""},{"$f":"IF(O92='Controls Sheet'!$C$8,'EASR Charts Controls'!P92,\"\")","v":""},{"$f":"IF(P92=\"\",\"\",VLOOKUP('Controls Sheet'!$D$8,'Controls Sheet'!$D$2:$I$6,5,FALSE))","v":""},"",{"$f":"IF(INDEX($G$4:$K$111,,'Controls Sheet'!$F$8)=0,\"\",INDEX($G$4:$K$111,,'Controls Sheet'!$F$8))","v":""},{"$f":"IF(ISERROR(VLOOKUP($V92,'EASR lookup'!$C$5:$I$273,7,FALSE)),\"\",VLOOKUP($V92,'EASR lookup'!$C$5:$I$273,7,FALSE))","v":""},{"$f":"IF(V92='Controls Sheet'!$C$8,VLOOKUP(V92,'EASR lookup'!$C$5:$M$273,10,FALSE),\"\")","v":""},{"$f":"IF(V92='Controls Sheet'!$C$8,VLOOKUP(V92,'EASR lookup'!$C$5:$M$273,11,FALSE),\"\")","v":""},{"$f":"IF(V92='Controls Sheet'!$C$8,'EASR Charts Controls'!W92,\"\")","v":""},{"$f":"IF(W92=\"\",\"\",VLOOKUP('Controls Sheet'!$D$8,'Controls Sheet'!$D$2:$I$6,6,FALSE))","v":""},""]
[null,"South Staffordshire",null,null,null,null,null,"North Kesteven",null,null,null,null,null,null,{"$f":"IF(INDEX($A$4:$E$111,,'Controls Sheet'!$F$8)=0,\"\",INDEX($A$4:$E$111,,'Controls Sheet'!$F$8))","v":""},{"$f":"IF(ISERROR(VLOOKUP($O93,'EASR lookup'!$C$5:$I$273,6,FALSE)),\"\",VLOOKUP($O93,'EASR lookup'!$C$5:$I$273,6,FALSE))","v":""},{"$f":"IF(O93='Controls Sheet'!$C$8,VLOOKUP(O93,'EASR lookup'!$C$5:$M$273,8,FALSE),\"\")","v":""},{"$f":"IF(O93='Controls Sheet'!$C$8,VLOOKUP(O93,'EASR lookup'!$C$5:$M$273,9,FALSE),\"\")","v":""},{"$f":"IF(O93='Controls Sheet'!$C$8,'EASR Charts Controls'!P93,\"\")","v":""},{"$f":"IF(P93=\"\",\"\",VLOOKUP('Controls Sheet'!$D$8,'Controls Sheet'!$D$2:$I$6,5,FALSE))","v":""},"",{"$f":"IF(INDEX($G$4:$K$111,,'Controls Sheet'!$F$8)=0,\"\",INDEX($G$4:$K$111,,'Controls Sheet'!$F$8))","v":""},{"$f":"IF(ISERROR(VLOOKUP($V93,'EASR lookup'!$C$5:$I$273,7,FALSE)),\"\",VLOOKUP($V93,'EASR lookup'!$C$5:$I$273,7,FALSE))","v":""},{"$f":"IF(V93='Controls Sheet'!$C$8,VLOOKUP(V93,'EASR lookup'!$C$5:$M$273,10,FALSE),\"\")","v":""},{"$f":"IF(V93='Controls Sheet'!$C$8,VLOOKUP(V93,'EASR lookup'!$C$5:$M$273,11,FALSE),\"\")","v":""},{"$f":"IF(V93='Controls Sheet'!$C$8,'EASR Charts Controls'!W93,\"\")","v":""},{"$f":"IF(W93=\"\",\"\",VLOOKUP('Controls Sheet'!$D$8,'Controls Sheet'!$D$2:$I$6,6,FALSE))","v":""},""]
[null,"Wyre Forest",null,null,null,null,null,"Braintree",null,null,null,null,null,null,{"$f":"IF(INDEX($A$4:$E$111,,'Controls Sheet'!$F$8)=0,\"\",INDEX($A$4:$E$111,,'Controls Sheet'!$F$8))","v":""},{"$f":"IF(ISERROR(VLOOKUP($O94,'EASR lookup'!$C$5:$I$273,6,FALSE)),\"\",VLOOKUP($O94,'EASR lookup'!$C$5:$I$273,6,FALSE))","v":""},{"$f":"IF(O94='Controls Sheet'!$C$8,VLOOKUP(O94,'EASR lookup'!$C$5:$M$273,8,FALSE),\"\")","v":""},{"$f":"IF(O94='Controls Sheet'!$C$8,VLOOKUP(O94,'EASR lookup'!$C$5:$M$273,9,FALSE),\"\")","v":""},{"$f":"IF(O94='Controls Sheet'!$C$8,'EASR Charts Controls'!P94,\"\")","v":""},{"$f":"IF(P94=\"\",\"\",VLOOKUP('Controls Sheet'!$D$8,'Controls Sheet'!$D$2:$I$6,5,FALSE))","v":""},"",{"$f":"IF(INDEX($G$4:$K$111,,'Controls Sheet'!$F$8)=0,\"\",INDEX($G$4:$K$111,,'Controls Sheet'!$F$8))","v":""},{"$f":"IF(ISERROR(VLOOKUP($V94,'EASR lookup'!$C$5:$I$273,7,FALSE)),\"\",VLOOKUP($V94,'EASR lookup'!$C$5:$I$273,7,FALSE))","v":""},{"$f":"IF(V94='Controls Sheet'!$C$8,VLOOKUP(V94,'EASR lookup'!$C$5:$M$273,10,FALSE),\"\")","v":""},{"$f":"IF(V94='Controls Sheet'!$C$8,VLOOKUP(V94,'EASR lookup'!$C$5:$M$273,11,FALSE),\"\")","v":""},{"$f":"IF(V94='Controls Sheet'!$C$8,'EASR Charts Controls'!W94,\"\")","v":""},{"$f":"IF(W94=\"\",\"\",VLOOKUP('Controls Sheet'!$D$8,'Controls Sheet'!$D$2:$I$6,6,FALSE))","v":""},""]
[null,"Newark and Sherwood",null,null,null,null,null,"East Riding of Yorks",null,null,null,null,null,null,{"$f":"IF(INDEX($A$4:$E$111,,'Controls Sheet'!$F$8)=0,\"\",INDEX($A$4:$E$111,,'Controls Sheet'!$F$8))","v":""},{"$f":"IF(ISERROR(VLOOKUP($O95,'EASR lookup'!$C$5:$I$273,6,FALSE)),\"\",VLOOKUP($O95,'EASR lookup'!$C$5:$I$273,6,FALSE))","v":""},{"$f":"IF(O95='Controls Sheet'!$C$8,VLOOKUP(O95,'EASR lookup'!$C$5:$M$273,8,FALSE),\"\")","v":""},{"$f":"IF(O95='Controls Sheet'!$C$8,VLOOKUP(O95,'EASR lookup'!$C$5:$M$273,9,FALSE),\"\")","v":""},{"$f":"IF(O95='Controls Sheet'!$C$8,'EASR Charts Controls'!P95,\"\")","v":""},{"$f":"IF(P95=\"\",\"\",VLOOKUP('Controls Sheet'!$D$8,'Controls Sheet'!$D$2:$I$6,5,FALSE))","v":""},"",{"$f":"IF(INDEX($G$4:$K$111,,'Controls Sheet'!$F$8)=0,\"\",INDEX($G$4:$K$111,,'Controls Sheet'!$F$8))","v":""},{"$f":"IF(ISERROR(VLOOKUP($V95,'EASR lookup'!$C$5:$I$273,7,FALSE)),\"\",VLOOKUP($V95,'EASR lookup'!$C$5:$I$273,7,FALSE))","v":""},{"$f":"IF(V95='Controls Sheet'!$C$8,VLOOKUP(V95,'EASR lookup'!$C$5:$M$273,10,FALSE),\"\")","v":""},{"$f":"IF(V95='Controls Sheet'!$C$8,VLOOKUP(V95,'EASR lookup'!$C$5:$M$273,11,FALSE),\"\")","v":""},{"$f":"IF(V95='Controls Sheet'!$C$8,'EASR Charts Controls'!W95,\"\")","v":""},{"$f":"IF(W95=\"\",\"\",VLOOKUP('Controls Sheet'!$D$8,'Controls Sheet'!$D$2:$I$6,6,FALSE))","v":""},""]
[null,"York",null,null,null,null,null,"Fenland",null,null,null,null,null,null,{"$f":"IF(INDEX($A$4:$E$111,,'Controls Sheet'!$F$8)=0,\"\",INDEX($A$4:$E$111,,'Controls Sheet'!$F$8))","v":""},{"$f":"IF(ISERROR(VLOOKUP($O96,'EASR lookup'!$C$5:$I$273,6,FALSE)),\"\",VLOOKUP($O96,'EASR lookup'!$C$5:$I$273,6,FALSE))","v":""},{"$f":"IF(O96='Controls Sheet'!$C$8,VLOOKUP(O96,'EASR lookup'!$C$5:$M$273,8,FALSE),\"\")","v":""},{"$f":"IF(O96='Controls Sheet'!$C$8,VLOOKUP(O96,'EASR lookup'!$C$5:$M$273,9,FALSE),\"\")","v":""},{"$f":"IF(O96='Controls Sheet'!$C$8,'EASR Charts Controls'!P96,\"\")","v":""},{"$f":"IF(P96=\"\",\"\",VLOOKUP('Controls Sheet'!$D$8,'Controls Sheet'!$D$2:$I$6,5,FALSE))","v":""},"",{"$f":"IF(INDEX($G$4:$K$111,,'Controls Sheet'!$F$8)=0,\"\",INDEX($G$4:$K$111,,'Controls Sheet'!$F$8))","v":""},{"$f":"IF(ISERROR(VLOOKUP($V96,'EASR lookup'!$C$5:$I$273,7,FALSE)),\"\",VLOOKUP($V96,'EASR lookup'!$C$5:$I$273,7,FALSE))","v":""},{"$f":"IF(V96='Controls Sheet'!$C$8,VLOOKUP(V96,'EASR lookup'!$C$5:$M$273,10,FALSE),\"\")","v":""},{"$f":"IF(V96='Controls Sheet'!$C$8,VLOOKUP(V96,'EASR lookup'!$C$5:$M$273,11,FALSE),\"\")","v":""},{"$f":"IF(V96='Controls Sheet'!$C$8,'EASR Charts Controls'!W96,\"\")","v":""},{"$f":"IF(W96=\"\",\"\",VLOOKUP('Controls Sheet'!$D$8,'Controls Sheet'!$D$2:$I$6,6,FALSE))","v":""},""]
[null,"Northumberland",null,null,null,null,null,"South Ribble",null,null,null,null,null,null,{"$f":"IF(INDEX($A$4:$E$111,,'Controls Sheet'!$F$8)=0,\"\",INDEX($A$4:$E$111,,'Controls Sheet'!$F$8))","v":""},{"$f":"IF(ISERROR(VLOOKUP($O97,'EASR lookup'!$C$5:$I$273,6,FALSE)),\"\",VLOOKUP($O97,'EASR lookup'!$C$5:$I$273,6,FALSE))","v":""},{"$f":"IF(O97='Controls Sheet'!$C$8,VLOOKUP(O97,'EASR lookup'!$C$5:$M$273,8,FALSE),\"\")","v":""},{"$f":"IF(O97='Controls Sheet'!$C$8,VLOOKUP(O97,'EASR lookup'!$C$5:$M$273,9,FALSE),\"\")","v":""},{"$f":"IF(O97='Controls Sheet'!$C$8,'EASR Charts Controls'!P97,\"\")","v":""},{"$f":"IF(P97=\"\",\"\",VLOOKUP('Controls Sheet'!$D$8,'Controls Sheet'!$D$2:$I$6,5,FALSE))","v":""},"",{"$f":"IF(INDEX($G$4:$K$111,,'Controls Sheet'!$F$8)=0,\"\",INDEX($G$4:$K$111,,'Controls Sheet'!$F$8))","v":""},{"$f":"IF(ISERROR(VLOOKUP($V97,'EASR lookup'!$C$5:$I$273,7,FALSE)),\"\",VLOOKUP($V97,'EASR lookup'!$C$5:$I$273,7,FALSE))","v":""},{"$f":"IF(V97='Controls Sheet'!$C$8,VLOOKUP(V97,'EASR lookup'!$C$5:$M$273,10,FALSE),\"\")","v":""},{"$f":"IF(V97='Controls Sheet'!$C$8,VLOOKUP(V97,'EASR lookup'!$C$5:$M$273,11,FALSE),\"\")","v":""},{"$f":"IF(V97='Controls Sheet'!$C$8,'EASR Charts Controls'!W97,\"\")","v":""},{"$f":"IF(W97=\"\",\"\",VLOOKUP('Controls Sheet'!$D$8,'Controls Sheet'!$D$2:$I$6,6,FALSE))","v":""},""]
[null,"Braintree",null,null,null,null,null,"Cheshire West and Chester",null,null,null,null,null,null,{"$f":"IF(INDEX($A$4:$E$111,,'Controls Sheet'!$F$8)=0,\"\",INDEX($A$4:$E$111,,'Controls Sheet'!$F$8))","v":""},{"$f":"IF(ISERROR(VLOOKUP($O98,'EASR lookup'!$C$5:$I$273,6,FALSE)),\"\",VLOOKUP($O98,'EASR lookup'!$C$5:$I$273,6,FALSE))","v":""},{"$f":"IF(O98='Controls Sheet'!$C$8,VLOOKUP(O98,'EASR lookup'!$C$5:$M$273,8,FALSE),\"\")","v":""},{"$f":"IF(O98='Controls Sheet'!$C$8,VLOOKUP(O98,'EASR lookup'!$C$5:$M$273,9,FALSE),\"\")","v":""},{"$f":"IF(O98='Controls Sheet'!$C$8,'EASR Charts Controls'!P98,\"\")","v":""},{"$f":"IF(P98=\"\",\"\",VLOOKUP('Controls Sheet'!$D$8,'Controls Sheet'!$D$2:$I$6,5,FALSE))","v":""},"",{"$f":"IF(INDEX($G$4:$K$111,,'Controls Sheet'!$F$8)=0,\"\",INDEX($G$4:$K$111,,'Controls Sheet'!$F$8))","v":""},{"$f":"IF(ISERROR(VLOOKUP($V98,'EASR lookup'!$C$5:$I$273,7,FALSE)),\"\",VLOOKUP($V98,'EASR lookup'!$C$5:$I$273,7,FALSE))","v":""},{"$f":"IF(V98='Controls Sheet'!$C$8,VLOOKUP(V98,'EASR lookup'!$C$5:$M$273,10,FALSE),\"\")","v":""},{"$f":"IF(V98='Controls Sheet'!$C$8,VLOOKUP(V98,'EASR lookup'!$C$5:$M$273,11,FALSE),\"\")","v":""},{"$f":"IF(V98='Controls Sheet'!$C$8,'EASR Charts Controls'!W98,\"\")","v":""},{"$f":"IF(W98=\"\",\"\",VLOOKUP('Controls Sheet'!$D$8,'Controls Sheet'!$D$2:$I$6,6,FALSE))","v":""},""]
[null,"South Derbyshire",null,null,null,null,null,"South Staffordshire",null,null,null,null,null,null,{"$f":"IF(INDEX($A$4:$E$111,,'Controls Sheet'!$F$8)=0,\"\",INDEX($A$4:$E$111,,'Controls Sheet'!$F$8))","v":""},{"$f":"IF(ISERROR(VLOOKUP($O99,'EASR lookup'!$C$5:$I$273,6,FALSE)),\"\",VLOOKUP($O99,'EASR lookup'!$C$5:$I$273,6,FALSE))","v":""},{"$f":"IF(O99='Controls Sheet'!$C$8,VLOOKUP(O99,'EASR lookup'!$C$5:$M$273,8,FALSE),\"\")","v":""},{"$f":"IF(O99='Controls Sheet'!$C$8,VLOOKUP(O99,'EASR lookup'!$C$5:$M$273,9,FALSE),\"\")","v":""},{"$f":"IF(O99='Controls Sheet'!$C$8,'EASR Charts Controls'!P99,\"\")","v":""},{"$f":"IF(P99=\"\",\"\",VLOOKUP('Controls Sheet'!$D$8,'Controls Sheet'!$D$2:$I$6,5,FALSE))","v":""},"",{"$f":"IF(INDEX($G$4:$K$111,,'Controls Sheet'!$F$8)=0,\"\",INDEX($G$4:$K$111,,'Controls Sheet'!$F$8))","v":""},{"$f":"IF(ISERROR(VLOOKUP($V99,'EASR lookup'!$C$5:$I$273,7,FALSE)),\"\",VLOOKUP($V99,'EASR lookup'!$C$5:$I$273,7,FALSE))","v":""},{"$f":"IF(V99='Controls Sheet'!$C$8,VLOOKUP(V99,'EASR lookup'!$C$5:$M$273,10,FALSE),\"\")","v":""},{"$f":"IF(V99='Controls Sheet'!$C$8,VLOOKUP(V99,'EASR lookup'!$C$5:$M$273,11,FALSE),\"\")","v":""},{"$f":"IF(V99='Controls Sheet'!$C$8,'EASR Charts Controls'!W99,\"\")","v":""},{"$f":"IF(W99=\"\",\"\",VLOOKUP('Controls Sheet'!$D$8,'Controls Sheet'!$D$2:$I$6,6,FALSE))","v":""},""]
[null,"Castlereagh",null,null,null,null,null,"Newark and Sherwood",null,null,null,null,null,null,{"$f":"IF(INDEX($A$4:$E$111,,'Controls Sheet'!$F$8)=0,\"\",INDEX($A$4:$E$111,,'Controls Sheet'!$F$8))","v":""},{"$f":"IF(ISERROR(VLOOKUP($O100,'EASR lookup'!$C$5:$I$273,6,FALSE)),\"\",VLOOKUP($O100,'EASR lookup'!$C$5:$I$273,6,FALSE))","v":""},{"$f":"IF(O100='Controls Sheet'!$C$8,VLOOKUP(O100,'EASR lookup'!$C$5:$M$273,8,FALSE),\"\")","v":""},{"$f":"IF(O100='Controls Sheet'!$C$8,VLOOKUP(O100,'EASR lookup'!$C$5:$M$273,9,FALSE),\"\")","v":""},{"$f":"IF(O100='Controls Sheet'!$C$8,'EASR Charts Controls'!P100,\"\")","v":""},{"$f":"IF(P100=\"\",\"\",VLOOKUP('Controls Sheet'!$D$8,'Controls Sheet'!$D$2:$I$6,5,FALSE))","v":""},"",{"$f":"IF(INDEX($G$4:$K$111,,'Controls Sheet'!$F$8)=0,\"\",INDEX($G$4:$K$111,,'Controls Sheet'!$F$8))","v":""},{"$f":"IF(ISERROR(VLOOKUP($V100,'EASR lookup'!$C$5:$I$273,7,FALSE)),\"\",VLOOKUP($V100,'EASR lookup'!$C$5:$I$273,7,FALSE))","v":""},{"$f":"IF(V100='Controls Sheet'!$C$8,VLOOKUP(V100,'EASR lookup'!$C$5:$M$273,10,FALSE),\"\")","v":""},{"$f":"IF(V100='Controls Sheet'!$C$8,VLOOKUP(V100,'EASR lookup'!$C$5:$M$273,11,FALSE),\"\")","v":""},{"$f":"IF(V100='Controls Sheet'!$C$8,'EASR Charts Controls'!W100,\"\")","v":""},{"$f":"IF(W100=\"\",\"\",VLOOKUP('Controls Sheet'!$D$8,'Controls Sheet'!$D$2:$I$6,6,FALSE))","v":""},""]
[null,"Kettering",null,null,null,null,null,"Selby",null,null,null,null,null,null,{"$f":"IF(INDEX($A$4:$E$111,,'Controls Sheet'!$F$8)=0,\"\",INDEX($A$4:$E$111,,'Controls Sheet'!$F$8))","v":""},{"$f":"IF(ISERROR(VLOOKUP($O101,'EASR lookup'!$C$5:$I$273,6,FALSE)),\"\",VLOOKUP($O101,'EASR lookup'!$C$5:$I$273,6,FALSE))","v":""},{"$f":"IF(O101='Controls Sheet'!$C$8,VLOOKUP(O101,'EASR lookup'!$C$5:$M$273,8,FALSE),\"\")","v":""},{"$f":"IF(O101='Controls Sheet'!$C$8,VLOOKUP(O101,'EASR lookup'!$C$5:$M$273,9,FALSE),\"\")","v":""},{"$f":"IF(O101='Controls Sheet'!$C$8,'EASR Charts Controls'!P101,\"\")","v":""},{"$f":"IF(P101=\"\",\"\",VLOOKUP('Controls Sheet'!$D$8,'Controls Sheet'!$D$2:$I$6,5,FALSE))","v":""},"",{"$f":"IF(INDEX($G$4:$K$111,,'Controls Sheet'!$F$8)=0,\"\",INDEX($G$4:$K$111,,'Controls Sheet'!$F$8))","v":""},{"$f":"IF(ISERROR(VLOOKUP($V101,'EASR lookup'!$C$5:$I$273,7,FALSE)),\"\",VLOOKUP($V101,'EASR lookup'!$C$5:$I$273,7,FALSE))","v":""},{"$f":"IF(V101='Controls Sheet'!$C$8,VLOOKUP(V101,'EASR lookup'!$C$5:$M$273,10,FALSE),\"\")","v":""},{"$f":"IF(V101='Controls Sheet'!$C$8,VLOOKUP(V101,'EASR lookup'!$C$5:$M$273,11,FALSE),\"\")","v":""},{"$f":"IF(V101='Controls Sheet'!$C$8,'EASR Charts Controls'!W101,\"\")","v":""},{"$f":"IF(W101=\"\",\"\",VLOOKUP('Controls Sheet'!$D$8,'Controls Sheet'!$D$2:$I$6,6,FALSE))","v":""},""]
[null,"North West Leicestershire",null,null,null,null,null,"South Derbyshire",null,null,null,null,null,null,{"$f":"IF(INDEX($A$4:$E$111,,'Controls Sheet'!$F$8)=0,\"\",INDEX($A$4:$E$111,,'Controls Sheet'!$F$8))","v":""},{"$f":"IF(ISERROR(VLOOKUP($O102,'EASR lookup'!$C$5:$I$273,6,FALSE)),\"\",VLOOKUP($O102,'EASR lookup'!$C$5:$I$273,6,FALSE))","v":""},{"$f":"IF(O102='Controls Sheet'!$C$8,VLOOKUP(O102,'EASR lookup'!$C$5:$M$273,8,FALSE),\"\")","v":""},{"$f":"IF(O102='Controls Sheet'!$C$8,VLOOKUP(O102,'EASR lookup'!$C$5:$M$273,9,FALSE),\"\")","v":""},{"$f":"IF(O102='Controls Sheet'!$C$8,'EASR Charts Controls'!P102,\"\")","v":""},{"$f":"IF(P102=\"\",\"\",VLOOKUP('Controls Sheet'!$D$8,'Controls Sheet'!$D$2:$I$6,5,FALSE))","v":""},"",{"$f":"IF(INDEX($G$4:$K$111,,'Controls Sheet'!$F$8)=0,\"\",INDEX($G$4:$K$111,,'Controls Sheet'!$F$8))","v":""},{"$f":"IF(ISERROR(VLOOKUP($V102,'EASR lookup'!$C$5:$I$273,7,FALSE)),\"\",VLOOKUP($V102,'EASR lookup'!$C$5:$I$273,7,FALSE))","v":""},{"$f":"IF(V102='Controls Sheet'!$C$8,VLOOKUP(V102,'EASR lookup'!$C$5:$M$273,10,FALSE),\"\")","v":""},{"$f":"IF(V102='Controls Sheet'!$C$8,VLOOKUP(V102,'EASR lookup'!$C$5:$M$273,11,FALSE),\"\")","v":""},{"$f":"IF(V102='Controls Sheet'!$C$8,'EASR Charts Controls'!W102,\"\")","v":""},{"$f":"IF(W102=\"\",\"\",VLOOKUP('Controls Sheet'!$D$8,'Controls Sheet'!$D$2:$I$6,6,FALSE))","v":""},""]
[null,"Daventry",null,null,null,null,null,"Daventry",null,null,null,null,null,null,{"$f":"IF(INDEX($A$4:$E$111,,'Controls Sheet'!$F$8)=0,\"\",INDEX($A$4:$E$111,,'Controls Sheet'!$F$8))","v":""},{"$f":"IF(ISERROR(VLOOKUP($O103,'EASR lookup'!$C$5:$I$273,6,FALSE)),\"\",VLOOKUP($O103,'EASR lookup'!$C$5:$I$273,6,FALSE))","v":""},{"$f":"IF(O103='Controls Sheet'!$C$8,VLOOKUP(O103,'EASR lookup'!$C$5:$M$273,8,FALSE),\"\")","v":""},{"$f":"IF(O103='Controls Sheet'!$C$8,VLOOKUP(O103,'EASR lookup'!$C$5:$M$273,9,FALSE),\"\")","v":""},{"$f":"IF(O103='Controls Sheet'!$C$8,'EASR Charts Controls'!P103,\"\")","v":""},{"$f":"IF(P103=\"\",\"\",VLOOKUP('Controls Sheet'!$D$8,'Controls Sheet'!$D$2:$I$6,5,FALSE))","v":""},"",{"$f":"IF(INDEX($G$4:$K$111,,'Controls Sheet'!$F$8)=0,\"\",INDEX($G$4:$K$111,,'Controls Sheet'!$F$8))","v":""},{"$f":"IF(ISERROR(VLOOKUP($V103,'EASR lookup'!$C$5:$I$273,7,FALSE)),\"\",VLOOKUP($V103,'EASR lookup'!$C$5:$I$273,7,FALSE))","v":""},{"$f":"IF(V103='Controls Sheet'!$C$8,VLOOKUP(V103,'EASR lookup'!$C$5:$M$273,10,FALSE),\"\")","v":""},{"$f":"IF(V103='Controls Sheet'!$C$8,VLOOKUP(V103,'EASR lookup'!$C$5:$M$273,11,FALSE),\"\")","v":""},{"$f":"IF(V103='Controls Sheet'!$C$8,'EASR Charts Controls'!W103,\"\")","v":""},{"$f":"IF(W103=\"\",\"\",VLOOKUP('Controls Sheet'!$D$8,'Controls Sheet'!$D$2:$I$6,6,FALSE))","v":""},""]
[null,"Cheshire West and Chester",null,null,null,null,null,"East Renfrewshire",null,null,null,null,null,null,{"$f":"IF(INDEX($A$4:$E$111,,'Controls Sheet'!$F$8)=0,\"\",INDEX($A$4:$E$111,,'Controls Sheet'!$F$8))","v":""},{"$f":"IF(ISERROR(VLOOKUP($O104,'EASR lookup'!$C$5:$I$273,6,FALSE)),\"\",VLOOKUP($O104,'EASR lookup'!$C$5:$I$273,6,FALSE))","v":""},{"$f":"IF(O104='Controls Sheet'!$C$8,VLOOKUP(O104,'EASR lookup'!$C$5:$M$273,8,FALSE),\"\")","v":""},{"$f":"IF(O104='Controls Sheet'!$C$8,VLOOKUP(O104,'EASR lookup'!$C$5:$M$273,9,FALSE),\"\")","v":""},{"$f":"IF(O104='Controls Sheet'!$C$8,'EASR Charts Controls'!P104,\"\")","v":""},{"$f":"IF(P104=\"\",\"\",VLOOKUP('Controls Sheet'!$D$8,'Controls Sheet'!$D$2:$I$6,5,FALSE))","v":""},"",{"$f":"IF(INDEX($G$4:$K$111,,'Controls Sheet'!$F$8)=0,\"\",INDEX($G$4:$K$111,,'Controls Sheet'!$F$8))","v":""},{"$f":"IF(ISERROR(VLOOKUP($V104,'EASR lookup'!$C$5:$I$273,7,FALSE)),\"\",VLOOKUP($V104,'EASR lookup'!$C$5:$I$273,7,FALSE))","v":""},{"$f":"IF(V104='Controls Sheet'!$C$8,VLOOKUP(V104,'EASR lookup'!$C$5:$M$273,10,FALSE),\"\")","v":""},{"$f":"IF(V104='Controls Sheet'!$C$8,VLOOKUP(V104,'EASR lookup'!$C$5:$M$273,11,FALSE),\"\")","v":""},{"$f":"IF(V104='Controls Sheet'!$C$8,'EASR Charts Controls'!W104,\"\")","v":""},{"$f":"IF(W104=\"\",\"\",VLOOKUP('Controls Sheet'!$D$8,'Controls Sheet'!$D$2:$I$6,6,FALSE))","v":""},""]
[null,"Selby",null,null,null,null,null,"Northumberland",null,null,null,null,null,null,{"$f":"IF(INDEX($A$4:$E$111,,'Controls Sheet'!$F$8)=0,\"\",INDEX($A$4:$E$111,,'Controls Sheet'!$F$8))","v":""},{"$f":"IF(ISERROR(VLOOKUP($O105,'EASR lookup'!$C$5:$I$273,6,FALSE)),\"\",VLOOKUP($O105,'EASR lookup'!$C$5:$I$273,6,FALSE))","v":""},{"$f":"IF(O105='Controls Sheet'!$C$8,VLOOKUP(O105,'EASR lookup'!$C$5:$M$273,8,FALSE),\"\")","v":""},{"$f":"IF(O105='Controls Sheet'!$C$8,VLOOKUP(O105,'EASR lookup'!$C$5:$M$273,9,FALSE),\"\")","v":""},{"$f":"IF(O105='Controls Sheet'!$C$8,'EASR Charts Controls'!P105,\"\")","v":""},{"$f":"IF(P105=\"\",\"\",VLOOKUP('Controls Sheet'!$D$8,'Controls Sheet'!$D$2:$I$6,5,FALSE))","v":""},"",{"$f":"IF(INDEX($G$4:$K$111,,'Controls Sheet'!$F$8)=0,\"\",INDEX($G$4:$K$111,,'Controls Sheet'!$F$8))","v":""},{"$f":"IF(ISERROR(VLOOKUP($V105,'EASR lookup'!$C$5:$I$273,7,FALSE)),\"\",VLOOKUP($V105,'EASR lookup'!$C$5:$I$273,7,FALSE))","v":""},{"$f":"IF(V105='Controls Sheet'!$C$8,VLOOKUP(V105,'EASR lookup'!$C$5:$M$273,10,FALSE),\"\")","v":""},{"$f":"IF(V105='Controls Sheet'!$C$8,VLOOKUP(V105,'EASR lookup'!$C$5:$M$273,11,FALSE),\"\")","v":""},{"$f":"IF(V105='Controls Sheet'!$C$8,'EASR Charts Controls'!W105,\"\")","v":""},{"$f":"IF(W105=\"\",\"\",VLOOKUP('Controls Sheet'!$D$8,'Controls Sheet'!$D$2:$I$6,6,FALSE))","v":""},""]
[null,"North Warwickshire",null,null,null,null,null,"Warrington",null,null,null,null,null,null,{"$f":"IF(INDEX($A$4:$E$111,,'Controls Sheet'!$F$8)=0,\"\",INDEX($A$4:$E$111,,'Controls Sheet'!$F$8))","v":""},{"$f":"IF(ISERROR(VLOOKUP($O106,'EASR lookup'!$C$5:$I$273,6,FALSE)),\"\",VLOOKUP($O106,'EASR lookup'!$C$5:$I$273,6,FALSE))","v":""},{"$f":"IF(O106='Controls Sheet'!$C$8,VLOOKUP(O106,'EASR lookup'!$C$5:$M$273,8,FALSE),\"\")","v":""},{"$f":"IF(O106='Controls Sheet'!$C$8,VLOOKUP(O106,'EASR lookup'!$C$5:$M$273,9,FALSE),\"\")","v":""},{"$f":"IF(O106='Controls Sheet'!$C$8,'EASR Charts Controls'!P106,\"\")","v":""},{"$f":"IF(P106=\"\",\"\",VLOOKUP('Controls Sheet'!$D$8,'Controls Sheet'!$D$2:$I$6,5,FALSE))","v":""},"",{"$f":"IF(INDEX($G$4:$K$111,,'Controls Sheet'!$F$8)=0,\"\",INDEX($G$4:$K$111,,'Controls Sheet'!$F$8))","v":""},{"$f":"IF(ISERROR(VLOOKUP($V106,'EASR lookup'!$C$5:$I$273,7,FALSE)),\"\",VLOOKUP($V106,'EASR lookup'!$C$5:$I$273,7,FALSE))","v":""},{"$f":"IF(V106='Controls Sheet'!$C$8,VLOOKUP(V106,'EASR lookup'!$C$5:$M$273,10,FALSE),\"\")","v":""},{"$f":"IF(V106='Controls Sheet'!$C$8,VLOOKUP(V106,'EASR lookup'!$C$5:$M$273,11,FALSE),\"\")","v":""},{"$f":"IF(V106='Controls Sheet'!$C$8,'EASR Charts Controls'!W106,\"\")","v":""},{"$f":"IF(W106=\"\",\"\",VLOOKUP('Controls Sheet'!$D$8,'Controls Sheet'!$D$2:$I$6,6,FALSE))","v":""},""]
[null,"Bromsgrove",null,null,null,null,null,"Castle Point",null,null,null,null,null,null,{"$f":"IF(INDEX($A$4:$E$111,,'Controls Sheet'!$F$8)=0,\"\",INDEX($A$4:$E$111,,'Controls Sheet'!$F$8))","v":""},{"$f":"IF(ISERROR(VLOOKUP($O107,'EASR lookup'!$C$5:$I$273,6,FALSE)),\"\",VLOOKUP($O107,'EASR lookup'!$C$5:$I$273,6,FALSE))","v":""},{"$f":"IF(O107='Controls Sheet'!$C$8,VLOOKUP(O107,'EASR lookup'!$C$5:$M$273,8,FALSE),\"\")","v":""},{"$f":"IF(O107='Controls Sheet'!$C$8,VLOOKUP(O107,'EASR lookup'!$C$5:$M$273,9,FALSE),\"\")","v":""},{"$f":"IF(O107='Controls Sheet'!$C$8,'EASR Charts Controls'!P107,\"\")","v":""},{"$f":"IF(P107=\"\",\"\",VLOOKUP('Controls Sheet'!$D$8,'Controls Sheet'!$D$2:$I$6,5,FALSE))","v":""},"",{"$f":"IF(INDEX($G$4:$K$111,,'Controls Sheet'!$F$8)=0,\"\",INDEX($G$4:$K$111,,'Controls Sheet'!$F$8))","v":""},{"$f":"IF(ISERROR(VLOOKUP($V107,'EASR lookup'!$C$5:$I$273,7,FALSE)),\"\",VLOOKUP($V107,'EASR lookup'!$C$5:$I$273,7,FALSE))","v":""},{"$f":"IF(V107='Controls Sheet'!$C$8,VLOOKUP(V107,'EASR lookup'!$C$5:$M$273,10,FALSE),\"\")","v":""},{"$f":"IF(V107='Controls Sheet'!$C$8,VLOOKUP(V107,'EASR lookup'!$C$5:$M$273,11,FALSE),\"\")","v":""},{"$f":"IF(V107='Controls Sheet'!$C$8,'EASR Charts Controls'!W107,\"\")","v":""},{"$f":"IF(W107=\"\",\"\",VLOOKUP('Controls Sheet'!$D$8,'Controls Sheet'!$D$2:$I$6,6,FALSE))","v":""},""]
[null,"Warrington",null,null,null,null,null,"Gedling",null,null,null,null,null,null,{"$f":"IF(INDEX($A$4:$E$111,,'Controls Sheet'!$F$8)=0,\"\",INDEX($A$4:$E$111,,'Controls Sheet'!$F$8))","v":""},{"$f":"IF(ISERROR(VLOOKUP($O108,'EASR lookup'!$C$5:$I$273,6,FALSE)),\"\",VLOOKUP($O108,'EASR lookup'!$C$5:$I$273,6,FALSE))","v":""},{"$f":"IF(O108='Controls Sheet'!$C$8,VLOOKUP(O108,'EASR lookup'!$C$5:$M$273,8,FALSE),\"\")","v":""},{"$f":"IF(O108='Controls Sheet'!$C$8,VLOOKUP(O108,'EASR lookup'!$C$5:$M$273,9,FALSE),\"\")","v":""},{"$f":"IF(O108='Controls Sheet'!$C$8,'EASR Charts Controls'!P108,\"\")","v":""},{"$f":"IF(P108=\"\",\"\",VLOOKUP('Controls Sheet'!$D$8,'Controls Sheet'!$D$2:$I$6,5,FALSE))","v":""},"",{"$f":"IF(INDEX($G$4:$K$111,,'Controls Sheet'!$F$8)=0,\"\",INDEX($G$4:$K$111,,'Controls Sheet'!$F$8))","v":""},{"$f":"IF(ISERROR(VLOOKUP($V108,'EASR lookup'!$C$5:$I$273,7,FALSE)),\"\",VLOOKUP($V108,'EASR lookup'!$C$5:$I$273,7,FALSE))","v":""},{"$f":"IF(V108='Controls Sheet'!$C$8,VLOOKUP(V108,'EASR lookup'!$C$5:$M$273,10,FALSE),\"\")","v":""},{"$f":"IF(V108='Controls Sheet'!$C$8,VLOOKUP(V108,'EASR lookup'!$C$5:$M$273,11,FALSE),\"\")","v":""},{"$f":"IF(V108='Controls Sheet'!$C$8,'EASR Charts Controls'!W108,\"\")","v":""},{"$f":"IF(W108=\"\",\"\",VLOOKUP('Controls Sheet'!$D$8,'Controls Sheet'!$D$2:$I$6,6,FALSE))","v":""},""]
[null,"Boston",null,null,null,null,null,"Stirling",null,null,null,null,null,null,{"$f":"IF(INDEX($A$4:$E$111,,'Controls Sheet'!$F$8)=0,\"\",INDEX($A$4:$E$111,,'Controls Sheet'!$F$8))","v":""},{"$f":"IF(ISERROR(VLOOKUP($O109,'EASR lookup'!$C$5:$I$273,6,FALSE)),\"\",VLOOKUP($O109,'EASR lookup'!$C$5:$I$273,6,FALSE))","v":""},{"$f":"IF(O109='Controls Sheet'!$C$8,VLOOKUP(O109,'EASR lookup'!$C$5:$M$273,8,FALSE),\"\")","v":""},{"$f":"IF(O109='Controls Sheet'!$C$8,VLOOKUP(O109,'EASR lookup'!$C$5:$M$273,9,FALSE),\"\")","v":""},{"$f":"IF(O109='Controls Sheet'!$C$8,'EASR Charts Controls'!P109,\"\")","v":""},{"$f":"IF(P109=\"\",\"\",VLOOKUP('Controls Sheet'!$D$8,'Controls Sheet'!$D$2:$I$6,5,FALSE))","v":""},"",{"$f":"IF(INDEX($G$4:$K$111,,'Controls Sheet'!$F$8)=0,\"\",INDEX($G$4:$K$111,,'Controls Sheet'!$F$8))","v":""},{"$f":"IF(ISERROR(VLOOKUP($V109,'EASR lookup'!$C$5:$I$273,7,FALSE)),\"\",VLOOKUP($V109,'EASR lookup'!$C$5:$I$273,7,FALSE))","v":""},{"$f":"IF(V109='Controls Sheet'!$C$8,VLOOKUP(V109,'EASR lookup'!$C$5:$M$273,10,FALSE),\"\")","v":""},{"$f":"IF(V109='Controls Sheet'!$C$8,VLOOKUP(V109,'EASR lookup'!$C$5:$M$273,11,FALSE),\"\")","v":""},{"$f":"IF(V109='Controls Sheet'!$C$8,'EASR Charts Controls'!W109,\"\")","v":""},{"$f":"IF(W109=\"\",\"\",VLOOKUP('Controls Sheet'!$D$8,'Controls Sheet'!$D$2:$I$6,6,FALSE))","v":""},""]
[null,"Bury",null,null,null,null,null,"Chorley",null,null,null,null,null,null,{"$f":"IF(INDEX($A$4:$E$111,,'Controls Sheet'!$F$8)=0,\"\",INDEX($A$4:$E$111,,'Controls Sheet'!$F$8))","v":""},{"$f":"IF(ISERROR(VLOOKUP($O110,'EASR lookup'!$C$5:$I$273,6,FALSE)),\"\",VLOOKUP($O110,'EASR lookup'!$C$5:$I$273,6,FALSE))","v":""},{"$f":"IF(O110='Controls Sheet'!$C$8,VLOOKUP(O110,'EASR lookup'!$C$5:$M$273,8,FALSE),\"\")","v":""},{"$f":"IF(O110='Controls Sheet'!$C$8,VLOOKUP(O110,'EASR lookup'!$C$5:$M$273,9,FALSE),\"\")","v":""},{"$f":"IF(O110='Controls Sheet'!$C$8,'EASR Charts Controls'!P110,\"\")","v":""},{"$f":"IF(P110=\"\",\"\",VLOOKUP('Controls Sheet'!$D$8,'Controls Sheet'!$D$2:$I$6,5,FALSE))","v":""},"",{"$f":"IF(INDEX($G$4:$K$111,,'Controls Sheet'!$F$8)=0,\"\",INDEX($G$4:$K$111,,'Controls Sheet'!$F$8))","v":""},{"$f":"IF(ISERROR(VLOOKUP($V110,'EASR lookup'!$C$5:$I$273,7,FALSE)),\"\",VLOOKUP($V110,'EASR lookup'!$C$5:$I$273,7,FALSE))","v":""},{"$f":"IF(V110='Controls Sheet'!$C$8,VLOOKUP(V110,'EASR lookup'!$C$5:$M$273,10,FALSE),\"\")","v":""},{"$f":"IF(V110='Controls Sheet'!$C$8,VLOOKUP(V110,'EASR lookup'!$C$5:$M$273,11,FALSE),\"\")","v":""},{"$f":"IF(V110='Controls Sheet'!$C$8,'EASR Charts Controls'!W110,\"\")","v":""},{"$f":"IF(W110=\"\",\"\",VLOOKUP('Controls Sheet'!$D$8,'Controls Sheet'!$D$2:$I$6,6,FALSE))","v":""},""]
[null,"Stirling",null,null,null,null,null,"Bury",null,null,null,null,null,null,{"$f":"IF(INDEX($A$4:$E$111,,'Controls Sheet'!$F$8)=0,\"\",INDEX($A$4:$E$111,,'Controls Sheet'!$F$8))","v":""},{"$f":"IF(ISERROR(VLOOKUP($O111,'EASR lookup'!$C$5:$I$273,6,FALSE)),\"\",VLOOKUP($O111,'EASR lookup'!$C$5:$I$273,6,FALSE))","v":""},{"$f":"IF(O111='Controls Sheet'!$C$8,VLOOKUP(O111,'EASR lookup'!$C$5:$M$273,8,FALSE),\"\")","v":""},{"$f":"IF(O111='Controls Sheet'!$C$8,VLOOKUP(O111,'EASR lookup'!$C$5:$M$273,9,FALSE),\"\")","v":""},{"$f":"IF(O111='Controls Sheet'!$C$8,'EASR Charts Controls'!P111,\"\")","v":""},{"$f":"IF(P111=\"\",\"\",VLOOKUP('Controls Sheet'!$D$8,'Controls Sheet'!$D$2:$I$6,5,FALSE))","v":""},"",{"$f":"IF(INDEX($G$4:$K$111,,'Controls Sheet'!$F$8)=0,\"\",INDEX($G$4:$K$111,,'Controls Sheet'!$F$8))","v":""},{"$f":"IF(ISERROR(VLOOKUP($V111,'EASR lookup'!$C$5:$I$273,7,FALSE)),\"\",VLOOKUP($V111,'EASR lookup'!$C$5:$I$273,7,FALSE))","v":""},{"$f":"IF(V111='Controls Sheet'!$C$8,VLOOKUP(V111,'EASR lookup'!$C$5:$M$273,10,FALSE),\"\")","v":""},{"$f":"IF(V111='Controls Sheet'!$C$8,VLOOKUP(V111,'EASR lookup'!$C$5:$M$273,11,FALSE),\"\")","v":""},{"$f":"IF(V111='Controls Sheet'!$C$8,'EASR Charts Controls'!W111,\"\")","v":""},{"$f":"IF(W111=\"\",\"\",VLOOKUP('Controls Sheet'!$D$8,'Controls Sheet'!$D$2:$I$6,6,FALSE))","v":""},""]

{"sheet":"ASR lookup","index":6,"n_rows":70,"n_cols":100,"rows_kept":70,"cut":false,"hidden":true,"merged":[]}
["Age-specific rates lookup",null,null,null,null,null,null,null,null,null,null,null,null,null,null,null,null,null,null,null,null,null,null,null,null,null,null,null,"Excess deaths - based on Top 5",null,null,null,null,null,null,null,null,null,null,null,null,null,null,null,null,null,null,null,"Lower confidence intervals",null,null,null,null,null,null,null,null,null,null,null,null,null,null,null,"Upper confidence intervals",null,null,null,null,null,null,null,null,null,null,null,null,null,null,null,"Excess deaths - based on Wales"]
[null,null,null,null,null,null,null,null,7,8,9,10,11,12,13,14,15,16,17,18,19,20,21,22,23,24,25,26,27,28,29,30,31,32,33,34,35,36,37,38,39,40,41,42,43,44,45,46,47,48,49,50,51,52,53,54,55,56,57,58,59,60,61,62,63,64,65,66,67,68,69,70,71,72,73,74,75,76,77,78,79,80,81,82,83,84,85,86,87,88,89,90,91,92,93,94,95,96,97,98]
["Males",null,null,null,null,null,null,"Age­standardised mortality rate","Age-specific rates"]
["Code","LAD","LAD2","Subgroups ","Subgroups2","Groups ","Supergroups","Males","00-01","01-04","05-09","10-14","15-19","20-24","25-29","30-34","35-39","40-44","45-49","50-54","55-59","60-64","65-69","70-74","75-79","80-84","85+","total","00-01","01-04","05-09","10-14","15-19","20-24","25-29","30-34","35-39","40-44","45-49","50-54","55-59","60-64","65-69","70-74","75-79","80-84","85+","total","00-01","01-04","05-09","10-14","15-19","20-24","25-29","30-34","35-39","40-44","45-49","50-54","55-59","60-64","65-69","70-74","00-01","01-04","05-09","10-14","15-19","20-24","25-29","30-34","35-39","40-44","45-49","50-54","55-59","60-64","65-69","70-74","00-01","01-04","05-09","10-14","15-19","20-24","25-29","30-34","35-39","40-44","45-49","50-54","55-59","60-64","65-69","70-74","75-79","80-84","85+","total"]
["00PT","Cardiff","Cardiff","1.1.1","1.1.1","1.1",1,690.4,5.3,0.2,0.1,0,0.3,0.3,0.6,0.8,1.2,1.4,2.4,3.9,6.2,10.199999999999999,16.2,29.2,50.5,82.7,179.8,7.9,2.15,1.44,0.52,-1.02,0.8,-1.71,-0.13,-2.04,2.96,-1.03,-2.9,-0.4,-10.27,4.07,9.75,37.369999999999997,44.47,29.29,63.52,176.84,2.8,0,0,0,0.1,0.1,0.3,0.4,0.7,0.8,1.6,2.7,4.7,8.1,13.2,24.5,9,0.8,0.6,0.4,0.7,0.6,1.1000000000000001,1.5,2.1,2.2999999999999998,3.5,5.3,8.1,12.6,19.600000000000001,34.5,1.2,0.12,0.44,-0.84,-0.76,-9.27,-2.81,-4.47,-4.32,-6.57,-4.21,0.44,-1.75,1.36,5.93,9.0399999999999991,26.37,11.34,30.2,0]
["00PD","Vale of Glamorgan","Vale of Glamorgan","5.7.12","5.7.12","5.7",5,602.20000000000005,4.2,0.3,0,0,0.2,0,0,1.4,1.3,2.6,3.1,3,5.8,6.7,13,27.6,29.5,88.3,161.69999999999999,9.1999999999999993,1.06,0.69,-0.57999999999999996,-0.31,-0.27,-1.38,0,4.3499999999999996,2.6,7,10.06,2.95,8.25,1.1100000000000001,5.38,27.52,-4.55,38.97,25.37,128,0.9,0,0,0,0,0,0,0.4,0.4,1.3,1.7,1.6,3.7,4.4000000000000004,9.6,21.6,12.2,1.8,1,0.9,1.4,1,1,3.2,3.1,4.7,5.2,5,8.6999999999999993,9.8000000000000007,17.3,34.700000000000003,-0.45,0.38,-0.21,-0.35,-0.26,-2.63,-2.85,0.69,-1.0900000000000001,2.73,1.5,-3.83,-2.44,-12.95,-8.2100000000000009,0.81,-28.37,13.18,-5.08,0]
["00PP","Monmouth","Monmouthshire","5.7.13","5.7.13","5.7",5,594.79999999999995,4.9000000000000004,0,0,0,0,0,1.5,1,2.2999999999999998,1.6,2.7,3.2,5.6,8.5,16.399999999999999,22.3,36.4,60.2,159.80000000000001,10.3,0.89,-0.19,-0.4,-0.22,-0.98,-0.9,3,1.65,3.58,2,6.7,3.24,5.71,6.89,15.24,10.92,8.34,0.43,20.46,86,0.6,0,0,0,0,0,0.3,0.1,0.7,0.5,1.3,1.6,3.2,5.6,12.2,16.399999999999999,17.600000000000001,2,1.5,1.4,1.2,1.6,4.5,3.7,5.3,3.7,4.9000000000000004,5.8,8.9,12.3,21.6,29.5,0.03,-0.38,-0.15,-0.25,-0.97,-1.71,1.48,-0.33,1.4,-1.21,-0.47,-1.99,-2.4700000000000002,-5.03,3.57,-10.86,-12.9,-22.4,-6.09,0]
["00NN","Powys","Powys","6.10.17","6.10.17","6.10",6,559,3.3,0.4,0.3,0.5,0.2,0.3,0.6,0.7,1,1.7,1.8,3.9,5.2,6.8,9.4,24.5,37.299999999999997,67.099999999999994,156.1,10.7,-3.31,1,0.63,2,0.63,0.62,-0.78,-0.18,-0.17,2.27,2.91,6.06,5.38,-12.71,-16.37,29.56,16.899999999999999,9.34,27.11,71,0.4,0,0,0.1,0,0,0.1,0.1,0.2,0.7,0.8,2.2999999999999998,3.4,4.8,6.9,19.600000000000001,11.9,2,1.7,1.8,1.3,1.6,2.2999999999999998,2.5,2.8,3.4,3.4,6.2,7.8,9.5,12.5,30.1,-0.9,0.45,0.8,1.64,-0.28000000000000003,-1.53,-0.43,-1.44,-2.0499999999999998,-1.3,-4.92,0.55000000000000004,-5.27,-16.38,-29.31,-10.18,-17.78,-22.14,-15.04,0]
["00NQ","Ceredigion","Ceredigion","6.10.17","6.10.17","6.10",6,547.70000000000005,6.1,0,0,0,0.6,0.8,0.6,0.6,1.2,1,3.1,3.9,7.6,7.2,8.6,21.7,34.700000000000003,67.2,139.30000000000001,9.1999999999999993,-0.88,0,-0.2,0,1.7,3.45,-0.56000000000000005,-0.21,0.26,-0.34,4.2,2.94,8.41,-5.69,-10.41,9.99,4.88,4.8899999999999997,1.45,24,0.7,0,0,0,0.1,0.2,0,0,0.1,0.1,1.2,1.8,4.5,4.3,5.4,15.5,22,2.7,2,2,2.2000000000000002,2,3.2,3.5,4.2,3.5,6.3,7.4,12,11.2,13,29.5,0.42,-0.28000000000000003,-0.1,-0.17,0.99,0.39,-0.36,-0.92,-0.77,-2.11,0.59,0.13,2.93,-7.59,-17.02,-10.43,-12.88,-11.05,-20.6,0]
["00NA","Isle of Anglesey","Isle of Anglesey","6.10.18","6.10.18","6.10",6,636.6,4.9000000000000004,0,0,0,1,2.6,1.1000000000000001,2.7,1.7,1.3,1.7,2.5,5.9,11.1,14,19.100000000000001,36.4,73.3,176.9,11,-1.56,0,-0.2,0,1.82,4.79,0.34,3.59,1.1499999999999999,0.5,1.1200000000000001,-0.22,4.4000000000000004,4.4800000000000004,3.22,5.43,6.98,9.73,26.4,72,0.6,0,0,0,0.1,0.8,0.1,0.9,0.3,0.3,0.5,0.9,3.2,7.4,9.6999999999999993,13.4,17.8,2.2000000000000002,2,2,3.6,6,3.9,6.2,4.8,3.9,4.3,5.5,9.9,16,19.399999999999999,26.5,0.05,-0.34,-0.11,-0.17,1.39,3.59,0.56000000000000005,2.77,0.05,-1.39,-2.59,-3.09,-1.0900000000000001,2.67,-3.26,-15.35,-9.9499999999999993,-4.66,6.89,0]
["00NC","Gwynedd","Gwynedd","6.10.18","6.10.18","6.10",6,605,2.9,0.7,0,0,0,1.5,0,1,1.9,2.4,3,3.8,5.7,6.2,12.9,23.3,35.5,84.4,158.30000000000001,10.1,-4.04,2,-0.36,0,-0.36,7.42,-3.07,0.62,2.77,4.84,7.06,4.74,6.16,-12.33,0.92,19.899999999999999,9.23,33.700000000000003,24.07,103,0.4,0.1,0,0,0,0.7,0,0.2,0.7,1.1000000000000001,1.5,2.1,3.6,4,9.6,18,10.5,2.6,1.1000000000000001,1.1000000000000001,0.9,3,1.1000000000000001,2.8,4.0999999999999996,4.5999999999999996,5.2,6.3,8.8000000000000007,9.1999999999999993,16.899999999999999,29.6,-1.31,1.44,-0.19,-0.3,-1.22,4.2,-2.67,-0.76,0.86,1.71,0.7,0,-2.33,-15.2,-9.5,-11.46,-18.239999999999998,8.69,-9.57,0]
["00NE","Conwy","Conwy","6.10.18","6.10.18","6.10",6,607.5,3.4,0,0,0.6,0.3,0.3,1.1000000000000001,1.1000000000000001,1.1000000000000001,1.6,1.8,3.1,5.9,10.1,14.1,27.2,34.1,71.2,162.30000000000001,12.4,-3.23,0,-0.33,2,0.69,0.67,0.52,0.98,0.27,1.86,2.12,1.76,6.43,3.24,5.71,33.799999999999997,7.17,15.91,36.5,116,0.4,0,0,0.1,0,0,0.2,0.2,0.2,0.6,0.7,1.6,3.6,7.2,10.7,21.7,12.1,1.6,1.2,2.2999999999999998,1.6,1.9,3.1,3.3,3.3,3.5,3.6,5.3,8.9,13.7,18.3,33.700000000000003,-0.86,-0.48,-0.17,1.72,-7.0000000000000007E-2,-1.1399999999999999,0.84,-0.19,-1.36,-1.26,-4.17,-2.97,-1.9,0.34,-4.76,-0.34,-24.65,-13.28,-6.21,0]
["00NG","Denbighshire","Denbighshire","6.10.18","6.10.18","6.10",6,681.1,5.7,0.9,0,0.4,0.3,0.4,0.4,1,2.1,3.3,3.5,3.4,7.5,10.4,13.8,23.6,52,57.8,178.4,11.5,-1.64,2,-0.28999999999999998,1,0.73,0.7,-1.1399999999999999,0.43,2.58,6.63,7.82,2.62,10.15,3.62,3.38,17.37,37.36,-5.51,37.299999999999997,125,1.2,0.1,0,0,0,0,0,0.1,0.7,1.6,1.8,1.7,4.7,7.2,10,17.8,16.5,3.2,1.4,2,1.8,2.1,2.2999999999999998,3.5,4.9000000000000004,6.1,6.1,6.1,11.4,14.4,18.600000000000001,30.6,0.46,1.54,-0.15,0.74,7.0000000000000007E-2,-0.96,-0.87,-0.48,1.1399999999999999,4.09,2.44,-1.25,3.38,1.21,-4.7,-8.9,15.06,-26.33,10.75,0]
["00NS","Pembrokeshire","Pembrokeshire","6.10.18","6.10.18","6.10",6,588.5,6.3,0.4,0,0,0.3,0.3,0.3,1.3,1.8,0.5,3,4.5,5.3,9.6,12.2,25.1,37.5,76.2,136.69999999999999,10.4,-1.61,1,-0.37,0,0.66,0.61,-1.8,1.77,2.14,-2.2200000000000002,7.74,8.01,4.8899999999999997,1.41,-2.12,28.96,15.55,22.23,-0.76,86,1.7,0,0,0,0,0,0,0.4,0.6,0.1,1.6,2.7,3.3,6.9,9.1,20,16,2,1.1000000000000001,1,1.5,1.6,1.8,3.4,4.2,1.9,5.2,7,8.1,13,16,31.2,0.93,0.44,-0.2,-0.34,-0.18,-1.54,-1.44,0.47,0.45,-5.39,0.96,2.93,-4.3099999999999996,-1.71,-12.96,-7.11,-15.73,-3.97,-36.06,0]
["00NU","Carmarthenshire","Carmarthenshire","6.10.18","6.10.18","6.10",6,639.20000000000005,3.9,0,0,0.2,0.3,0.4,0.4,0.9,2.1,1.7,3.1,3.8,5.7,7.9,14,28.8,44.5,76.5,161.5,11,-5.04,0,-0.56999999999999995,1,1.48,1.41,-2.36,0.62,5.21,3.49,12.01,6.99,9.68,-8.5299999999999994,7.84,57.53,46.41,33.22,41.87,212,1.1000000000000001,0,0,0,0,0,0,0.2,1,0.8,1.9,2.4,3.9,5.9,11.2,24.1,9.9,0.9,0.7,1,1.2,1.4,1.5,2.2999999999999998,3.9,3.2,4.7,5.6,7.9,10.5,17.3,34.200000000000003,-0.95,-0.86,-0.3,0.51,0.22,-1.85,-1.8,-1.35,2.36,-1.42,1.72,-0.41,-4.22,-13.04,-7.9,6.88,2.87,-4.91,-8.85,0]
["00NX","Swansea","Swansea","7.11.20","7.11.20","7.11",7,713,4.2,0,0,0,0.1,0.5,1.9,1.4,2.7,3.1,3.2,4.0999999999999996,6.6,12.8,17.100000000000001,30.2,49.7,76.8,149.4,10.199999999999999,0.56000000000000005,-0.27,-0.26,-0.27,-2.0299999999999998,-0.3,9.65,2.29,5.96,10.54,1.38,1.29,1.99,26.39,4.01,10.59,8.94,-3.46,-22.6,54,1.5,0,0,0,0,0.2,1.1000000000000001,0.6,1.6,2,2.1,2.8,4.8,10.199999999999999,14,25.4,9.1,0.7,0.6,0.6,0.7,1.1000000000000001,3.1,2.5,4.2,4.5999999999999996,4.7,5.8,8.8000000000000007,15.7,20.7,35.6,-0.9,-1.1100000000000001,-0.38,-0.6,-1.52,-2.2799999999999998,8.8000000000000007,1.21,7.6,8.6199999999999992,3.4,2.2200000000000002,1.1100000000000001,18.71,11.33,13.47,23.19,-4.8099999999999996,-34.33,0]
["00NZ","Neath Port Talbot","Neath Port Talbot","7.11.20","7.11.20","7.11",7,769.6,9.5,0,0.3,0,0.5,1.8,0,1.8,1.5,3,4.8,3.9,6.4,10.4,18.100000000000001,25.4,45.9,93,207.7,11.5,4.82,-0.16,0.85,-0.16,0.37,4.8,-2.92,3.41,-1.58,5.87,8.89,-0.14000000000000001,0.81,6.72,6.67,-7.56,-3.38,22.82,51.14,101,4.0999999999999996,0,0,0,0.1,0.7,0,0.8,0.5,1.6,3.1,2.4,4.3,7.6,14.2,20,18.7,1.2,1.5,0.9,1.6,3.6,0.8,3.6,3.2,5,7.2,6.1,9.1999999999999993,13.8,22.8,31.8,3.96,-0.64,0.78,-0.36,0.64,4.1100000000000003,-3.38,2.76,-0.63,4.72,10.130000000000001,0.46,0.22,1.62,11.39,-5.71,5.05,22.04,44.76,0]
["00PF","Rhondda Cynon Taff","Rhondda Cynon Taff","7.11.20","7.11.20","7.11",7,730.7,3.4,0.3,0,0,0.4,1,1,1.4,2.7,1.8,3.1,4.7,6,13.3,16.600000000000001,27.2,51,82.7,175.4,10,-0.53,1.7,-0.28000000000000003,-0.27,0.15,3.36,2.0699999999999998,2.65,5.52,0.92,0.84,5.65,-1.94,32.24,1.22,-3.37,12.87,10.28,23.53,97,1.1000000000000001,0,0,0,0.1,0.4,0.4,0.7,1.6,1,2.1,3.3,4.3,10.8,13.7,22.7,8,1.2,0.5,0.6,1.1000000000000001,1.9,2,2.6,4.2,3,4.5999999999999996,6.5,8.1,16.2,20.100000000000001,32.299999999999997,-2.0099999999999998,0.79,-0.4,-0.61,0.64,1.9,1.29,1.61,7.09,-1.08,2.91,6.6,-2.84,24.04,8.89,-0.42,26.03,9.15,14.14,0]
["00PH","Merthyr Tydfil","Merthyr Tydfil","7.11.20","7.11.20","7.11",7,673,2.6,0,0,0,0,1.6,1,2.2000000000000002,1.3,2.5,2.8,4.7,1.7,12.8,20.2,29.9,51.2,87.9,120.6,9.3000000000000007,-0.46,-0.08,-7.0000000000000007E-2,-7.0000000000000007E-2,-0.71,1.94,0.67,2.13,-0.84,1.53,-0.43,1.69,-7.97,7.02,5.75,2.41,3.48,5.68,-14.95,7,0.1,0,0,0,0,0.3,0.1,0.6,0.2,0.8,1,2.2999999999999998,0.4,8.1,13.7,21,14.4,2.4,2.2000000000000002,2.2000000000000002,1.9,4.5,3.6,5.7,4.7,5.8,6.2,8.6999999999999993,5,19.2,28.7,41.4,-0.85,-0.31,-0.1,-0.15,-0.59,1.6,0.46,1.87,-0.48,1.04,0.1,1.95,-8.1999999999999993,5,7.55,3.16,6.79,5.39,-17.13,0]
["00PK","Caerphilly","Caerphilly","7.11.20","7.11.20","7.11",7,698.7,5.7,0.2,0.4,0,0.2,0.7,0.9,1.1000000000000001,0.9,2.2000000000000002,2.1,5.2,5.8,11.5,16.8,28.2,49.6,79.5,169.3,9.3000000000000007,2.02,0.77,1.78,-0.22,-1.1499999999999999,0.99,1.4,0.42,-4.9000000000000004,3.09,-6.05,7.5,-2.5099999999999998,14.54,1.61,0.95,5.84,2.2599999999999998,9.33,38,2.1,0,0,0,0,0.2,0.3,0.4,0.3,1.2,1.2,3.5,3.9,8.9,13.3,23,12.4,1.2,1.3,0.7,1,1.9,2.2000000000000002,2.4,2.2000000000000002,3.7,3.6,7.4,8.1999999999999993,14.7,20.8,34.1,0.95,0.06,1.68,-0.49,-0.79,0.04,0.83,-0.37,-3.66,1.54,-4.41,8.24,-3.21,8.27,7.33,3.23,15.43,1.4,2.93,0]
["00PL","Blaenau Gwent","Blaenau Gwent","7.11.20","7.11.20","7.11",7,828.4,7.7,0.6,0,0,0,0.4,0.9,3,1.5,2.2999999999999998,4.5999999999999996,3.4,9.9,13.3,19.899999999999999,40.5,46.3,97.6,181.6,11.7,1.53,0.91,-7.0000000000000007E-2,-0.08,-0.83,-0.28000000000000003,0.55000000000000004,3.92,-0.66,1.58,4.01,-1.22,7.79,9.57,7.01,19.61,-1.22,13.97,9.5500000000000007,75.64,1.6,0,0,0,0,0,0.1,1.1000000000000001,0.3,0.9,2.4,1.5,6.2,8.9,14.2,31.2,22.6,3.2,2,2,1.6,2.4,3.3,6.5,4.5,5.0999999999999996,8,6.7,15.2,19.100000000000001,26.9,51.9,1.1399999999999999,0.65,-0.11,-0.17,-0.69,-0.68,0.32,3.62,-0.2,0.95,4.67,-0.93,7.52,7.11,9.43,20.57,2.92,13.61,6.87,0]
["00PM","Torfaen","Torfaen","7.11.20","7.11.20","7.11",7,765.3,5.2,0,0,0,0.3,0.7,0.7,1.2,0.8,2,3,4.5999999999999996,7.6,12,15.7,38.6,44.4,96.2,194,11.4,0.83,-0.11,-0.11,-0.11,-0.15,0.42,0.17,0.39,-2.4300000000000002,0.74,-0.18,2.2599999999999998,3.72,8.9,-1.93,19.66,-4.28,17.079999999999998,24.16,69,1.1000000000000001,0,0,0,0,0.1,0.1,0.2,0.1,0.7,1.4,2.6,4.7,8.3000000000000007,11.3,30.2,15.3,1.7,1.4,1.4,1.8,2.5,2.6,3.5,3,4.3,5.5,7.6,11.6,16.8,21.3,48.7,0.25,-0.45,-0.15,-0.24,0.04,-0.08,-0.12,0.02,-1.87,-0.01,0.65,2.66,3.36,5.73,1.1200000000000001,20.79,1.04,16.600000000000001,19.899999999999999,0]
["00PR","Newport","Newport","7.11.20","7.11.20","7.11",7,708.9,4.0999999999999996,0.3,0,0,0.2,1.2,1.5,0.9,1.2,2,2.1,4.0999999999999996,8.6999999999999993,12.1,17.7,25.6,47.3,81,172.9,9.6999999999999993,0.33,0.8,-0.18,-0.19,-0.82,3.23,3.84,-0.72,-2.86,1.32,-5.21,0.97,9.4499999999999993,12.66,4.47,-6.13,-0.02,4.0999999999999996,13.37,38,1.1000000000000001,0,0,0,0,0.4,0.6,0.2,0.4,0.9,1,2.5,6,8.9,13.6,20,10.5,1.4,0.8,0.8,1.1000000000000001,2.6,3.1,2.2999999999999998,2.8,3.6,3.7,6.4,12.1,16,22.7,32.5,-0.65,0.19,-0.26,-0.42,-0.52,2.36,3.34,-1.39,-1.87,0.08,-3.88,1.56,8.94,8.19,8.6300000000000008,-4.47,8.15,3.38,6.93,0]
["00NJ","Flintshire","Flintshire","7.12.22","7.12.22","7.12",7,636.9,6.6,0.3,0,0,0.4,1.3,0.7,0.7,0.7,2.1,2.2999999999999998,3.2,7.4,7.7,15.7,23,50.9,79.7,148,9.3000000000000007,4.67,-0.04,0,-0.32,-0.31,2.0699999999999998,-0.26,-0.24,-0.84,5.48,1.37,1.27,5.62,-7.81,10.43,-9.16,32.200000000000003,16.79,-3.51,57,2.4,0,0,0,0.1,0.5,0.1,0.1,0.1,1.1000000000000001,1.2,1.9,5.0999999999999996,5.5,12.3,18.2,14.4,1.5,0.9,0.8,1.5,2.8,2,2.1,2,3.7,3.9,5.2,10.4,10.5,19.7,28.7,1.66,0.22,-0.25,-0.41,0.52,2.66,-0.41,-2.06,-4.0199999999999996,0.95,-2.83,-3.14,4.74,-11.69,1.81,-14.55,17.55,1.63,-20.239999999999998,0]
["00NL","Wrexham Maelor","Wrexham","7.12.22","7.12.22","7.12",7,664.8,5.7,0,0,0.3,0.7,0.2,0.9,0.9,1.7,1.8,1.8,3.9,6.8,9.1999999999999993,14.3,31.2,40.1,75.099999999999994,177.1,9.3000000000000007,3.7,-0.99,0,0.72,0.99,-2.7,0.75,0.73,3.27,3.27,-1.1399999999999999,3.97,2.5299999999999998,-0.27,3.52,15.14,5.09,8.57,25.61,73,1.8,0,0,0,0.1,0,0.2,0.3,0.7,0.8,0.8,2.2999999999999998,4.5,6.5,10.8,25,13.2,1,0.9,1.4,2.1,1.3,2.2999999999999998,2.4,3.4,3.5,3.5,6.2,9.8000000000000007,12.6,18.600000000000001,38.5,0.77,-0.74,-0.24,0.64,1.71,-2.15,0.59,-1.1100000000000001,0.19,-0.71,-4.8,0.32,1.74,-3.43,-3.71,10.76,-7.16,-4.93,10.42,0]
["00PB","Bridgend","Bridgend","7.12.22","7.12.22","7.12",7,731.6,1.2,0,0,0.3,0.7,1.9,0.5,1.2,1.9,1.2,3.3,1.7,7.8,10.7,21.5,31,42.4,87.1,191.4,10.6,-0.22,-0.91,0,0.72,0.84,4.41,-1.22,1.7,4.28,0.11,6.35,-6.41,6.9,6.1,31.57,15.84,10.37,26.06,41.17,148,0,0,0,0,0.1,0.8,0.1,0.4,0.8,0.4,1.9,0.7,5.4,7.8,17.2,25,6.7,1.1000000000000001,0.9,1.4,2,3.7,1.7,2.7,3.8,2.6,5.2,3.3,11,14.2,26.6,38,-2.96,-0.68,-0.23,0.63,1.62,4.95,-1.38,-0.15,1.2,-3.98,2.5099999999999998,-10.46,6.09,2.79,24.35,11.07,-2.79,12.06,25.42,0]
[]
[]
["Best in class - now based on Top 5"]
["Code","LAD","LAD2","Subgroups ","Subgroups2","Groups ","Supergroups","Males","00-01","01-04","05-09","10-14","15-19","20-24","25-29","30-34","35-39","40-44","45-49","50-54","55-59","60-64","65-69","70-74","75-79","80-84","85+","total"]
["00KF","Southend-on-Sea","Southend-on-Sea","1.1.1","1.1.1",1.1000000000000001,1,603.9,4.4000000000000004,0.1,0.1,0.1,0.2,0.3,0.6,1,1,1.5,2.7,3.9,7.3,9.6999999999999993,14.7,21.4,39,72.2,152,9.1]
["12UC","East Cambridgeshire","East Cambridgeshire","5.7.14","5.7.14",5.7,5,458.3,2.7,0.1,0.2,0.1,0.3,0.4,0,0.2,0.6,1,0.9,2.2999999999999998,3.7,6.4,11.5,17.2,31.8,59.8,137.1,8.6]
["19UC","Christchurch","Christchurch","6.10.17","6.10.17",6.1,6,501.9,8.8000000000000007,0,0.1,0,0.1,0.1,0.9,0.8,1,1.1000000000000001,1.2,2.6,4.0999999999999996,9.3000000000000007,12.7,16.3,31.3,62.2,137.30000000000001,10.7]
["00EE","Redcar and Cleveland","Redcar and Cleveland","7.11.20","7.11.20",7.11,7,664.3,3.8,0.1,0,0,0.4,0.6,0.7,1,1.9,1.7,3,3.9,6.3,8.9,16.5,27.9,47.4,78.099999999999994,160.69999999999999,10.199999999999999]
["95Q","Banbridge","Banbridge","7.12.23","7.12.23",7.12,7,583.5,1.5,0.3,0,0.1,0.5,0.9,0.7,0.8,0.9,1.2,2.1,3,6.2,9.3000000000000007,13.4,25.7,37.6,68.900000000000006,151.19999999999999,9]
[null,null,null,null,null,null,null,null,null,null,null,null,null,null,null,null,null,null,null,null,null,null,null,null,null,null,null,null,"Excess deaths - based on Top 5",null,null,null,null,null,null,null,null,null,null,null,null,null,null,null,null,null,null,null,"Lower confidence intervals",null,null,null,null,null,null,null,null,null,null,null,null,null,null,null,"Upper confidence intervals",null,null,null,null,null,null,null,null,null,null,null,null,null,null,null,"Excess deaths - based on Wales"]
[null,null,null,null,null,null,null,null,7,8,9,10,11,12,13,14,15,16,17,18,19,20,21,22,23,24,25,26,27,28,29,30,31,32,33,34,35,36,37,38,39,40,41,42,43,44,45,46,47,48,49,50,51,52,53,54,55,56,57,58,59,60,61,62,63,64,65,66,67,68,69,70,71,72,73,74,75,76,77,78,79,80,81,82,83,84,85,86,87,88,89,90,91,92,93,94,95,96,97,98]
["Females",null,null,null,null,null,null,"Age­standardised mortality rate","Age-specific rates"]
["Code","LAD","LAD2","Subgroups ","Subgroups2","Groups ","Supergroups","Females","00-01","01-04","05-09","10-14","15-19","20-24","25-29","30-34","35-39","40-44","45-49","50-54","55-59","60-64","65-69","70-74","75-79","80-84","85+","total","00-01","01-04","05-09","10-14","15-19","20-24","25-29","30-34","35-39","40-44","45-49","50-54","55-59","60-64","65-69","70-74","75-79","80-84","85+","total","00-01","01-04","05-09","10-14","15-19","20-24","25-29","30-34","35-39","40-44","45-49","50-54","55-59","60-64","65-69","70-74","00-01","01-04","05-09","10-14","15-19","20-24","25-29","30-34","35-39","40-44","45-49","50-54","55-59","60-64","65-69","70-74","00-01","01-04","05-09","10-14","15-19","20-24","25-29","30-34","35-39","40-44","45-49","50-54","55-59","60-64","65-69","70-74","75-79","80-84","85+","total"]
["00PT","Cardiff","Cardiff","1.1.1","1.1.1","1.1",1,455.6,2.95,0.23,0.11,0,0.16,0.05,0.2,1.02,0.65,0.73,2.0099999999999998,2.46,5.27,6.13,9.6199999999999992,20.010000000000002,25.14,51.82,134.72,7.67,-1.79,0.23,0.62,-0.35,1.1399999999999999,-1.64,-0.68,6.73,1.5,-1.67,5.48,0.15,10.36,-1.86,1.51,27.52,-26.32,3.01,14.68,39,1.2,0,0,0,0,0,0,0.5,0.3,0.3,1.3,1.6,3.9,4.5999999999999996,7.5,16.5,6.1,0.8,0.6,0.4,0.6,0.3,0.6,1.7,1.3,1.4,3,3.6,7,8.1,12.2,24.1,-1.05,0.87,0.19,-0.74,-0.45,-5.55,-2.76,4.82,-1.28,-6,1.01,-0.36,11.18,-8.7100000000000009,-6.94,9.6999999999999993,-27.71,-20.29,-53.54,0]
["00PD","Vale of Glamorgan","Vale of Glamorgan","5.7.12","5.7.12","5.7",5,445.4,2.78,0.69,0,0,0,0.94,0.9,0.55000000000000004,1.56,1.27,1.66,2.54,3.47,7.9,7.12,15.64,24.15,54.93,131.29,9.65,-1.71,1.63,0,-0.37,-0.79,2.58,2.17,0.81,4.5,4.53,4.24,-1.6,4.5,20.72,4.91,13.03,7.82,25.76,16.37,109,0.3,0.1,0,0,0,0.2,0.2,0.1,0.6,0.5,0.7,1.3,1.9,5.4,4.7,11.5,10,2.5,1,1,0.9,2.7,2.6,2,3.4,2.8,3.3,4.4000000000000004,5.7,11.1,10.3,20.8,-0.44,1.63,-0.3,-0.31,-0.79,1.97,1.7,-0.3,3.05,-0.03,-1.25,0.2,-2.35,2.93,-13.75,-8,-15.06,-3.32,-33.090000000000003,0]
["00PP","Monmouth","Monmouthshire","5.7.13","5.7.13","5.7",5,414.1,7.13,0,0,0,0.36,0.49,0.54,0.47,1.67,1.47,1.26,1.18,3.62,5.08,8.0500000000000007,14.64,26.93,54.07,118.63,10.08,0.83,-0.24,0,-0.26,0.44,0.74,0.54,0.3,3.07,3.95,1.92,-5.78,3.95,7.16,6.78,7.99,12.12,18.79,-9.9,52,1.5,0,0,0,0,0,0,0,0.5,0.5,0.4,0.3,1.9,3,5.2,10.199999999999999,20.8,2,1.6,1.4,2,2.8,3,2.6,4.3,3.4,3,3,6.3,8.1,11.9,20.399999999999999,1.57,-0.24,-0.2,-0.22,0.45,0.35,0.28000000000000003,-0.36,2.16,0.68,-2.59,-4.49,-1.3,-7.09,-7.94,-8.73,-6.98,-3.92,-50.54,0]
["00NN","Powys","Powys","6.10.17","6.10.17","6.10",6,422,1.64,0,0,0,0,1,0.35,1.02,0.3,0.45,1.99,1.25,4.57,6.75,9.23,13.93,24.78,49.48,135.65,11.3,0.18,-0.4,-0.39,0,-0.42,2.61,0.2,1.51,0.23,-0.3,4.01,-2.9,6.93,8.44,13.45,11.71,7.81,16.55,8.68,78,0,0,0,0,0,0.2,0,0.2,0,0.1,1,0.5,2.9,4.7,6.8,10.4,9.1999999999999993,1.4,1.1000000000000001,1,1,2.9,2,3,1.7,1.6,3.7,2.7,6.9,9.4,12.3,18.3,-1.06,-0.34,-0.28000000000000003,-0.3,-0.76,2.0299999999999998,-0.11,1.1299999999999999,-1.56,-3.65,0.33,-6.02,2.66,-2.35,-6.89,-16,-17.5,-17.309999999999999,-29.17,0]
["00NQ","Ceredigion","Ceredigion","6.10.17","6.10.17","6.10",6,389,3.3,0,0,0,0,0.23,0,0,0.61,1.87,1.24,2.4300000000000002,2.02,8,6.1,10.68,28.79,47.54,125.76,9.73,0.59,-0.21,-0.19,0,-0.33,0.45,-0.45,-0.82,0.63,2.89,0.12,1.43,-2.74,7.56,-1.1299999999999999,-0.1,10.19,6.16,-10.130000000000001,14,0.1,0,0,0,0,0,0,0,0,0.5,0.3,0.9,0.7,5,3.5,6.5,18.399999999999999,2.7,2.2999999999999998,2.1,1.2,1.3,2.2999999999999998,2.2999999999999998,3.4,4.8,3.6,5.3,4.7,12.2,9.9,16.5,-0.03,-0.18,-0.14000000000000001,-0.14000000000000001,-0.59,-0.37,-0.63,-1.03,-0.25,1.27,-1.65,-0.18,-4.93,2.1,-11.84,-14.27,-2.54,-11.46,-30.12,0]
["00NA","Isle of Anglesey","Isle of Anglesey","6.10.18","6.10.18","6.10",6,430.5,0,0,0,1.1100000000000001,0.55000000000000004,0,0,0.56000000000000005,0.56000000000000005,1.71,2.04,2.0699999999999998,3.44,8.3000000000000007,9.7799999999999994,15.7,22.54,45.63,131.31,10.95,-0.55000000000000004,-0.23,-0.21,2,0.8,-0.24,-0.51,0.08,0.59,2.78,2.08,0.54,0.71,8.42,8.64,9.81,0.43,3.78,-1.83,37,0,0,0,0.1,0,0,0,0,0,0.5,0.7,0.7,1.5,5.2,6.4,10.7,9.1,2.4,2.2000000000000002,4,3.1,2,2,3.1,3.1,4.4000000000000004,4.8,4.8,6.8,12.6,14.3,22.3,-1.37,-0.19,-0.15,1.85,0.64,-0.59,-0.71,-0.15,-0.38,1.02,0.28999999999999998,-1.02,-1.35,2.91,-2.2200000000000002,-5.13,-12.57,-13.97,-21.28,0]
["00NC","Gwynedd","Gwynedd","6.10.18","6.10.18","6.10",6,488,1.46,0,0,0.32,0.49,0.2,0.34,2.04,0.32,2.04,1.21,3.53,4.5599999999999996,6.97,9.75,20.93,30.14,46.34,141.41999999999999,11.67,7.0000000000000007E-2,-0.4,-0.38,1,1.55,0.34,0.17,4.5,0.28000000000000003,5.96,7.0000000000000007E-2,6.67,5.34,7.43,12.89,30.7,20.37,8.5,21.96,127,0,0,0,0,0.1,0,0,0.8,0,0.9,0.4,1.9,2.7,4.5999999999999996,6.9,16.100000000000001,8.1,1.4,1.2,1.8,1.8,1.1000000000000001,1.9,4.5,1.8,4,2.8,5.9,7.3,10.1,13.3,26.8,-1.33,-0.34,-0.27,0.74,1.18,-0.63,-0.16,4.12,-1.41,3,-2.95,4.0999999999999996,2.04,-0.92,-3.43,7.93,-0.71,-23.74,-11.4,0]
["00NE","Conwy","Conwy","6.10.18","6.10.18","6.10",6,448.4,3.57,0,0,0,0.32,1.06,0,0,0.71,0.77,1.83,2.59,3.38,8.26,12.15,15.11,22.24,47.92,143.78,13.36,1.24,-0.35,-0.32,0,0.65,2.63,-0.76,-1.39,1.35,0.97,2.79,3.15,0.97,13.32,23.6,15.07,-0.1,13.49,33.119999999999997,109,0.4,0,0,0,0,0.2,0,0,0.1,0.2,0.8,1.3,1.8,5.8,9,11.3,12.9,1.6,1.4,1.2,1.8,3.1,1.4,1.4,2.6,2.2000000000000002,3.6,4.5999999999999996,5.8,11.5,16,19.8,0.1,-0.3,-0.23,-0.25,0.37,2.09,-1.06,-1.75,-0.16,-1.97,-0.41,0.4,-2.4300000000000002,4.51,6.47,-10.97,-25.01,-22.35,-6.61,0]
["00NG","Denbighshire","Denbighshire","6.10.18","6.10.18","6.10",6,547.70000000000005,4.1399999999999997,0.93,0,0,0,0.8,0.88,0.86,1.1299999999999999,1.23,2.83,4.59,3.94,6.97,13.99,24.39,32.96,50.77,144.87,12.14,1.35,1.68,-0.28000000000000003,0,-0.31,1.67,1.36,0.81,2.39,2.31,5.79,8.9600000000000009,2.46,6.37,24.53,33.6,21.73,13.1,20.97,148,0.5,0.1,0,0,0,0.1,0.1,0.1,0.2,0.3,1.4,2.6,2,4.5,10.199999999999999,18.600000000000001,15,3.4,1.6,1.5,1.3,2.9,3.2,3.1,3.3,3.2,5.2,7.6,6.9,10.4,18.7,31.4,0.36,1.73,-0.2,-0.21,-0.56999999999999995,1.19,1.1100000000000001,0.51,0.97,-0.14000000000000001,3.21,6.84,-0.24,-0.79,11.11,14.99,5.17,-9.4499999999999993,-1.95,0]
["00NS","Pembrokeshire","Pembrokeshire","6.10.18","6.10.18","6.10",6,472,1.41,0,0,0,0.83,0.3,0,0,0.94,2.23,1.53,1.62,4.76,7.09,10.72,17.61,30.1,53.16,144.41,11.64,0.04,-0.4,-0.39,0,2.6,0.56999999999999995,-0.82,-1.53,2.2599999999999998,6.9,1.55,-1,6.86,9.17,18.760000000000002,23.04,21.84,22.12,28.29,140,0,0,0,0,0.2,0,0,0,0.2,1,0.6,0.7,2.9,4.9000000000000004,7.9,13.4,7.8,1.4,1.1000000000000001,1.1000000000000001,2.4,1.7,1.3,1.2,2.7,4.2,3.2,3.3,7.4,9.9,14.2,22.7,-1.41,-0.35,-0.28000000000000003,-0.28000000000000003,2.2799999999999998,-0.06,-1.1399999999999999,-1.92,0.54,3.86,-1.79,-3.81,3.13,-0.51,0.48,-2.31,-0.89,-7.3,-3.82,0]
["00NU","Carmarthenshire","Carmarthenshire","6.10.18","6.10.18","6.10",6,481.3,5.3,0,0,0,0.18,0.19,0,0.4,0.41,1.46,1.6,2.67,3.63,5.07,10.01,16.46,29.81,63.34,165.08,12.13,3.73,-0.62,-0.57999999999999996,0,0.4,0.32,-1.35,-0.57999999999999996,0.87,5.8,2.81,5.53,3.19,-0.34,21.56,26.46,29.35,63.33,115.99,276,1.7,0,0,0,0,0,0,0,0,0.7,0.8,1.6,2.2999999999999998,3.5,7.7,13,12.4,0.9,0.8,0.7,1,1.1000000000000001,0.8,1.4,1.5,2.8,2.9,4.2,5.5,7.1,12.8,20.6,1.8,-0.53,-0.41,-0.41,-0.09,-0.69,-1.88,-1.23,-1.76,1.1599999999999999,-2.21,1.1599999999999999,-2.42,-13.88,-3.72,-8.4700000000000006,-2.34,20.56,68.03,0]
["00NX","Swansea","Swansea","7.11.20","7.11.20","7.11",7,486,4.5,0,0.5,0,0.13,0.2,0.68,0.71,1.31,1,1.98,2.8,3.65,7.36,9.94,19.54,32.78,54.56,136.25,10.199999999999999,-0.38,-0.3,3,0,-0.44,-1.48,1.55,0.97,3.24,-0.98,3.12,5.32,-9.5,1.23,-3.58,7.99,15.29,0.88,-19.27,7,1.7,0,0.1,0,0,0,0.2,0.2,0.6,0.4,1.1000000000000001,1.8,2.4,5.5,7.7,16,9.8000000000000007,0.7,1.5,0.6,0.7,0.7,1.6,1.7,2.5,2,3.2,4.2,5.3,9.6,12.6,23.6,1.48,-0.64,2.48,-0.52,-0.5,-1.21,2.13,0.49,3.73,-2.2200000000000002,0.45,2.34,-2.68,1.1599999999999999,-4.7,6.81,11.35,-7.73,-38.619999999999997,0]
["00NZ","Neath Port Talbot","Neath Port Talbot","7.11.20","7.11.20","7.11",7,520.29999999999995,1.39,0,0,0,0.24,0.26,0.47,1.42,0.95,1.66,2.06,2.16,3.85,8.67,11.61,16.28,37.15,60.83,156.66999999999999,11.59,-2.44,-0.18,0,0,0.22,-0.37,0,3.6,0.48,2.6,2.52,0.19,-5.1100000000000003,6.99,4.9800000000000004,-5.95,20.54,14.65,38.11,81,0,0,0,0,0,0,0.1,0.5,0.3,0.7,1,1.1000000000000001,2.2999999999999998,6.2,8.6,12.2,7.7,1.2,1,1,1.4,1.4,1.7,3.1,2.4,3.3,3.7,3.9,6.1,11.8,15.3,21.2,-1.44,-0.39,-0.32,-0.31,0.18,-0.26,0.33,3.31,0.78,1.86,0.75,-1.74,-0.79,6.95,4.28,-6.67,18.3,9.49,26.12,0]
["00PF","Rhondda Cynon Taff","Rhondda Cynon Taff","7.11.20","7.11.20","7.11",7,533.6,4.8899999999999997,0,0,0,0.14000000000000001,0.37,0.39,0.41,0.72,0.57999999999999996,1.88,3.4,4.7,7.58,11.16,21.35,35.299999999999997,65.180000000000007,159.91,10.52,0.16,-0.35,0,0,-0.38,0.13,-0.6,-1.18,-0.85,-4.6100000000000003,2.4500000000000002,10.14,-1.71,2.89,4.8099999999999996,17,24.76,33.630000000000003,66.27,153,2,0,0,0,0,0.1,0.1,0.1,0.2,0.2,1.1000000000000001,2.2000000000000002,3.2,5.7,8.8000000000000007,17.600000000000001,10.1,0.6,0.6,0.6,0.8,1.1000000000000001,1.1000000000000001,1.2,1.7,1.4,3,4.9000000000000004,6.6,9.8000000000000007,14,25.7,2.15,-0.74,-0.56999999999999995,-0.55000000000000004,-0.45,0.35,0,-1.69,-0.35,-5.93,-0.37,7.13,4.78,2.82,3.71,15.88,21.18,26.53,49.02,0]
["00PH","Merthyr Tydfil","Merthyr Tydfil","7.11.20","7.11.20","7.11",7,578.79999999999995,2.69,0,0,0.62,0,0,0.46,0.54,1.21,1.43,3.6,2.29,1.1599999999999999,7.42,17.010000000000002,25.26,38.61,72.59,165.87,11.1,-0.78,-0.08,0,1,-0.35,-0.68,-0.02,-0.06,0.61,0.65,4.46,0.37,-6.55,0.43,10.42,9.09,9.58,14.59,20.59,63,0.1,0,0,0,0,0,0,0,0.1,0.3,1.6,0.7,0.1,4.0999999999999996,11.2,17.3,15,2.6,2.4,3.5,2,1.9,2.6,3,4.4000000000000004,4.2,7.1,5.3,4.2,12.4,24.8,35.700000000000003,-0.26,-0.18,-0.13,0.86,-0.37,-0.62,0.15,-0.19,0.73,0.32,3.73,-0.45,-4.95,0.41,10.16,8.82,8.6999999999999993,12.76,16.52,0]
["00PK","Caerphilly","Caerphilly","7.11.20","7.11.20","7.11",7,515.9,1.94,0.23,0,0,0.53,0.93,0,0.35,0.19,1.79,1.68,2.16,3.88,8.1999999999999993,12.28,19.690000000000001,31.76,67.86,154.19999999999999,9.66,-2.93,0.74,0,0,1.92,3.12,-2.75,-1.29,-3.54,4.4800000000000004,0.56000000000000005,0.27,-5.99,5.77,9.4,6.44,6.96,29.51,31.47,84,0.2,0,0,0,0.1,0.3,0,0,0,0.9,0.8,1.2,2.4,6,9.4,15.6,7,1.3,0.7,0.7,1.5,2.2000000000000002,0.6,1.3,1,3.1,3,3.7,5.9,10.9,15.7,24.5,-1.5,0.44,-0.44,-0.43,1.87,3.27,-2.29,-1.69,-3.15,3.44,-1.6,-2.0099999999999998,-0.77,5.71,8.57,5.58,4.3099999999999996,24.51,19.690000000000001,0]
["00PL","Blaenau Gwent","Blaenau Gwent","7.11.20","7.11.20","7.11",7,596.9,8.11,0,0,0,0,0,0.88,0.48,0.52,1.1499999999999999,1.5,4.4800000000000004,3.4,12.14,12.99,21.75,38.03,78.69,168.86,11.91,1.23,-0.09,0,0,-0.43,-0.82,0.93,-0.18,-0.63,0.09,-0.25,5.8,-3.16,10.6,5.28,5.91,11.32,22.29,29.57,87,1.7,0,0,0,0,0,0.1,0,0,0.2,0.4,2.2000000000000002,1.4,7.9,8.6,15.2,23.7,2.4,2,1.9,1.6,1.6,3.2,2.7,2.9,3.4,3.8,8,7,17.8,18.899999999999999,30.3,1.75,-0.2,-0.16,-0.16,-0.45,-0.75,1.1100000000000001,-0.33,-0.49,-0.32,-1.1399999999999999,4.87,-1.26,10.58,4.95,5.56,10.210000000000001,20.190000000000001,24.35,0]
["00PM","Torfaen","Torfaen","7.11.20","7.11.20","7.11",7,519.20000000000005,4.05,0.47,0,0,0,0.36,0.35,0.38,0.38,1.89,3.18,1.55,3.83,5.71,9.86,22.54,33.44,74.83,153.44999999999999,11.26,-0.36,0.87,0,0,-0.56999999999999995,0.02,-0.35,-0.52,-1.21,2.4500000000000002,5.51,-1.83,-3.19,-4.4000000000000004,-1.55,9.3000000000000007,6.92,27.95,18.96,58,0.5,0,0,0,0,0,0,0,0,0.7,1.6,0.5,1.9,3.3,6.4,16.600000000000001,14.6,2.6,1.5,1.4,1.2,2,1.9,2.1,2.1,4.0999999999999996,5.7,3.6,6.9,9.1,14.5,30,0.33,0.73,-0.22,-0.22,-0.6,0.1,-0.12,-0.7,-1.02,1.96,4.37,-3.05,-0.54,-4.43,-1.97,8.85,5.44,24.82,11.43,0]
["00PR","Newport","Newport","7.11.20","7.11.20","7.11",7,510,1.07,0,0,0.23,0.21,0,0.81,0.21,0.71,1.71,2.19,2.84,4.54,7.42,10.96,20.52,32.97,66.5,143.78,9.75,-3.47,-0.23,0,1,0.09,-1.81,1.68,-1.67,-0.56000000000000005,3.11,3.27,3.56,-1.57,0.92,1.92,7.61,8.7200000000000006,23.97,5.77,52,0,0,0,0,0,0,0.2,0,0.1,0.8,1.1000000000000001,1.6,2.7,5,7.9,15.8,6,1,0.9,1.3,1.2,0.7,2.1,1.2,2.1,3.3,3.8,4.8,7.2,10.6,14.9,26.2,-2.17,-0.49,-0.37,0.63,0.05,-1.67,2.0699999999999998,-1.99,-0.26,2.2999999999999998,1.46,1.69,2.09,0.88,1.31,6.94,6.59,19.45,-4.8499999999999996,0]
["00NJ","Flintshire","Flintshire","7.12.22","7.12.22","7.12",7,480.5,2.54,0.27,0,0.24,0,0.47,0.47,0.7,0.66,1.37,1.81,1.52,4.18,7.02,10.99,13.97,30.8,57.96,158.59,9.56,-0.4,-0.14000000000000001,0,-0.1,-0.63,1.37,1.57,0.89,-0.33,4.0199999999999996,6.37,-6.7,3.08,6.27,12.01,-4.3099999999999996,13.59,7.51,45.87,90,0.3,0,0,0,0,0.1,0.1,0.1,0.1,0.6,0.9,0.7,2.6,4.9000000000000004,8.1999999999999993,10.4,9.1999999999999993,1.5,0.9,1.3,0.8,1.7,1.7,2,1.9,2.7,3.2,3,6.5,9.6999999999999993,14.4,18.399999999999999,-0.67,0.53,-0.37,0.64,-0.89,0.64,0.32,0.25,-0.5,0.53,-0.69,-5.12,0.79,-0.95,1.83,-15.5,1.06,2.72,26.72,0]
["00NL","Wrexham Maelor","Wrexham","7.12.22","7.12.22","7.12",7,471.6,9.2100000000000009,0,0,0,0,0.49,0,0.24,0.98,0.59,1.61,2.0099999999999998,3.29,8.2100000000000009,12.96,18.37,30.45,48.5,138.05000000000001,9.26,5.36,-1.0900000000000001,0,-0.95,-0.51,1.39,-0.44,-1.05,1.03,-0.43,4.2300000000000004,-3.51,-1.06,10.14,17.21,9.23,10.64,-10.95,2.15,41,4,0,0,0,0,0.1,0,0,0.3,0.1,0.7,0.9,1.8,5.7,9.6,13.8,18.100000000000001,1,1,1,1,1.8,0.8,1.3,2.5,1.7,3.2,3.8,5.5,11.4,17.100000000000001,24,5.05,-0.45,-0.33,-0.31,-0.73,0.7,-1.73,-1.68,0.87,-3.43,-1.52,-2.17,-3.09,4.3,9.06,0.22,0.08,-15.41,-16.32,0]
["00PB","Bridgend","Bridgend","7.12.22","7.12.22","7.12",7,544.5,1.19,0,0.81,0.25,0.25,0.25,1.23,0.73,0.7,1.71,2.39,2.83,4.58,5.96,10.97,19.72,37.340000000000003,54.27,175.17,11.05,-1.56,-0.92,3,-0.03,0.45,0.41,4.59,0.99,-0.14000000000000001,5.43,8.8699999999999992,0.17,4.54,0.56999999999999995,10.36,15.23,31.46,-0.01,77.790000000000006,161,0,0,0.2,0,0,0,0.4,0.2,0.1,0.8,1.3,1.5,2.8,3.9,8,15.3,6.6,1.2,2.4,1.4,1.4,1.4,2.9,2.1,2,3.3,4.0999999999999996,4.8,7.1,8.6999999999999993,14.6,25.1,-1.85,-0.38,2.68,0.67,0.21,-0.28000000000000003,3.4,0.37,-0.3,2.2999999999999998,2.57,1.66,2.4500000000000002,-5.64,1.5,4.76,18.91,-4.7699999999999996,59.43,0]
[]
[]
["Best in class - now based on Top 5"]
["Code","LAD","LAD2","Subgroups ","Subgroups2","Groups ","Supergroups","Females","00-01","01-04","05-09","10-14","15-19","20-24","25-29","30-34","35-39","40-44","45-49","50-54","55-59","60-64","65-69","70-74","75-79","80-84","85+","total"]
["18UC","Exeter","Exeter","1.1.1","1.1.1",1.1000000000000001,1,434.5,3.7,0.2,0,0,0.1,0.1,0.3,0.5,0.5,0.9,1.5,2.5,4.0999999999999996,6.4,9.4,15.1,30.2,51.1,131.6,8.9]
["23UC","Cotswold","Cotswold","5.7.13","5.7.13",5.7,5,340.9,5.2,0.1,0,0.1,0.2,0.1,0.3,0.3,0.4,0.3,0.8,2.9,2.4,2.9,5.9,11.3,20.9,41.8,124,9.6999999999999993]
["19UG","Purbeck","Purbeck","6.10.17","6.10.17",6.1,6,360.3,1.4,0.2,0.1,0,0.1,0.1,0.3,0.5,0.2,0.5,1.2,1.9,3.1,5.0999999999999996,6.5,10.7,22.3,42.7,132.6,11.4]
["00CK","North Tyneside","North Tyneside","7.11.21","7.11.21",7.11,7,475.1,4.8,0.1,0,0,0.2,0.4,0.5,0.6,0.8,1.1000000000000001,1.6,2.1,4.9000000000000004,7.2,10.5,18.100000000000001,29.6,54.3,141.1,10.7]
["95F","Larne","Larne","7.12.23","7.12.23",7.12,7,422.4,3,0.3,0,0.3,0.1,0.2,0.1,0.5,0.7,0.7,0.8,2.8,3.5,5.8,8.5,15.2,25.8,54.3,137,9.4]

{"sheet":"EASR lookup","index":7,"n_rows":273,"n_cols":17,"rows_kept":273,"cut":false,"hidden":true,"merged":[[2,7,2,8],[2,13,2,14]]}
["Highlighted yellow are the BIC for males and females - no longer needed"]
[]
[null,null,null,null,null,null,null,"Age­standardised mortality rate",null,null,null,null,null,"Calc sheet ",null,"ONS EASR - EASR Calculator"]
["Code","LAD","LAD2","Subgroups ","Subgroups2","Groups ","Supergroups","Males","Females","Males ldiff","Males udiff","Females ldiff","Females udiff","Males EASR","Females EASR","Males","Females"]
["00KF","Southend-on-Sea","Southend-on-Sea","1.1.1","1.1.1","1.1",1,554.5,442.9,"","","","","",""]
["21UC","Eastbourne","Eastbourne","1.1.1","1.1.1","1.1",1,610.1,443.9,"","","","","",""]
["18UC","Exeter","Exeter","1.1.1","1.1.1","1.1",1,614.1,421.2,"","","","","",""]
["33UG","Norwich","Norwich","1.1.1","1.1.1","1.1",1,614.70000000000005,423.6,"","","","","",""]
["00HN","Bournemouth","Bournemouth","1.1.1","1.1.1","1.1",1,640.79999999999995,464.9,"","","","","",""]
["00CG","Sheffield","Sheffield","1.1.1","1.1.1","1.1",1,641.1,468,"","","","","",""]
["00MR","Portsmouth","Portsmouth","1.1.1","1.1.1","1.1",1,642.70000000000005,487.6,"","","","","",""]
["32UD","Lincoln","Lincoln","1.1.1","1.1.1","1.1",1,658.4,508.9,"","","","","",""]
["00HB","Bristol","Bristol","1.1.1","1.1.1","1.1",1,664.1,439.5,"","","","","",""]
["00MS","Southampton","Southampton","1.1.1","1.1.1","1.1",1,671.2,479,"","","","","",""]
["00ML","Brighton and Hove","Brighton and Hove","1.1.1","1.1.1","1.1",1,678.4,448.1,"","","","","",""]
["45UH","Worthing","Worthing","1.1.1","1.1.1","1.1",1,678.7,428,"","","","","",""]
["21UD","Hastings","Hastings","1.1.1","1.1.1","1.1",1,684.4,517.29999999999995,"","","","","",""]
["00PT","Cardiff","Cardiff","1.1.1","1.1.1","1.1",1,690.4,455.6,37,38.6,26.7,27.7,690.1,455.5,-0.3,-0.1]
["00HG","Plymouth","Plymouth","1.1.1","1.1.1","1.1",1,690.8,499.9,"","","","","",""]
["00DA","Leeds","Leeds","1.1.1","1.1.1","1.1",1,693.4,486.6,"","","","","",""]
["00QP","Edinburgh, City of","Edinburgh, City of","1.1.1","1.1.1","1.1",1,703.2,501.3,"","","","","",""]
["00CJ","Newcastle upon Tyne","Newcastle upon Tyne","1.1.1","1.1.1","1.1",1,715.5,516.5,"","","","","",""]
["30UH","Lancaster","Lancaster","1.1.1","1.1.1","1.1",1,718.7,474.5,"","","","","",""]
["00QA","Aberdeen City","Aberdeen City","1.1.1","1.1.1","1.1",1,751.6,535.5,"","","","","",""]
["00BR","Salford","Salford","1.1.1","1.1.1","1.1",1,785.2,574,"","","","","",""]
["00BY","Liverpool","Liverpool","1.1.1","1.1.1","1.1",1,791.7,567.4,"","","","","",""]
["00QJ","Dundee City","Dundee City","1.1.1","1.1.1","1.1",1,866.3,609.5,"","","","","",""]
["00QS","Glasgow City","Glasgow City","1.1.1","1.1.1","1.1",1,1016.6,680.7,"","","","","",""]
["12UC","East Cambridgeshire","East Cambridgeshire","5.7.14","5.7.14","5.7",5,441.3,345.5,"","","","","",""]
["34UG","South Northamptonshire","South Northamptonshire","5.7.14","5.7.14","5.7",5,452.7,401.3,"","","","","",""]
["42UB","Babergh","Babergh","5.7.13","5.7.13","5.7",5,453.8,387.4,"","","","","",""]
["42UE","Mid Suffolk","Mid Suffolk","5.7.14","5.7.14","5.7",5,467.5,372.1,"","","","","",""]
["19UD","East Dorset","East Dorset","5.7.13","5.7.13","5.7",5,473.6,330.8,"","","","","",""]
["18UD","Mid Devon","Mid Devon","5.7.13","5.7.13","5.7",5,490.5,383.6,"","","","","",""]
["24UJ","New Forest","New Forest","5.7.13","5.7.13","5.7",5,494.8,368.8,"","","","","",""]
["33UH","South Norfolk","South Norfolk","5.7.13","5.7.13","5.7",5,503.3,363.7,"","","","","",""]
["00HA","Bath and North East Somerset","Bath and North East Somerset","5.7.12","5.7.12","5.7",5,505.6,387.6,"","","","","",""]
["24UD","Eastleigh","Eastleigh","5.7.14","5.7.14","5.7",5,508.5,370.7,"","","","","",""]
["29UB","Ashford","Ashford","5.7.14","5.7.14","5.7",5,510.2,399.7,"","","","","",""]
["21UH","Wealden","Wealden","5.7.13","5.7.13","5.7",5,513.1,379.8,"","","","","",""]
["42UG","Suffolk Coastal","Suffolk Coastal","5.7.13","5.7.13","5.7",5,514.29999999999995,393.1,"","","","","",""]
["00HD","South Gloucestershire","South Gloucestershire","5.7.14","5.7.14","5.7",5,516.29999999999995,386.7,"","","","","",""]
["40UD","South Somerset","South Somerset","5.7.13","5.7.13","5.7",5,517.9,394.2,"","","","","",""]
["36UE","Richmondshire","Richmondshire","5.7.13","5.7.13","5.7",5,520.6,436.6,"","","","","",""]
["17UF","Derbyshire Dales","Derbyshire Dales","5.7.13","5.7.13","5.7",5,522.29999999999995,394,"","","","","",""]
["36UC","Hambleton","Hambleton","5.7.13","5.7.13","5.7",5,522.29999999999995,367.4,"","","","","",""]
["31UB","Blaby","Blaby","5.7.14","5.7.14","5.7",5,522.9,381.5,"","","","","",""]
["21UF","Lewes","Lewes","5.7.13","5.7.13",null,5,524.1,376.3,"","","","","",""]
["30UL","Ribble Valley","Ribble Valley","5.7.13","5.7.13","5.7",5,525.70000000000005,405.3,"","","","","",""]
["31UG","Melton","Melton","5.7.14","5.7.14","5.7",5,526.6,452.6,"","","","","",""]
["19UE","North Dorset","North Dorset","5.7.13","5.7.13","5.7",5,526.79999999999995,358.7,"","","","","",""]
["42UF","St. Edmundsbury","St. Edmundsbury","5.7.14","5.7.14","5.7",5,527.29999999999995,433.4,"","","","","",""]
["31UJ","Oadby and Wigston","Oadby and Wigston","5.7.12","5.7.12","5.7",5,530.4,387.6,"","","","","",""]
["44UE","Stratford-on-Avon","Stratford-on-Avon","5.7.13","5.7.13","5.7",5,530.70000000000005,375.5,"","","","","",""]
["38UF","West Oxfordshire","West Oxfordshire","5.7.14","5.7.14","5.7",5,532.4,418.6,"","","","","",""]
["23UC","Cotswold","Cotswold","5.7.13","5.7.13","5.7",5,538.1,328.4,"","","","","",""]
["00QN","East Renfrewshire","East Renfrewshire","5.7.12","5.7.12","5.7",5,540.4,481.6,"","","","","",""]
["37UJ","Rushcliffe","Rushcliffe","5.7.12","5.7.12","5.7",5,541.20000000000005,376.8,"","","","","",""]
["24UE","Fareham","Fareham","5.7.14","5.7.14","5.7",5,541.6,394.7,"","","","","",""]
["12UE","Huntingdonshire","Huntingdonshire","5.7.14","5.7.14","5.7",5,542.5,418.8,"","","","","",""]
["40UC","Sedgemoor","Sedgemoor","5.7.13","5.7.13","5.7",5,544.29999999999995,407.6,"","","","","",""]
["47UF","Wychavon","Wychavon","5.7.13","5.7.13","5.7",5,544.9,385.4,"","","","","",""]
["32UE","North Kesteven","North Kesteven","5.7.13","5.7.13","5.7",5,545.6,455.6,"","","","","",""]
["40UB","Mendip","Mendip","5.7.13","5.7.13","5.7",5,547.5,379.4,"","","","","",""]
["00HY","Wiltshire","Wiltshire","5.7.14","5.7.14","5.7",5,549.20000000000005,414.2,"","","","","",""]
["33UC","Broadland","Broadland","5.7.13","5.7.13","5.7",5,550.70000000000005,388.9,"","","","","",""]
["38UB","Cherwell","Cherwell","5.7.14","5.7.14","5.7",5,552.29999999999995,436.2,"","","","","",""]
["40UE","Taunton Deane","Taunton Deane","5.7.13","5.7.13","5.7",5,553,412.9,"","","","","",""]
["23UB","Cheltenham","Cheltenham","5.7.12","5.7.12","5.7",5,555,415.6,"","","","","",""]
["29UH","Maidstone","Maidstone","5.7.14","5.7.14","5.7",5,557.6,430.8,"","","","","",""]
["31UC","Charnwood","Charnwood","5.7.12","5.7.12","5.7",5,557.79999999999995,450.9,"","","","","",""]
["23UG","Tewkesbury","Tewkesbury","5.7.13","5.7.13","5.7",5,559.1,424.6,"","","","","",""]
["47UC","Malvern Hills","Malvern Hills","5.7.13","5.7.13","5.7",5,559.20000000000005,434.9,"","","","","",""]
["37UE","Gedling","Gedling","5.7.12","5.7.12","5.7",5,560.29999999999995,488.7,"","","","","",""]
["37UD","Broxtowe","Broxtowe","5.7.12","5.7.12","5.7",5,561.20000000000005,419.7,"","","","","",""]
["41UG","Stafford","Stafford","5.7.13","5.7.13","5.7",5,562.6,408.6,"","","","","",""]
["00HP","Poole","Poole","5.7.12","5.7.12","5.7",5,562.70000000000005,410.1,"","","","","",""]
["00EQ","Cheshire East","Cheshire East","5.7.13","5.7.13","5.7",5,562.70000000000005,438.8,"","","","","",""]
["22UK","Maldon","Maldon","5.7.14","5.7.14","5.7",5,563.9,414.9,"","","","","",""]
["00KC","Central Bedfordshire","Central Bedfordshire","5.7.14","5.7.14","5.7",5,564.70000000000005,414,"","","","","",""]
["33UB","Breckland","Breckland","5.7.13","5.7.13","5.7",5,566.70000000000005,427.6,"","","","","",""]
["00QL","East Dunbartonshire","East Dunbartonshire","5.7.12","5.7.12","5.7",5,567,415,"","","","","",""]
["00CT","Solihull","Solihull","5.7.12","5.7.12","5.7",5,567.9,393.9,"","","","","",""]
["36UD","Harrogate","Harrogate","5.7.13","5.7.13","5.7",5,568,415.1,"","","","","",""]
["31UD","Harborough","Harborough","5.7.14","5.7.14","5.7",5,568.5,400.3,"","","","","",""]
["00FP","Rutland","Rutland","5.7.13","5.7.13","5.7",5,570,355.6,"","","","","",""]
["29UC","Canterbury","Canterbury","5.7.12","5.7.12","5.7",5,572,443.6,"","","","","",""]
["31UE","Hinckley and Bosworth","Hinckley and Bosworth","5.7.14","5.7.14","5.7",5,573.9,419,"","","","","",""]
["30UN","South Ribble","South Ribble","5.7.14","5.7.14","5.7",5,574,461.6,"","","","","",""]
["41UD","Lichfield","Lichfield","5.7.14","5.7.14","5.7",5,574.4,418.6,"","","","","",""]
["00HC","North Somerset","North Somerset","5.7.13","5.7.13","5.7",5,575.1,407.5,"","","","","",""]
["33UE","Kings Lynn and West Norfolk","Kings Lynn and West Norfolk","5.7.13","5.7.13","5.7",5,575.20000000000005,407.5,"","","","","",""]
["00GA","County of Herefordshire","County of Herefordshire","5.7.13","5.7.13","5.7",5,575.4,398.2,"","","","","",""]
["44UF","Warwick","Warwick","5.7.12","5.7.12","5.7",5,577.5,388.6,"","","","","",""]
["45UB","Adur","Adur","5.7.12","5.7.12","5.7",5,579,442.2,"","","","","",""]
["22UE","Castle Point","Castle Point","5.7.14","5.7.14","5.7",5,580.70000000000005,486.7,"","","","","",""]
["34UD","East Northamptonshire","East Northamptonshire","5.7.14","5.7.14","5.7",5,580.70000000000005,418.2,"","","","","",""]
["23UF","Stroud","Stroud","5.7.13","5.7.13","5.7",5,585,448.6,"","","","","",""]
["00GG","Shropshire","Shropshire","5.7.13","5.7.13","5.7",5,586.29999999999995,403.3,"","","","","",""]
["17UH","High Peak","High Peak","5.7.14","5.7.14","5.7",5,588.20000000000005,454.5,"","","","","",""]
["00FB","East Riding of Yorks","East Riding of Yorks","5.7.13","5.7.13","5.7",5,588.6,460,"","","","","",""]
["12UD","Fenland","Fenland","5.7.14","5.7.14","5.7",5,590.4,461.1,"","","","","",""]
["32UF","South Holland","South Holland","5.7.13","5.7.13","5.7",5,591,452.7,"","","","","",""]
["41UH","Staffordshire Moorlands","Staffordshire Moorlands","5.7.13","5.7.13","5.7",5,592,436.4,"","","","","",""]
["00BS","Stockport","Stockport","5.7.12","5.7.12","5.7",5,594.6,454.5,"","","","","",""]
["32UG","South Kesteven","South Kesteven","5.7.14","5.7.14","5.7",5,594.70000000000005,417.4,"","","","","",""]
["00PP","Monmouth","Monmouthshire","5.7.13","5.7.13","5.7",5,594.79999999999995,414.1,56.5,60.3,42.9,46,595.1,413.5,0.3,-0.6]
["32UH","West Lindsey","West Lindsey","5.7.13","5.7.13","5.7",5,595.5,449.2,"","","","","",""]
["22UG","Colchester","Colchester","5.7.12","5.7.12","5.7",5,595.70000000000005,417.8,"","","","","",""]
["30UE","Chorley","Chorley","5.7.14","5.7.14","5.7",5,597.5,499.1,"","","","","",""]
["30UP","West Lancashire","West Lancashire","5.7.12","5.7.12","5.7",5,598.1,435.4,"","","","","",""]
["95W","North Down","North Down","5.7.12","5.7.12","5.7",5,598.79999999999995,415.6,"","","","","",""]
["26UL","Welwyn Hatfield","Welwyn Hatfield","5.7.12","5.7.12","5.7",5,600.4,413,"","","","","",""]
["44UD","Rugby","Rugby","5.7.14","5.7.14","5.7",5,601.6,411.9,"","","","","",""]
["00PD","Vale of Glamorgan","Vale of Glamorgan","5.7.12","5.7.12","5.7",5,602.20000000000005,445.4,50.1,53.3,38.9,41.3,602,445.1,-0.2,-0.3]
["00BU","Trafford","Trafford","5.7.12","5.7.12","5.7",5,606.20000000000005,403.9,"","","","","",""]
["23UD","Forest of Dean","Forest of Dean","5.7.13","5.7.13","5.7",5,606.70000000000005,400.9,"","","","","",""]
["41UF","South Staffordshire","South Staffordshire","5.7.14","5.7.14","5.7",5,610.70000000000005,466.3,"","","","","",""]
["47UG","Wyre Forest","Wyre Forest","5.7.14","5.7.14","5.7",5,611,432.2,"","","","","",""]
["37UG","Newark and Sherwood","Newark and Sherwood","5.7.13","5.7.13","5.7",5,611.6,466.9,"","","","","",""]
["00FF","York","York","5.7.12","5.7.12","5.7",5,613.20000000000005,425,"","","","","",""]
["00EM","Northumberland","Northumberland","5.7.13","5.7.13","5.7",5,615.1,484.1,"","","","","",""]
["22UC","Braintree","Braintree","5.7.14","5.7.14","5.7",5,616.5,458.6,"","","","","",""]
["17UK","South Derbyshire","South Derbyshire","5.7.14","5.7.14","5.7",5,618.5,474.5,"","","","","",""]
["95Y","Castlereagh","Castlereagh","5.7.12","5.7.12","5.7",5,618.70000000000005,414.3,"","","","","",""]
["34UE","Kettering","Kettering","5.7.14","5.7.14","5.7",5,624.9,436.8,"","","","","",""]
["31UH","North West Leicestershire","North West Leicestershire","5.7.14","5.7.14","5.7",5,625,454.4,"","","","","",""]
["34UC","Daventry","Daventry","5.7.14","5.7.14","5.7",5,627,478.7,"","","","","",""]
["00EW","Cheshire West and Chester","Cheshire West and Chester","5.7.12","5.7.12","5.7",5,635.79999999999995,461.8,"","","","","",""]
["36UH","Selby","Selby","5.7.14","5.7.14","5.7",5,641.79999999999995,471.2,"","","","","",""]
["44UB","North Warwickshire","North Warwickshire","5.7.14","5.7.14","5.7",5,658.9,439.2,"","","","","",""]
["47UB","Bromsgrove","Bromsgrove","5.7.14","5.7.14","5.7",5,662.2,424.4,"","","","","",""]
["00EU","Warrington","Warrington","5.7.14","5.7.14","5.7",5,664.9,484.9,"","","","","",""]
["32UB","Boston","Boston","5.7.13","5.7.13","5.7",5,666.6,445.6,"","","","","",""]
["00BM","Bury","Bury","5.7.12","5.7.12","5.7",5,683.9,553.79999999999995,"","","","","",""]
["00RG","Stirling","Stirling","5.7.12","5.7.12","5.7",5,711,496.9,"","","","","",""]
["19UC","Christchurch","Christchurch","6.10.17","6.10.17","6.10",6,438.1,330.7,"","","","","",""]
["19UG","Purbeck","Purbeck","6.10.17","6.10.17","6.10",6,494.2,304.2,"","","","","",""]
["16UG","South Lakeland","South Lakeland","6.10.17","6.10.17","6.10",6,513.70000000000005,409.2,"","","","","",""]
["36UB","Craven","Craven","6.10.17","6.10.17","6.10",6,514.79999999999995,398.5,"","","","","",""]
["45UD","Chichester","Chichester","6.10.17","6.10.17","6.10",6,521.4,377.6,"","","","","",""]
["18UG","South Hams","South Hams","6.10.17","6.10.17","6.10",6,538.6,379.5,"","","","","",""]
["19UH","West Dorset","West Dorset","6.10.17","6.10.17","6.10",6,540.70000000000005,381.5,"","","","","",""]
["16UF","Eden","Eden","6.10.17","6.10.17","6.10",6,543.29999999999995,393.2,"","","","","",""]
["00NQ","Ceredigion","Ceredigion","6.10.17","6.10.17","6.10",6,547.70000000000005,389,60.3,65.2,44.9,48.6,548.1,389.4,0.4,0.4]
["18UB","East Devon","East Devon","6.10.17","6.10.17","6.10",6,558,404,"","","","","",""]
["00NN","Powys","Powys","6.10.17","6.10.17","6.10",6,559,422,43.6,46.3,34.4,36.299999999999997,559.20000000000005,421.7,0.2,-0.3]
["00RA","Orkney Islands","Orkney Islands","6.10.19","6.10.19","6.10",6,562.20000000000005,505.2,"","","","","",""]
["18UK","Torridge","Torridge","6.10.17","6.10.17","6.10",6,573.20000000000005,457,"","","","","",""]
["21UG","Rother","Rother","6.10.17","6.10.17","6.10",6,579.1,393.4,"","","","","",""]
["00MW","Isle of Wight","Isle of Wight","6.10.18","6.10.18","6.10",6,587.1,443.6,"","","","","",""]
["00NS","Pembrokeshire","Pembrokeshire","6.10.18","6.10.18","6.10",6,588.5,472,48.2,51.1,38.1,40.1,588.4,471.9,-0.1,-0.1]
["33UF","North Norfolk","North Norfolk","6.10.17","6.10.17","6.10",6,591.20000000000005,383.7,"","","","","",""]
["40UF","West Somerset","West Somerset","6.10.17","6.10.17","6.10",6,601.1,405.2,"","","","","",""]
["45UC","Arun","Arun","6.10.17","6.10.17","6.10",6,601.29999999999995,430.5,"","","","","",""]
["29UL","Shepway","Shepway","6.10.18","6.10.18","6.10",6,601.29999999999995,447.1,"","","","","",""]
["30UF","Fylde","Fylde","6.10.17","6.10.17","6.10",6,601.70000000000005,469.1,"","","","","",""]
["00HE","Cornwall, Isles of Scilly","Cornwall, Isles of Scilly","6.10.18","6.10.18","6.10",6,603.4,427.9,"","","","","",""]
["00QB","Aberdeenshire","Aberdeenshire","6.10.19","6.10.19","6.10",6,604.4,495.6,"","","","","",""]
["00NC","Gwynedd","Gwynedd","6.10.18","6.10.18","6.10",6,605,488,49.8,53,41.2,43.6,604.9,487.8,-0.1,-0.2]
["36UF","Ryedale","Ryedale","6.10.17","6.10.17","6.10",6,606.5,457.1,"","","","","",""]
["00NE","Conwy","Conwy","6.10.18","6.10.18","6.10",6,607.5,448.4,48.5,51.3,37.299999999999997,39.299999999999997,607.70000000000005,448.4,0.2,0]
["42UH","Waveney","Waveney","6.10.18","6.10.18","6.10",6,609.79999999999995,437.7,"","","","","",""]
["18UE","North Devon","North Devon","6.10.17","6.10.17","6.10",6,610.4,451.4,"","","","","",""]
["18UH","Teignbridge","Teignbridge","6.10.17","6.10.17","6.10",6,614.9,417.1,"","","","","",""]
["00HH","Torbay","Torbay","6.10.18","6.10.18","6.10",6,615.1,455.2,"","","","","",""]
["29UE","Dover","Dover","6.10.18","6.10.18","6.10",6,615.79999999999995,466.8,"","","","","",""]
["00QE","Scottish Borders","Scottish Borders","6.10.19","6.10.19","6.10",6,625.20000000000005,507.4,"","","","","",""]
["18UL","West Devon","West Devon","6.10.17","6.10.17","6.10",6,635,377.8,"","","","","",""]
["00NA","Isle of Anglesey","Isle of Anglesey","6.10.18","6.10.18","6.10",6,636.6,430.5,66.599999999999994,71.8,48.4,52.1,636.79999999999995,430.5,0.2,0]
["00NU","Carmarthenshire","Carmarthenshire","6.10.18","6.10.18","6.10",6,639.20000000000005,481.3,41.2,43.2,31.4,32.799999999999997,639.20000000000005,481.5,0,0.2]
["16UB","Allerdale","Allerdale","6.10.18","6.10.18","6.10",6,639.29999999999995,507.7,"","","","","",""]
["22UN","Tendring","Tendring","6.10.17","6.10.17","6.10",6,640.1,500.9,"","","","","",""]
["36UG","Scarborough","Scarborough","6.10.18","6.10.18","6.10",6,650.20000000000005,453.1,"","","","","",""]
["16UD","Carlisle","Carlisle","6.10.18","6.10.18","6.10",6,652.4,502.7,"","","","","",""]
["00RB","Perth & Kinross","Perth & Kinross","6.10.19","6.10.19","6.10",6,652.4,468.7,"","","","","",""]
["00QT","Highland","Highland","6.10.19","6.10.19","6.10",6,657.3,460.9,"","","","","",""]
["19UJ","Weymouth and Portland","Weymouth and Portland","6.10.18","6.10.18","6.10",6,659.6,446.6,"","","","","",""]
["00QC","Angus","Angus","6.10.19","6.10.19","6.10",6,661.4,502.6,"","","","","",""]
["29UN","Thanet","Thanet","6.10.18","6.10.18","6.10",6,661.5,479.1,"","","","","",""]
["33UD","Great Yarmouth","Great Yarmouth","6.10.18","6.10.18","6.10",6,670.7,474.2,"","","","","",""]
["30UQ","Wyre","Wyre","6.10.17","6.10.17","6.10",6,680,498.4,"","","","","",""]
["00NG","Denbighshire","Denbighshire","6.10.18","6.10.18","6.10",6,681.1,547.70000000000005,60,64,49.9,53.1,681.3,548,0.2,0.3]
["00QH","Dumfries & Galloway","Dumfries & Galloway","6.10.19","6.10.19","6.10",6,687.7,505.9,"","","","","",""]
["32UC","East Lindsey","East Lindsey","6.10.17","6.10.17","6.10",6,691.5,468,"","","","","",""]
["00QX","Moray","Moray","6.10.19","6.10.19","6.10",6,709,531.20000000000005,"","","","","",""]
["00RD","Shetland Islands","Shetland Islands","6.10.19","6.10.19","6.10",6,714.8,413,"","","","","",""]
["00QD","Argyll & Bute","Argyll & Bute","6.10.19","6.10.19","6.10",6,717.8,533.29999999999995,"","","","","",""]
["00RJ","Eilean Siar","Eilean Siar","6.10.19","6.10.19","6.10",6,817.3,532.70000000000005,"","","","","",""]
["00EY","Blackpool","Blackpool","6.10.18","6.10.18","6.10",6,879.3,576.6,"","","","","",""]
["00EE","Redcar and Cleveland","Redcar and Cleveland","7.11.20","7.11.20","7.11",7,640.5,490.5,"","","","","",""]
["00EH","Darlington","Darlington","7.11.20","7.11.20","7.11",7,659.9,472.4,"","","","","",""]
["00QM","East Lothian","East Lothian","7.11.21","7.11.21","7.11",7,666.3,517,"","","","","",""]
["00CB","Wirral","Wirral","7.11.20","7.11.20","7.11",7,670.9,496.3,"","","","","",""]
["00CK","North Tyneside","North Tyneside","7.11.21","7.11.21","7.11",7,671.1,462.6,"","","","","",""]
["00PH","Merthyr Tydfil","Merthyr Tydfil","7.11.20","7.11.20","7.11",7,673,578.79999999999995,79.900000000000006,87.7,65.3,70.8,673,578.79999999999995,0,0]
["00RE","South Ayrshire","South Ayrshire","7.11.21","7.11.21","7.11",7,677,525.4,"","","","","",""]
["00CA","Sefton","Sefton","7.11.20","7.11.20","7.11",7,683.8,483.8,"","","","","",""]
["16UC","Barrow-in-Furness","Barrow-in-Furness","7.11.20","7.11.20","7.11",7,686.6,480.6,"","","","","",""]
["00EJ","County Durham","County Durham","7.11.20","7.11.20","7.11",7,694.8,513.79999999999995,"","","","","",""]
["00EB","Hartlepool","Hartlepool","7.11.20","7.11.20","7.11",7,698.2,513.6,"","","","","",""]
["00PK","Caerphilly","Caerphilly","7.11.20","7.11.20","7.11",7,698.7,515.9,48,50.6,35.799999999999997,37.700000000000003,698.7,515.9,0,0]
["16UE","Copeland","Copeland","7.11.20","7.11.20","7.11",7,705.4,483.5,"","","","","",""]
["00CH","Gateshead","Gateshead","7.11.20","7.11.20","7.11",7,708.9,556.9,"","","","","",""]
["00PR","Newport","Newport","7.11.20","7.11.20","7.11",7,708.9,510,53.2,56.3,40.1,42.4,708.7,510,-0.2,0]
["00BZ","St. Helens","St. Helens","7.11.20","7.11.20","7.11",7,711.7,513.29999999999995,"","","","","",""]
["00NX","Swansea","Swansea","7.11.20","7.11.20","7.11",7,713,486,41.1,43,30.2,31.4,713,485.8,0,-0.2]
["00CM","Sunderland","Sunderland","7.11.20","7.11.20","7.11",7,724.3,573.29999999999995,"","","","","",""]
["00QR","Fife","Fife","7.11.21","7.11.21","7.11",7,725.4,540.29999999999995,"","","","","",""]
["00QW","Midlothian","Midlothian","7.11.21","7.11.21","7.11",7,726.3,518.4,"","","","","",""]
["00BX","Knowsley","Knowsley","7.11.20","7.11.20","7.11",7,729.9,579.1,"","","","","",""]
["00PF","Rhondda Cynon Taff","Rhondda Cynon Taff","7.11.20","7.11.20","7.11",7,730.7,533.6,42.6,44.4,31.7,33.1,730.5,533.4,-0.2,-0.2]
["00ET","Halton","Halton","7.11.20","7.11.20","7.11",7,739.5,594.4,"","","","","",""]
["00RH","West Lothian","West Lothian","7.11.21","7.11.21","7.11",7,742,577.6,"","","","","",""]
["00QF","Clackmannanshire","Clackmannanshire","7.11.21","7.11.21","7.11",7,745.2,596.9,"","","","","",""]
["00BT","Tameside","Tameside","7.11.20","7.11.20","7.11",7,747.6,575.5,"","","","","",""]
["00QY","North Ayrshire","North Ayrshire","7.11.21","7.11.21","7.11",7,749.1,557.9,"","","","","",""]
["00QQ","Falkirk","Falkirk","7.11.21","7.11.21","7.11",7,751.7,555.4,"","","","","",""]
["00FA","Kingston upon Hull","Kingston upon Hull","7.11.20","7.11.20","7.11",7,760.7,561.79999999999995,"","","","","",""]
["00EC","Middlesbrough","Middlesbrough","7.11.20","7.11.20","7.11",7,763.5,604.79999999999995,"","","","","",""]
["00PM","Torfaen","Torfaen","7.11.20","7.11.20","7.11",7,765.3,519.20000000000005,67,71.599999999999994,48.4,51.6,765.3,519.9,0,0.7]
["00NZ","Neath Port Talbot","Neath Port Talbot","7.11.20","7.11.20","7.11",7,769.6,520.29999999999995,54.6,57.5,39,41,768.9,520.29999999999995,-0.7,0]
["00CL","South Tyneside","South Tyneside","7.11.20","7.11.20","7.11",7,769.7,524.9,"","","","","",""]
["00GL","Stoke-on-Trent","Stoke-on-Trent","7.11.20","7.11.20","7.11",7,781.9,563.79999999999995,"","","","","",""]
["00QK","East Ayrshire","East Ayrshire","7.11.21","7.11.21","7.11",7,786.9,561.70000000000005,"","","","","",""]
["00RF","South Lanarkshire","South Lanarkshire","7.11.21","7.11.21","7.11",7,810.3,572.4,"","","","","",""]
["00RC","Renfrewshire","Renfrewshire","7.11.21","7.11.21","7.11",7,820,590.20000000000005,"","","","","",""]
["00PL","Blaenau Gwent","Blaenau Gwent","7.11.20","7.11.20","7.11",7,828.4,596.9,81.400000000000006,87.7,61.2,65.599999999999994,828.1,598,-0.3,1.1000000000000001]
["00QU","Inverclyde","Inverclyde","7.11.21","7.11.21","7.11",7,834.8,571.4,"","","","","",""]
["00QZ","North Lanarkshire","North Lanarkshire","7.11.21","7.11.21","7.11",7,838.1,637.29999999999995,"","","","","",""]
["95Z","Belfast","Belfast","7.11.20","7.11.20","7.11",7,848.7,577.5,"","","","","",""]
["00QG","West Dunbartonshire","West Dunbartonshire","7.11.21","7.11.21","7.11",7,914.4,694.4,"","","","","",""]
["95Q","Banbridge","Banbridge","7.12.23","7.12.23","7.12",7,564.4,436,"","","","","",""]
["95V","Carrickfergus","Carrickfergus","7.12.23","7.12.23","7.12",7,564.6,515.4,"","","","","",""]
["17UJ","North East Derbyshire","North East Derbyshire","7.12.22","7.12.22","7.12",7,580.29999999999995,459.3,"","","","","",""]
["29UM","Swale","Swale","7.12.22","7.12.22","7.12",7,589.70000000000005,442.2,"","","","","",""]
["24UH","Havant","Havant","7.12.22","7.12.22","7.12",7,590,414,"","","","","",""]
["41UK","Tamworth","Tamworth","7.12.22","7.12.22","7.12",7,598.5,451.4,"","","","","",""]
["17UB","Amber Valley","Amber Valley","7.12.22","7.12.22","7.12",7,602.20000000000005,426.2,"","","","","",""]
["17UG","Erewash","Erewash","7.12.22","7.12.22","7.12",7,609.5,409,"","","","","",""]
["41UC","East Staffordshire","East Staffordshire","7.12.22","7.12.22","7.12",7,616.4,435.9,"","","","","",""]
["37UC","Bassetlaw","Bassetlaw","7.12.22","7.12.22","7.12",7,619.70000000000005,486.1,"","","","","",""]
["95G","Ballymena","Ballymena","7.12.23","7.12.23","7.12",7,619.70000000000005,449.5,"","","","","",""]
["47UD","Redditch","Redditch","7.12.22","7.12.22","7.12",7,621.70000000000005,449.1,"","","","","",""]
["00CR","Dudley","Dudley","7.12.22","7.12.22","7.12",7,627.20000000000005,435,"","","","","",""]
["95X","Ards","Ards","7.12.23","7.12.23","7.12",7,628.20000000000005,488.8,"","","","","",""]
["00NJ","Flintshire","Flintshire","7.12.22","7.12.22","7.12",7,636.9,480.5,47.6,50.5,36.799999999999997,38.799999999999997,636.6,480.6,-0.3,0.1]
["41UE","Newcastle-under-Lyme","Newcastle-under-Lyme","7.12.22","7.12.22","7.12",7,642.79999999999995,459.1,"","","","","",""]
["95N","Craigavon","Craigavon","7.12.23","7.12.23","7.12",7,653.6,497.9,"","","","","",""]
["30UM","Rossendale","Rossendale","7.12.22","7.12.22","7.12",7,653.70000000000005,487.3,"","","","","",""]
["00GF","Telford and Wrekin","Telford and Wrekin","7.12.22","7.12.22","7.12",7,656.5,529.1,"","","","","",""]
["95C","Coleraine","Coleraine","7.12.23","7.12.23","7.12",7,659.9,459.9,"","","","","",""]
["95S","Lisburn","Lisburn","7.12.23","7.12.23","7.12",7,660.3,439.2,"","","","","",""]
["41UB","Cannock Chase","Cannock Chase","7.12.22","7.12.22","7.12",7,661.4,452.5,"","","","","",""]
["00NL","Wrexham Maelor","Wrexham","7.12.22","7.12.22","7.12",7,664.8,471.6,52.3,55.4,39.6,42,664.9,471.5,0.1,-0.1]
["00EF","Stockton-on-Tees","Stockton-on-Tees","7.12.22","7.12.22","7.12",7,668.1,462,"","","","","",""]
["00CC","Barnsley","Barnsley","7.12.22","7.12.22","7.12",7,668.9,484.7,"","","","","",""]
["95U","Newtownabbey","Newtownabbey","7.12.23","7.12.23","7.12",7,671.2,474.9,"","","","","",""]
["95T","Antrim","Antrim","7.12.23","7.12.23","7.12",7,672.4,548.6,"","","","","",""]
["17UD","Chesterfield","Chesterfield","7.12.22","7.12.22","7.12",7,683.1,473.3,"","","","","",""]
["37UF","Mansfield","Mansfield","7.12.22","7.12.22","7.12",7,688.6,501.4,"","","","","",""]
["44UC","Nuneaton and Bedworth","Nuneaton and Bedworth","7.12.22","7.12.22","7.12",7,692.3,461.9,"","","","","",""]
["00DB","Wakefield","Wakefield","7.12.22","7.12.22","7.12",7,698.5,509.1,"","","","","",""]
["37UB","Ashfield","Ashfield","7.12.22","7.12.22","7.12",7,708.7,501.6,"","","","","",""]
["95F","Larne","Larne","7.12.23","7.12.23","7.12",7,714.1,366.2,"","","","","",""]
["00CF","Rotherham","Rotherham","7.12.22","7.12.22","7.12",7,714.3,507,"","","","","",""]
["00FD","North Lincolnshire","North Lincolnshire","7.12.22","7.12.22","7.12",7,718,447.4,"","","","","",""]
["00FC","North East Lincolnshire","North East Lincolnshire","7.12.22","7.12.22","7.12",7,724.4,513.1,"","","","","",""]
["34UB","Corby","Corby","7.12.22","7.12.22","7.12",7,728.1,552,"","","","","",""]
["17UC","Bolsover","Bolsover","7.12.22","7.12.22","7.12",7,729.1,530.9,"","","","","",""]
["00BW","Wigan","Wigan","7.12.22","7.12.22","7.12",7,729.7,546.6,"","","","","",""]
["00PB","Bridgend","Bridgend","7.12.22","7.12.22","7.12",7,731.6,544.5,53.4,56.5,41,43.3,731.5,544.4,-0.1,-0.1]
["00CE","Doncaster","Doncaster","7.12.22","7.12.22","7.12",7,738.6,514.5,"","","","","",""]

{"sheet":"Interpretation","index":8,"n_rows":133,"n_cols":1,"rows_kept":133,"cut":false,"hidden":false,"merged":[[132,0,132,10],[110,0,110,10],[124,0,124,10],[126,0,126,10],[128,0,128,10],[130,0,130,10],[114,0,114,10],[112,0,112,10],[120,0,120,10],[32,0,32,9],[118,0,118,10],[34,0,34,10],[36,0,36,9],[38,0,38,9],[40,0,40,9],[67,0,67,10],[69,0,69,10],[71,0,71,10],[73,0,73,10],[75,0,75,10],[79,0,79,10],[108,0,108,10]]}
[]
[]
[]
[]
[]
[]
["As an example, here is the age standardised rate chart for Powys males:"]
[]
[]
[]
[]
[]
[]
[]
[]
[]
[]
[]
[]
[]
[]
[]
[]
[]
[]
[]
[]
[]
[]
[]
[]
[]
["This analysis indicates that the male, all ages, all causes, age standardised mortality rate is:"]
[]
["·         Towards the lower (better) end of its peer group (11th out of 54 LA’s)"]
[]
["·         Is statistically significantly lower than the all Wales rate (the bright red line)"]
[]
["·         Is marginally statistically significantly higher than the best five in peer group combined rate (the dull red line), which is the combined rate for the five LA’s with the lowest individual rates. "]
[]
["To explain the differences between the Powys rate and the best five in peer group rate you should consider the age specific rates, as shown below."]
[]
[]
[]
[]
[]
[]
[]
[]
[]
[]
[]
[]
[]
[]
[]
[]
[]
[]
[]
[]
[]
[]
[]
[]
[]
[]
["This analysis indicates that the male, age specific, all causes, crude mortality rates are:"]
[]
["·         Lower than, but not statistically significantly different to, the equivalent rates in the best five in peer group in 00-01, 25-29, 60-64 and 65-69 age groups (i.e. all those with negative excess deaths) "]
[]
["·         The same as the equivalent rates in the best five in peer group in 30-34 and 35-39 age groups (i.e. all those with zero excess deaths)"]
[" "]
["·         Higher than, but not statistically significantly different to, the equivalent rates in the best five in peer group in 01-04, 05-09, 15-19, 20-24, 40-44, 45-49, 50-54 and 55-59 age groups (i.e. all those with positive excess deaths and grey confidence intervals) "]
[]
["·         Higher than, and statistically significantly different to, the equivalent rates in the best five in peer group in 10-14 and 70-74 age groups (i.e. all those with positive excess deaths and red confidence intervals) "]
[]
[]
[]
["The best five in peer group analysis provides a benchmark against the \"best\" though can seem somewhat alarming. To place the local age specific rates in a national context the final chart shows age and sex specific rates for Powys compared to all Wales. "]
[]
[]
[]
[]
[]
[]
[]
[]
[]
[]
[]
[]
[]
[]
[]
[]
[]
[]
[]
[]
[]
[]
[]
[]
[]
[]
[]
[]
["This analysis indicates that the male, age specific, all causes, crude mortality rates are:"]
[]
["·         Lower than, but not statistically significantly different to, or the same as the equivalent rates in Wales as a whole in all age groups except 60-64 and 65-69 (i.e. all those with negative or zero excess deaths and grey confidence intervals). "]
[]
["·         Lower than, and statistically significantly different to, the equivalent rates in the Wales as a whole in 60-64 and 65-69 age groups (i.e. all those with negative excess deaths and green confidence intervals)."]
[]
["·         Higher than, but not statistically significantly different to, the equivalent rates in the best five in peer group in 05-09, 10-14 & 50-54 (i.e. all those with positive excess deaths and grey confidence intervals) "]
[]
["So what does this mean?"]
[]
["This shows that for Powys to get closer to the male age standardised rate of the five best in class there would need to be a substantial reduction in the number of deaths occurring in the 70-74 age group, along with lesser but also important reductions in the number of deaths between 40 and 59."]
[]
["It also shows that compared to Wales as a whole, males age specific rates in Powys are lower or equivalent in all age groups, statistically significantly so in some of the older groups."]
[]
["What else should I consider?"]
[]
["This is based on a single year only and if repeated for another year or an aggregated period the results would be different."]
[]
["The comparison is being made to the very “best” areas in the UK, therefore some degree of excess is expected, unless they are in the best five in their peer group."]
[]
["It is likely that at least part of any excesses in the older age groups may not be amenable to intervention, particularly if they are related to long term lifestyle or environment effects. "]
[]
["Following on, targeting the age groups with the excess and the age groups before the excess, is likely to be the most effective strategy. "]
[]
["An identically sized excess in either a younger or older age group will have a greater effect on the age standardised rate if it were in the younger age group.   "]