{"text_format":"1","workbook":"xlsx","n_sheets":6,"sheets":["README","Copy tables and charts","Interactive","Interactive controls","GP pops","HB pops"],"not_rendered":{"charts":1,"images":5,"macros":1,"external_links":0,"defined_names":10,"comments":0,"pivot_tables":0},"unopened":[],"bounds":{"document_bytes":16777216,"sheet_cells":100000,"rows_first":2000,"rows_last":500,"rows_between":2000,"halvings":0,"cell_chars":16384,"cell_head_chars":4096},"cells_cut":0,"cells_raw":0,"read":"whole","date_system":"1900"}

{"sheet":"README","index":0,"n_rows":21,"n_cols":4,"rows_kept":21,"cut":false,"hidden":false,"merged":[[10,3,10,4],[11,3,11,5]]}
[]
[]
[]
[]
[]
[]
[]
[]
[]
["TOPIC:","GP Cluster Profiles",null,"Contents (click links to access):"]
["SUBJECT:","Age/sex breakdown",null,"Chart"]
["SOURCE: ","GP registrations data: Welsh Demographic Service (WDS), NHS Wales Informatics Service (NWIS)",null,"How to copy tables and charts"]
[null,"GP registrations data: English residents provided by PCTs/CCGs"]
["GEOGRAPHY:","GP clusters in Wales"]
["PERIOD:","WDS data extract from September 2012; English registrations received between October 2012 and May 2013"]
["DEMOGRAPHY:","Persons registered with GP practices which form the clusters in Wales"]
["STATISTICS:","Counts, percentages"]
["NOTES:","This file provides supporting data for the Observatory's GP Cluster Profiles."]
[null,"Details of the data source, method, caveats and notes on interpretation are available from the technical guide that accompanies these profiles."]
[null,"The profiles and technical guide are available here:"]
[null,"http://www.publichealthwalesobservatory.wales.nhs.uk/gpclusters"]

{"sheet":"Copy tables and charts","index":1,"n_rows":35,"n_cols":13,"rows_kept":35,"cut":false,"hidden":false,"merged":[]}
[]
[null,null,null,null,null,null,null,null,null,null,null,null,"Figure 1"]
[]
[]
[]
[]
["Copying and pasting charts and tables to use in documents, reports or presentations"]
[]
["Why use this method to copy and paste charts "]
["If the standard {Copy} and {Paste} option is used for inserting Excel charts into documents, reports"]
["or presentations then frequently the chart will lose some of its formatting and/or the axes labels may be"]
["truncated. Similarly, table column sizes are often distorted using the standard {Copy} and {Paste}"]
["method if a table is too wide. The technique described below overcomes these issues."]
[]
["Copying and pasting a chart"]
[1,"Select the chart you want to copy by left clicking on it once i.e. so that the surrounding points are "]
[null,"displayed "]
[2,"On the 'Home' tab click the paste icon"]
[3,"Click 'As picture' option and 'Copy as picture' (see figure 1)"]
[4,"Choose 'As shown on screen' and 'picture'"]
[5,"Using your mouse click on the point where you want to insert a copy of the chart e.g. in a Word "]
[null,"document / presentation"]
[6,"On the 'Home' tab click 'paste' then 'paste special' and choose to insert as 'Picture (enhanced metafile)' "]
[]
[null,null,null,null,null,null,null,null,null,null,null,null,"Figure 2"]
[]
["Copying and pasting a table as a picture"]
[1,"Highlight the table you want to copy by left clicking on the top left hand corner "]
[null,"and dragging the mouse to the bottom right corner. "]
[2,"On the 'Home' tab click the paste icon"]
{"$rows_left_out":6}
{"sheet":"Interactive","index":2,"n_rows":65,"n_cols":14,"rows_kept":65,"cut":false,"hidden":false,"merged":[[27,13,27,21],[33,3,33,5],[33,7,33,9],[51,3,51,5],[51,7,51,9],[33,11,33,13],[51,11,51,13],[31,1,31,9],[49,1,49,9]]}
[]
[null,{"$f":"'Interactive controls'!A112","v":"Age/sex breakdown of patients, Anglesey GP cluster & Betsi Cadwaladr Health Board"}]
[]
[]
[]
[]
[]
[]
[]
[]
[]
[]
[]
[]
[]
[]
[]
[]
[]
[]
[]
[]
[]
[]
[]
[]
[]
[]
[]
[]
{"$rows_left_out":36}
{"sheet":"Interactive controls","index":3,"n_rows":215,"n_cols":25,"rows_kept":215,"cut":false,"hidden":true,"merged":[[3,17,3,18]]}
[null,"GP cluster index","Health board index",null,"Health Board",1,{"$f":"IF(F1=1,E1,E2)","v":"Health Board"}]
["Current selection (list number)",1,1,null,"Local Authority"]
["Current selection"]
[]
[]
["Current selection variables"]
["Health board",null,"?"]
["Betsi Cadwaladr","Betsi Cadwaladr",{"$f":"INDEX(A8:A14,C2,1)","v":"Betsi Cadwaladr"}]
["Powys","Powys"]
["Hywel Dda","Hywel Dda"]
["Abertawe Bro Morgannwg","Abertawe Bro Morgannwg"]
["Cardiff & Vale","Cardiff & Vale"]
["Cwm Taf","Cwm Taf"]
["Aneurin Bevan","Aneurin Bevan"]
[]
[null,null,"inputs for box 1","currently selected LA/HB"]
["Betsi Cadwaladr","Isle of Anglesey",{"$f":"IF(INDEX(A17:B38,,$F$1)=0,\"\",INDEX(A17:B38,,$F$1))","v":"Betsi Cadwaladr"},{"$f":"INDEX(C17:C38,C2)","v":"Betsi Cadwaladr"}]
["Powys","Gwynedd",{"$f":"IF(INDEX(A18:B39,,$F$1)=0,\"\",INDEX(A18:B39,,$F$1))","v":"Powys"}]
["Hywel Dda","Conwy",{"$f":"IF(INDEX(A19:B40,,$F$1)=0,\"\",INDEX(A19:B40,,$F$1))","v":"Hywel Dda"}]
["Abertawe Bro Morgannwg","Denbighshire",{"$f":"IF(INDEX(A20:B41,,$F$1)=0,\"\",INDEX(A20:B41,,$F$1))","v":"Abertawe Bro Morgannwg"}]
["Cardiff & Vale","Flintshire",{"$f":"IF(INDEX(A21:B43,,$F$1)=0,\"\",INDEX(A21:B43,,$F$1))","v":"Cardiff & Vale"}]
["Cwm Taf","Wrexham",{"$f":"IF(INDEX(A22:B44,,$F$1)=0,\"\",INDEX(A22:B44,,$F$1))","v":"Cwm Taf"}]
["Aneurin Bevan","Powys",{"$f":"IF(INDEX(A23:B45,,$F$1)=0,\"\",INDEX(A23:B45,,$F$1))","v":"Aneurin Bevan"}]
[null,"Ceredigion",{"$f":"IF(INDEX(A24:B46,,$F$1)=0,\"\",INDEX(A24:B46,,$F$1))","v":""}]
[null,"Pembrokeshire",""]
[null,"Carmarthenshire",""]
[null,"Swansea",""]
[null,"Neath Port Talbot",""]
[null,"Bridgend",""]
[null,"Vale of Glamorgan",""]
{"$rows_left_out":186}
{"sheet":"GP pops","index":4,"n_rows":587,"n_cols":20,"rows_kept":587,"cut":false,"hidden":true,"merged":[]}
["GP age","GP Practice Cluster","HB age","Local Health Board","age","Males","Females","HB males","HB females"]
[{"$f":"B2&E2","v":"NULL00_02"},"NULL",{"$f":"D2&E2","v":"NULL00_02"},"NULL","00_02",236,209,{"$f":"VLOOKUP(C2,'HB pops'!$A$2:$E$73,4,FALSE)","v":236},{"$f":"VLOOKUP(C2,'HB pops'!$A$2:$E$73,5,FALSE)","v":209}]
[{"$f":"B3&E3","v":"NULL03_04"},"NULL",{"$f":"D3&E3","v":"NULL03_04"},"NULL","03_04",195,162,{"$f":"VLOOKUP(C3,'HB pops'!$A$2:$E$73,4,FALSE)","v":195},{"$f":"VLOOKUP(C3,'HB pops'!$A$2:$E$73,5,FALSE)","v":162}]
["NULL05_14","NULL","NULL05_14","NULL","05_14",934,907,{"$f":"VLOOKUP(C4,'HB pops'!$A$2:$E$73,4,FALSE)","v":934},{"$f":"VLOOKUP(C4,'HB pops'!$A$2:$E$73,5,FALSE)","v":907}]
["NULL15_24","NULL","NULL15_24","NULL","15_24",1404,1435,{"$f":"VLOOKUP(C5,'HB pops'!$A$2:$E$73,4,FALSE)","v":1404},{"$f":"VLOOKUP(C5,'HB pops'!$A$2:$E$73,5,FALSE)","v":1435}]
["NULL25_44","NULL","NULL25_44","NULL","25_44",3092,3126,{"$f":"VLOOKUP(C6,'HB pops'!$A$2:$E$73,4,FALSE)","v":3092},{"$f":"VLOOKUP(C6,'HB pops'!$A$2:$E$73,5,FALSE)","v":3126}]
["NULL45_64","NULL","NULL45_64","NULL","45_64",2874,2680,{"$f":"VLOOKUP(C7,'HB pops'!$A$2:$E$73,4,FALSE)","v":2874},{"$f":"VLOOKUP(C7,'HB pops'!$A$2:$E$73,5,FALSE)","v":2680}]
["NULL65_74","NULL","NULL65_74","NULL","65_74",962,927,{"$f":"VLOOKUP(C8,'HB pops'!$A$2:$E$73,4,FALSE)","v":962},{"$f":"VLOOKUP(C8,'HB pops'!$A$2:$E$73,5,FALSE)","v":927}]
["NULL75_84","NULL","NULL75_84","NULL","75_84",498,559,{"$f":"VLOOKUP(C9,'HB pops'!$A$2:$E$73,4,FALSE)","v":498},{"$f":"VLOOKUP(C9,'HB pops'!$A$2:$E$73,5,FALSE)","v":559}]
["NULL85+","NULL","NULL85+","NULL","85+",166,259,{"$f":"VLOOKUP(C10,'HB pops'!$A$2:$E$73,4,FALSE)","v":166},{"$f":"VLOOKUP(C10,'HB pops'!$A$2:$E$73,5,FALSE)","v":259},null,"Local Health Board","GP Practice Cluster","age_group","Males","Females"]
["Afan00_02","Afan","Abertawe Bro Morgannwg University LHB00_02","Abertawe Bro Morgannwg University LHB","00_02",878,843,{"$f":"VLOOKUP(C11,'HB pops'!$A$2:$E$73,4,FALSE)","v":9116},{"$f":"VLOOKUP(C11,'HB pops'!$A$2:$E$73,5,FALSE)","v":8539},null,"Abertawe Bro Morgannwg University LHB","Afan","00_02",878,843,{"$f":"K11=D11","v":true},{"$f":"L11=B11","v":true},{"$f":"M11=E11","v":true},{"$f":"N11=F11","v":true},{"$f":"O11=G11","v":true}]
["Afan03_04","Afan","Abertawe Bro Morgannwg University LHB03_04","Abertawe Bro Morgannwg University LHB","03_04",616,572,{"$f":"VLOOKUP(C12,'HB pops'!$A$2:$E$73,4,FALSE)","v":6284},{"$f":"VLOOKUP(C12,'HB pops'!$A$2:$E$73,5,FALSE)","v":5757},null,"Abertawe Bro Morgannwg University LHB","Afan","03_04",616,572,{"$f":"K12=D12","v":true},{"$f":"L12=B12","v":true},{"$f":"M12=E12","v":true},{"$f":"N12=F12","v":true},{"$f":"O12=G12","v":true}]
["Afan05_14","Afan","Abertawe Bro Morgannwg University LHB05_14","Abertawe Bro Morgannwg University LHB","05_14",2679,2636,{"$f":"VLOOKUP(C13,'HB pops'!$A$2:$E$73,4,FALSE)","v":29673},{"$f":"VLOOKUP(C13,'HB pops'!$A$2:$E$73,5,FALSE)","v":28118},null,"Abertawe Bro Morgannwg University LHB","Afan","05_14",2679,2636,true,true,true,true,true]
["Afan15_24","Afan","Abertawe Bro Morgannwg University LHB15_24","Abertawe Bro Morgannwg University LHB","15_24",3317,3080,{"$f":"VLOOKUP(C14,'HB pops'!$A$2:$E$73,4,FALSE)","v":36992},{"$f":"VLOOKUP(C14,'HB pops'!$A$2:$E$73,5,FALSE)","v":34588},null,"Abertawe Bro Morgannwg University LHB","Afan","15_24",3317,3080,true,true,true,true,true]
["Afan25_44","Afan","Abertawe Bro Morgannwg University LHB25_44","Abertawe Bro Morgannwg University LHB","25_44",6562,6240,{"$f":"VLOOKUP(C15,'HB pops'!$A$2:$E$73,4,FALSE)","v":71125},{"$f":"VLOOKUP(C15,'HB pops'!$A$2:$E$73,5,FALSE)","v":67753},null,"Abertawe Bro Morgannwg University LHB","Afan","25_44",6562,6240,true,true,true,true,true]
["Afan45_64","Afan","Abertawe Bro Morgannwg University LHB45_64","Abertawe Bro Morgannwg University LHB","45_64",6951,6908,{"$f":"VLOOKUP(C16,'HB pops'!$A$2:$E$73,4,FALSE)","v":72111},{"$f":"VLOOKUP(C16,'HB pops'!$A$2:$E$73,5,FALSE)","v":70992},null,"Abertawe Bro Morgannwg University LHB","Afan","45_64",6951,6908,true,true,true,true,true]
["Afan65_74","Afan","Abertawe Bro Morgannwg University LHB65_74","Abertawe Bro Morgannwg University LHB","65_74",2446,2561,{"$f":"VLOOKUP(C17,'HB pops'!$A$2:$E$73,4,FALSE)","v":26093},{"$f":"VLOOKUP(C17,'HB pops'!$A$2:$E$73,5,FALSE)","v":27993},null,"Abertawe Bro Morgannwg University LHB","Afan","65_74",2446,2561,true,true,true,true,true]
["Afan75_84","Afan","Abertawe Bro Morgannwg University LHB75_84","Abertawe Bro Morgannwg University LHB","75_84",1407,1781,{"$f":"VLOOKUP(C18,'HB pops'!$A$2:$E$73,4,FALSE)","v":14828},{"$f":"VLOOKUP(C18,'HB pops'!$A$2:$E$73,5,FALSE)","v":18662},null,"Abertawe Bro Morgannwg University LHB","Afan","75_84",1407,1781,true,true,true,true,true]
["Afan85+","Afan","Abertawe Bro Morgannwg University LHB85+","Abertawe Bro Morgannwg University LHB","85+",447,898,{"$f":"VLOOKUP(C19,'HB pops'!$A$2:$E$73,4,FALSE)","v":4587},{"$f":"VLOOKUP(C19,'HB pops'!$A$2:$E$73,5,FALSE)","v":8957},null,"Abertawe Bro Morgannwg University LHB","Afan","85+",447,898,true,true,true,true,true]
["BayHealth00_02","BayHealth","Abertawe Bro Morgannwg University LHB00_02","Abertawe Bro Morgannwg University LHB","00_02",910,811,{"$f":"VLOOKUP(C20,'HB pops'!$A$2:$E$73,4,FALSE)","v":9116},{"$f":"VLOOKUP(C20,'HB pops'!$A$2:$E$73,5,FALSE)","v":8539},null,"Abertawe Bro Morgannwg University LHB","BayHealth","00_02",910,811,true,true,true,true,true]
["BayHealth03_04","BayHealth","Abertawe Bro Morgannwg University LHB03_04","Abertawe Bro Morgannwg University LHB","03_04",650,619,{"$f":"VLOOKUP(C21,'HB pops'!$A$2:$E$73,4,FALSE)","v":6284},{"$f":"VLOOKUP(C21,'HB pops'!$A$2:$E$73,5,FALSE)","v":5757},null,"Abertawe Bro Morgannwg University LHB","BayHealth","03_04",650,619,true,true,true,true,true]
["BayHealth05_14","BayHealth","Abertawe Bro Morgannwg University LHB05_14","Abertawe Bro Morgannwg University LHB","05_14",3315,3040,{"$f":"VLOOKUP(C22,'HB pops'!$A$2:$E$73,4,FALSE)","v":29673},{"$f":"VLOOKUP(C22,'HB pops'!$A$2:$E$73,5,FALSE)","v":28118},null,"Abertawe Bro Morgannwg University LHB","BayHealth","05_14",3315,3040,true,true,true,true,true]
["BayHealth15_24","BayHealth","Abertawe Bro Morgannwg University LHB15_24","Abertawe Bro Morgannwg University LHB","15_24",7256,6395,{"$f":"VLOOKUP(C23,'HB pops'!$A$2:$E$73,4,FALSE)","v":36992},{"$f":"VLOOKUP(C23,'HB pops'!$A$2:$E$73,5,FALSE)","v":34588},null,"Abertawe Bro Morgannwg University LHB","BayHealth","15_24",7256,6395,true,true,true,true,true]
["BayHealth25_44","BayHealth","Abertawe Bro Morgannwg University LHB25_44","Abertawe Bro Morgannwg University LHB","25_44",9303,8099,{"$f":"VLOOKUP(C24,'HB pops'!$A$2:$E$73,4,FALSE)","v":71125},{"$f":"VLOOKUP(C24,'HB pops'!$A$2:$E$73,5,FALSE)","v":67753},null,"Abertawe Bro Morgannwg University LHB","BayHealth","25_44",9303,8099,true,true,true,true,true]
["BayHealth45_64","BayHealth","Abertawe Bro Morgannwg University LHB45_64","Abertawe Bro Morgannwg University LHB","45_64",9040,8628,{"$f":"VLOOKUP(C25,'HB pops'!$A$2:$E$73,4,FALSE)","v":72111},{"$f":"VLOOKUP(C25,'HB pops'!$A$2:$E$73,5,FALSE)","v":70992},null,"Abertawe Bro Morgannwg University LHB","BayHealth","45_64",9040,8628,true,true,true,true,true]
["BayHealth65_74","BayHealth","Abertawe Bro Morgannwg University LHB65_74","Abertawe Bro Morgannwg University LHB","65_74",3568,4094,{"$f":"VLOOKUP(C26,'HB pops'!$A$2:$E$73,4,FALSE)","v":26093},{"$f":"VLOOKUP(C26,'HB pops'!$A$2:$E$73,5,FALSE)","v":27993},null,"Abertawe Bro Morgannwg University LHB","BayHealth","65_74",3568,4094,true,true,true,true,true]
["BayHealth75_84","BayHealth","Abertawe Bro Morgannwg University LHB75_84","Abertawe Bro Morgannwg University LHB","75_84",2357,2973,{"$f":"VLOOKUP(C27,'HB pops'!$A$2:$E$73,4,FALSE)","v":14828},{"$f":"VLOOKUP(C27,'HB pops'!$A$2:$E$73,5,FALSE)","v":18662},null,"Abertawe Bro Morgannwg University LHB","BayHealth","75_84",2357,2973,true,true,true,true,true]
["BayHealth85+","BayHealth","Abertawe Bro Morgannwg University LHB85+","Abertawe Bro Morgannwg University LHB","85+",822,1600,{"$f":"VLOOKUP(C28,'HB pops'!$A$2:$E$73,4,FALSE)","v":4587},{"$f":"VLOOKUP(C28,'HB pops'!$A$2:$E$73,5,FALSE)","v":8957},null,"Abertawe Bro Morgannwg University LHB","BayHealth","85+",822,1600,true,true,true,true,true]
["Bridgend East Network00_02","Bridgend East Network","Abertawe Bro Morgannwg University LHB00_02","Abertawe Bro Morgannwg University LHB","00_02",1200,1188,{"$f":"VLOOKUP(C29,'HB pops'!$A$2:$E$73,4,FALSE)","v":9116},{"$f":"VLOOKUP(C29,'HB pops'!$A$2:$E$73,5,FALSE)","v":8539},null,"Abertawe Bro Morgannwg University LHB","Bridgend East Network","00_02",1200,1188,true,true,true,true,true]
["Bridgend East Network03_04","Bridgend East Network","Abertawe Bro Morgannwg University LHB03_04","Abertawe Bro Morgannwg University LHB","03_04",841,764,{"$f":"VLOOKUP(C30,'HB pops'!$A$2:$E$73,4,FALSE)","v":6284},{"$f":"VLOOKUP(C30,'HB pops'!$A$2:$E$73,5,FALSE)","v":5757},null,"Abertawe Bro Morgannwg University LHB","Bridgend East Network","03_04",841,764,true,true,true,true,true]
{"$rows_left_out":558}
{"sheet":"HB pops","index":5,"n_rows":82,"n_cols":14,"rows_kept":82,"cut":false,"hidden":true,"merged":[]}
["HB age","Local Health Board","age","Males","Females"]
[{"$f":"B2&C2","v":"NULL00_02"},"NULL","00_02",236,209]
[{"$f":"B3&C3","v":"NULL03_04"},"NULL","03_04",195,162]
["NULL05_14","NULL","05_14",934,907]
["NULL15_24","NULL","15_24",1404,1435]
["NULL25_44","NULL","25_44",3092,3126]
["NULL45_64","NULL","45_64",2874,2680]
["NULL65_74","NULL","65_74",962,927]
["NULL75_84","NULL","75_84",498,559]
["NULL85+","NULL","85+",166,259,null,"Local Health Board","age_group","Males","Females"]
["Abertawe Bro Morgannwg University LHB00_02","Abertawe Bro Morgannwg University LHB","00_02",9116,8539,null,"Abertawe Bro Morgannwg University LHB","00_02",9116,8539,{"$f":"G11=B11","v":true},{"$f":"H11=C11","v":true},{"$f":"I11=D11","v":true},{"$f":"J11=E11","v":true}]
["Abertawe Bro Morgannwg University LHB03_04","Abertawe Bro Morgannwg University LHB","03_04",6284,5757,null,"Abertawe Bro Morgannwg University LHB","03_04",6284,5757,{"$f":"G12=B12","v":true},{"$f":"H12=C12","v":true},{"$f":"I12=D12","v":true},{"$f":"J12=E12","v":true}]
["Abertawe Bro Morgannwg University LHB05_14","Abertawe Bro Morgannwg University LHB","05_14",29673,28118,null,"Abertawe Bro Morgannwg University LHB","05_14",29673,28118,true,true,true,true]
["Abertawe Bro Morgannwg University LHB15_24","Abertawe Bro Morgannwg University LHB","15_24",36992,34588,null,"Abertawe Bro Morgannwg University LHB","15_24",36992,34588,true,true,true,true]
["Abertawe Bro Morgannwg University LHB25_44","Abertawe Bro Morgannwg University LHB","25_44",71125,67753,null,"Abertawe Bro Morgannwg University LHB","25_44",71125,67753,true,true,true,true]
["Abertawe Bro Morgannwg University LHB45_64","Abertawe Bro Morgannwg University LHB","45_64",72111,70992,null,"Abertawe Bro Morgannwg University LHB","45_64",72111,70992,true,true,true,true]
["Abertawe Bro Morgannwg University LHB65_74","Abertawe Bro Morgannwg University LHB","65_74",26093,27993,null,"Abertawe Bro Morgannwg University LHB","65_74",26093,27993,true,true,true,true]
["Abertawe Bro Morgannwg University LHB75_84","Abertawe Bro Morgannwg University LHB","75_84",14828,18662,null,"Abertawe Bro Morgannwg University LHB","75_84",14828,18662,true,true,true,true]
["Abertawe Bro Morgannwg University LHB85+","Abertawe Bro Morgannwg University LHB","85+",4587,8957,null,"Abertawe Bro Morgannwg University LHB","85+",4587,8957,true,true,true,true]
["Aneurin Bevan LHB00_02","Aneurin Bevan LHB","00_02",10148,9829,null,"Aneurin Bevan LHB","00_02",10148,9829,true,true,true,true]
["Aneurin Bevan LHB03_04","Aneurin Bevan LHB","03_04",7247,6724,null,"Aneurin Bevan LHB","03_04",7247,6724,true,true,true,true]
["Aneurin Bevan LHB05_14","Aneurin Bevan LHB","05_14",34162,32575,null,"Aneurin Bevan LHB","05_14",34162,32575,true,true,true,true]
["Aneurin Bevan LHB15_24","Aneurin Bevan LHB","15_24",39331,37293,null,"Aneurin Bevan LHB","15_24",39331,37293,true,true,true,true]
["Aneurin Bevan LHB25_44","Aneurin Bevan LHB","25_44",76729,74824,null,"Aneurin Bevan LHB","25_44",76729,74824,true,true,true,true]
["Aneurin Bevan LHB45_64","Aneurin Bevan LHB","45_64",81293,79632,null,"Aneurin Bevan LHB","45_64",81293,79632,true,true,true,true]
["Aneurin Bevan LHB65_74","Aneurin Bevan LHB","65_74",28989,30334,null,"Aneurin Bevan LHB","65_74",28989,30334,true,true,true,true]
["Aneurin Bevan LHB75_84","Aneurin Bevan LHB","75_84",15460,19165,null,"Aneurin Bevan LHB","75_84",15460,19165,true,true,true,true]
["Aneurin Bevan LHB85+","Aneurin Bevan LHB","85+",4468,9313,null,"Aneurin Bevan LHB","85+",4468,9313,true,true,true,true]
["Betsi Cadwaladr University LHB00_02","Betsi Cadwaladr University LHB","00_02",11668,11090,null,"Betsi Cadwaladr University LHB","00_02",11668,11090,true,true,true,true]
["Betsi Cadwaladr University LHB03_04","Betsi Cadwaladr University LHB","03_04",7958,7695,null,"Betsi Cadwaladr University LHB","03_04",7958,7695,true,true,true,true]
{"$rows_left_out":52}