{"text_format":"1","workbook":"xlsx","n_sheets":6,"sheets":["README","Copy tables and charts","HBcomp","HB comp controls","Chart data","Table data"],"not_rendered":{"charts":1,"images":6,"macros":1,"external_links":0,"defined_names":0,"comments":0,"pivot_tables":0},"unopened":[],"bounds":{"document_bytes":16777216,"sheet_cells":100000,"rows_first":2000,"rows_last":500,"rows_between":2000,"halvings":0,"cell_chars":16384,"cell_head_chars":4096},"cells_cut":0,"cells_raw":0,"read":"whole","date_system":"1900"}

{"sheet":"README","index":0,"n_rows":21,"n_cols":4,"rows_kept":21,"cut":false,"hidden":false,"merged":[[10,3,10,4],[11,3,11,5]]}
[]
[]
[]
[]
[]
[]
[]
[]
[]
["TOPIC:","NHS Expenditure & Health Tool (NEHT)",null,"Contents (click links to access):"]
["SUBJECT:","Interactive spreadsheet",null,"Chart"]
["SOURCE: ","Various, for full details visit",null,"How to copy tables and charts"]
[null,"www.publichealthwalesobservatory.org/NEHT"]
["GEOGRAPHY:","England, Wales and Local Health Boards"]
["PERIOD:","Various, for full details visit"]
[null,"www.publichealthwalesobservatory.org/NEHT"]
["DEMOGRAPHY:","Various, for full details visit"]
[null,"www.publichealthwalesobservatory.org/NEHT"]
["STATISTICS:","Various, for full details visit"]
[null,"www.publichealthwalesobservatory.org/NEHT"]
["NOTES:"]

{"sheet":"Copy tables and charts","index":1,"n_rows":35,"n_cols":13,"rows_kept":35,"cut":false,"hidden":false,"merged":[]}
[]
[null,null,null,null,null,null,null,null,null,null,null,null,"Figure 1"]
[]
[]
[]
[]
["Copying and pasting charts and tables to use in documents, reports or presentations"]
[]
["Why use this method to copy and paste charts "]
["If the standard {Copy} and {Paste} option is used for inserting Excel charts into documents, reports"]
["or presentations then frequently the chart will lose some of its formatting and/or the axes labels may be"]
["truncated. Similarly, table column sizes are often distorted using the standard {Copy} and {Paste}"]
["method if a table is too wide. The technique descibed below overcomes these issues."]
[]
["Copying and pasting a chart"]
[1,"Select the chart you want to copy by left clicking on it once i.e. so that the surronding points are "]
[null,"displayed "]
[2,"On the 'Home' tab click the paste icon"]
[3,"Click 'As picture' option and 'Copy as picture' (see figure 1)"]
[4,"Choose 'As shown on screen' and 'picture'"]
[5,"Using your mouse click on the point where you want to insert a copy of the chart e.g. in a Word "]
[null,"document / presentation"]
[6,"On the 'Home' tab click 'paste' then 'paste special' and choose to insert as 'Picture (enhanced metafile)' "]
[]
[null,null,null,null,null,null,null,null,null,null,null,null,"Figure 2"]
[]
["Copying and pasting a table as a picture"]
[1,"Highlight the table you want to copy by left clicking on the top left hand corner "]
[null,"and dragging the mouse to the bottom right corner. "]
[2,"On the 'Home' tab click the paste icon"]
[3,"Click 'As picture' option and 'Copy as picture' (see figure 2)"]
[4,"Choose 'As shown on screen' and 'picture'"]
[5,"Using your mouse click on the point where you want to insert a copy of the chart e.g. in a Word "]
[null,"document / presentation"]
[6,"On the 'Home' tab click 'paste' then 'paste special' and choose to insert as 'Picture (enhanced metafile)' "]

{"sheet":"HBcomp","index":2,"n_rows":47,"n_cols":12,"rows_kept":47,"cut":false,"hidden":false,"merged":[[34,0,34,7],[80,11,80,12],[7,9,7,14],[8,11,8,12],[20,9,20,14],[26,11,26,12],[46,0,46,6]]}
[]
[]
[]
[]
[]
[]
[]
[]
[]
[]
[]
[]
[]
[]
[]
[]
[]
[]
[]
[]
[]
[]
[]
[]
[]
[]
[]
[]
[]
[]
[]
[]
[]
[]
[{"$f":"'HB comp controls'!B63","v":"Expenditure per capita for problems of the circulatory system with selected indicators, Wales health boards & England "}]
[null,{"$f":"'HB comp controls'!H100","v":"Expenditure per capita (£)"},{"$f":"'HB comp controls'!L74","v":"Current smoker status, adults (1)"},{"$f":"'HB comp controls'!L75","v":"% of smokers treated by Stop Smoking Wales (2)"},{"$f":"'HB comp controls'!L76","v":"QOF CHD register, % of list size (3)"},{"$f":"'HB comp controls'!L77","v":"Elective hospital admissions, any mention of revascularisation (4)"},{"$f":"'HB comp controls'!L78","v":"Mortality from circulatory disease, under 75 (5)"},{"$f":"'HB comp controls'!L79","v":""},{"$f":"'HB comp controls'!L80","v":""},{"$f":"'HB comp controls'!L81","v":""},{"$f":"'HB comp controls'!L82","v":""},{"$f":"'HB comp controls'!L83","v":""}]
["Betsi Cadwaladr University",{"$f":"IFERROR('HB comp controls'!C37,\" \")","v":172.2},{"$f":"IFERROR('HB comp controls'!D37,\" \")","v":22.364305427236104},{"$f":"IFERROR('HB comp controls'!E37,\" \")","v":1.0568230395338896},{"$f":"IFERROR('HB comp controls'!F37,\" \")","v":4.2424645459060297},{"$f":"IFERROR('HB comp controls'!G37,\" \")","v":64.208950105954486},{"$f":"IFERROR('HB comp controls'!H37,\" \")","v":98.209786599879706},{"$f":"IFERROR('HB comp controls'!I37,\" \")","v":""},{"$f":"IFERROR('HB comp controls'!J37,\" \")","v":""},{"$f":"IFERROR('HB comp controls'!K37,\" \")","v":""},{"$f":"IFERROR('HB comp controls'!L37,\" \")","v":""},{"$f":"IFERROR('HB comp controls'!M37,\" \")","v":""}]
["Powys Teaching",{"$f":"IFERROR('HB comp controls'!C38,\" \")","v":183.4},{"$f":"IFERROR('HB comp controls'!D38,\" \")","v":19.882034336099096},{"$f":"IFERROR('HB comp controls'!E38,\" \")","v":1.3288203585307758},{"$f":"IFERROR('HB comp controls'!F38,\" \")","v":4.1596078290019101},{"$f":"IFERROR('HB comp controls'!G38,\" \")","v":73.927611085633231},{"$f":"IFERROR('HB comp controls'!H38,\" \")","v":81.9961156788887},{"$f":"IFERROR('HB comp controls'!I38,\" \")","v":""},{"$f":"IFERROR('HB comp controls'!J38,\" \")","v":""},{"$f":"IFERROR('HB comp controls'!K38,\" \")","v":""},{"$f":"IFERROR('HB comp controls'!L38,\" \")","v":""},{"$f":"IFERROR('HB comp controls'!M38,\" \")","v":""}]
["Hywel Dda",{"$f":"IFERROR('HB comp controls'!C39,\" \")","v":157.5},{"$f":"IFERROR('HB comp controls'!D39,\" \")","v":22.103846860627598},{"$f":"IFERROR('HB comp controls'!E39,\" \")","v":1.491075474732118},{"$f":"IFERROR('HB comp controls'!F39,\" \")","v":4.3216513125713352},{"$f":"IFERROR('HB comp controls'!G39,\" \")","v":50.03886556370842},{"$f":"IFERROR('HB comp controls'!H39,\" \")","v":98.449947328307303},{"$f":"IFERROR('HB comp controls'!I39,\" \")","v":""},{"$f":"IFERROR('HB comp controls'!J39,\" \")","v":""},{"$f":"IFERROR('HB comp controls'!K39,\" \")","v":""},{"$f":"IFERROR('HB comp controls'!L39,\" \")","v":""},{"$f":"IFERROR('HB comp controls'!M39,\" \")","v":""}]
["ABMU",{"$f":"IFERROR('HB comp controls'!C40,\" \")","v":150.80000000000001},{"$f":"IFERROR('HB comp controls'!D40,\" \")","v":23.343784242752104},{"$f":"IFERROR('HB comp controls'!E40,\" \")","v":2.2796829207626339},{"$f":"IFERROR('HB comp controls'!F40,\" \")","v":4.1523782906168352},{"$f":"IFERROR('HB comp controls'!G40,\" \")","v":50.959631952465266},{"$f":"IFERROR('HB comp controls'!H40,\" \")","v":102.10087566515701},{"$f":"IFERROR('HB comp controls'!I40,\" \")","v":""},{"$f":"IFERROR('HB comp controls'!J40,\" \")","v":""},{"$f":"IFERROR('HB comp controls'!K40,\" \")","v":""},{"$f":"IFERROR('HB comp controls'!L40,\" \")","v":""},{"$f":"IFERROR('HB comp controls'!M40,\" \")","v":""}]
["Cardiff & Vale University",{"$f":"IFERROR('HB comp controls'!C41,\" \")","v":104.4},{"$f":"IFERROR('HB comp controls'!D41,\" \")","v":21.220607242497422},{"$f":"IFERROR('HB comp controls'!E41,\" \")","v":0.56424971666947987},{"$f":"IFERROR('HB comp controls'!F41,\" \")","v":3.0215706571916181},{"$f":"IFERROR('HB comp controls'!G41,\" \")","v":30.560431293881646},{"$f":"IFERROR('HB comp controls'!H41,\" \")","v":67.192754227927594},{"$f":"IFERROR('HB comp controls'!I41,\" \")","v":""},{"$f":"IFERROR('HB comp controls'!J41,\" \")","v":""},{"$f":"IFERROR('HB comp controls'!K41,\" \")","v":""},{"$f":"IFERROR('HB comp controls'!L41,\" \")","v":""},{"$f":"IFERROR('HB comp controls'!M41,\" \")","v":""}]
["Cwm Taf",{"$f":"IFERROR('HB comp controls'!C42,\" \")","v":154.6},{"$f":"IFERROR('HB comp controls'!D42,\" \")","v":26.268038351461513},{"$f":"IFERROR('HB comp controls'!E42,\" \")","v":1.1223215459445248},{"$f":"IFERROR('HB comp controls'!F42,\" \")","v":4.0810430134710538},{"$f":"IFERROR('HB comp controls'!G42,\" \")","v":39.928333759918097},{"$f":"IFERROR('HB comp controls'!H42,\" \")","v":110.871027429492},{"$f":"IFERROR('HB comp controls'!I42,\" \")","v":""},{"$f":"IFERROR('HB comp controls'!J42,\" \")","v":""},{"$f":"IFERROR('HB comp controls'!K42,\" \")","v":""},{"$f":"IFERROR('HB comp controls'!L42,\" \")","v":""},{"$f":"IFERROR('HB comp controls'!M42,\" \")","v":""}]
["Aneurin Bevan",{"$f":"IFERROR('HB comp controls'!C43,\" \")","v":135.1},{"$f":"IFERROR('HB comp controls'!D43,\" \")","v":23.799081531332941},{"$f":"IFERROR('HB comp controls'!E43,\" \")","v":1.0748388693723283},{"$f":"IFERROR('HB comp controls'!F43,\" \")","v":4.0670503779767966},{"$f":"IFERROR('HB comp controls'!G43,\" \")","v":40.014544417014186},{"$f":"IFERROR('HB comp controls'!H43,\" \")","v":96.688756748988695},{"$f":"IFERROR('HB comp controls'!I43,\" \")","v":""},{"$f":"IFERROR('HB comp controls'!J43,\" \")","v":""},{"$f":"IFERROR('HB comp controls'!K43,\" \")","v":""},{"$f":"IFERROR('HB comp controls'!L43,\" \")","v":""},{"$f":"IFERROR('HB comp controls'!M43,\" \")","v":""}]
["Wales",{"$f":"IFERROR('HB comp controls'!C44,\" \")","v":148.1},{"$f":"IFERROR('HB comp controls'!D44,\" \")","v":22.849609494455528},{"$f":"IFERROR('HB comp controls'!E44,\" \")","v":1.2609671641364582},{"$f":"IFERROR('HB comp controls'!F44,\" \")","v":3.9930460725943315},{"$f":"IFERROR('HB comp controls'!G44,\" \")","v":48.882279474435734},{"$f":"IFERROR('HB comp controls'!H44,\" \")","v":94.314415067277295},{"$f":"IFERROR('HB comp controls'!I44,\" \")","v":""},{"$f":"IFERROR('HB comp controls'!J44,\" \")","v":""},{"$f":"IFERROR('HB comp controls'!K44,\" \")","v":""},{"$f":"IFERROR('HB comp controls'!L44,\" \")","v":""},{"$f":"IFERROR('HB comp controls'!M44,\" \")","v":""}]
["England",{"$f":"IFERROR('HB comp controls'!C45,\" \")","v":131.45440222442679},{"$f":"IFERROR('HB comp controls'!D45,\" \")","v":"n/a"},{"$f":"IFERROR('HB comp controls'!E45,\" \")","v":"n/a"},{"$f":"IFERROR('HB comp controls'!F45,\" \")","v":3.3777996839000002},{"$f":"IFERROR('HB comp controls'!G45,\" \")","v":"n/a"},{"$f":"IFERROR('HB comp controls'!H45,\" \")","v":74.975891048186597},{"$f":"IFERROR('HB comp controls'!I45,\" \")","v":""},{"$f":"IFERROR('HB comp controls'!J45,\" \")","v":""},{"$f":"IFERROR('HB comp controls'!K45,\" \")","v":""},{"$f":"IFERROR('HB comp controls'!L45,\" \")","v":""},{"$f":"IFERROR('HB comp controls'!M45,\" \")","v":""}]
[]
[{"$f":"'HB comp controls'!B65","v":"Source: (1) WHS (WG); (2) SSW, (3) PEDW (NWIS) & MYE (ONS), (4) StatsWales, England data from HSCIC; (5) ADDE (ONS) & MYE (ONS), England data from Mortality statistics & MYE (ONS)"}]

{"sheet":"HB comp controls","index":3,"n_rows":131,"n_cols":13,"rows_kept":131,"cut":false,"hidden":true,"merged":[]}
[]
[null,"Measure","Programme budget","Expenditure"]
["Current selection (list number)",1,1,1,{"$f":"IF(D3=1,2,3)","v":2}]
["Current selection",{"$f":"INDEX(H21:H30,B3,1)","v":"Smoking"},{"$f":"INDEX(A11:C16,C3, 2)","v":"Circulatory"},{"$f":"C4&\" \"&B4","v":"Circulatory Smoking"}]
[null,null,{"$f":"INDEX(A11:C16,C3,1)","v":"Circulatory system"}]
[null,null,{"$f":"INDEX(A11:C16,C3,3)","v":"problems of the circulatory system"}]
[]
[]
["Values for list boxes:"]
["Programme budget line:"]
["Circulatory system","Circulatory","problems of the circulatory system"]
["Respiratory system","Respiratory","problems of the respiratory system"]
["Cancers & tumours","Cancers","cancers & tumours"]
["Musculoskeletal (excl. Trauma)","Musculoskeletal","musculoskeletal (excl. trauma)"]
["Healthy Individuals","Healthy Individuals","healthy individuals"]
["Mental health disorders","Mental health problems","mental health disorders"]
[]
[]
["Measure:"]
["Circulatory","Respiratory","Cancers & tumours","Musculoskeletal system problems (exc Trauma)","Healthy Individuals","Mental health disorders",null,"Measures chosen"]
["Smoking","Smoking","Smoking","Overweight or obese","Deprivation","Benefit claimants",null,{"$f":"IF(INDEX(A21:F29,,$C$3)=0,\"\",INDEX('HB comp controls'!A21:F29,,'HB comp controls'!$C$3))","v":"Smoking"}]
["Smoking cessation","Smoking cessation","Healthy eating","Physical activity","Childhood vaccinations","QOF register",null,{"$f":"IF(INDEX(A22:F30,,$C$3)=0,\"\",INDEX('HB comp controls'!A22:F30,,'HB comp controls'!$C$3))","v":"Smoking cessation"}]
["QOF register","QOF register","HPV vaccination","Currently being treated","Flu vaccination, 65+","Dementia",null,{"$f":"IF(INDEX(A23:F31,,$C$3)=0,\"\",INDEX('HB comp controls'!A23:F31,,'HB comp controls'!$C$3))","v":"QOF register"}]
["Elective admissions","Flu immunisation","Incidence","Hip replacements","Flu vaccination, at risk","Care & treatment plan",null,{"$f":"IF(INDEX(A24:F32,,$C$3)=0,\"\",INDEX('HB comp controls'!A24:F32,,'HB comp controls'!$C$3))","v":"Elective admissions"}]
["Mortality","Emergency admissions","Treatment","Knee replacements","General health","Emergency admissions",null,{"$f":"IF(INDEX(A25:F33,,$C$3)=0,\"\",INDEX('HB comp controls'!A25:F33,,'HB comp controls'!$C$3))","v":"Mortality"}]
[null,"Mortality","Survival","Hip revisions","Bowel screening","No mental health problems",null,{"$f":"IF(INDEX(A26:F34,,$C$3)=0,\"\",INDEX('HB comp controls'!A26:F34,,'HB comp controls'!$C$3))","v":""}]
[null,"Currently being treated","Mortality","Knee revisions","HLE males","Currently being treated",null,{"$f":"IF(INDEX(A27:F34,,$C$3)=0,\"\",INDEX('HB comp controls'!A27:F34,,'HB comp controls'!$C$3))","v":""}]
[null,null,null,null,"HLE females",null,null,{"$f":"IF(INDEX(A28:F34,,$C$3)=0,\"\",INDEX('HB comp controls'!A28:F34,,'HB comp controls'!$C$3))","v":""}]
[null,null,null,null,"DFLE males",null,null,{"$f":"IF(INDEX(A29:F34,,$C$3)=0,\"\",INDEX('HB comp controls'!A29:F34,,'HB comp controls'!$C$3))","v":""}]
[null,null,null,null,"DFLE females",null,null,{"$f":"IF(INDEX(A30:F34,,$C$3)=0,\"\",INDEX('HB comp controls'!A30:F34,,'HB comp controls'!$C$3))","v":""}]
["Expenditure:"]
["Crude"]
["Age-adjusted"]
[]
[]
["Health Board table",null,"Expenditure",4,5,6,7,8,9,10,11,12,13]
["Betsi Cadwaladr University",{"$f":"A37 & \"_\" & $C$4","v":"Betsi Cadwaladr University_Circulatory"},{"$f":"VLOOKUP($B37,'Table data'!$A$3:$M$56,$E$3,FALSE)","v":172.2},{"$f":"IF(VLOOKUP($B37,'Table data'!$A$3:$M$56,4,FALSE)>0,VLOOKUP($B37,'Table data'!$A$3:$M$56,4,FALSE),\"\")","v":22.364305427236104},{"$f":"IF(VLOOKUP($B37,'Table data'!$A$3:$M$56,5,FALSE)>0,VLOOKUP($B37,'Table data'!$A$3:$M$56,5,FALSE),\"\")","v":1.0568230395338896},{"$f":"IF(VLOOKUP($B37,'Table data'!$A$3:$M$56,6,FALSE)>0,VLOOKUP($B37,'Table data'!$A$3:$M$56,6,FALSE),\"\")","v":4.2424645459060297},{"$f":"IF(VLOOKUP($B37,'Table data'!$A$3:$M$56,7,FALSE)>0,VLOOKUP($B37,'Table data'!$A$3:$M$56,7,FALSE),\"\")","v":64.208950105954486},{"$f":"IF(VLOOKUP($B37,'Table data'!$A$3:$M$56,8,FALSE)>0,VLOOKUP($B37,'Table data'!$A$3:$M$56,8,FALSE),\"\")","v":98.209786599879706},{"$f":"IF(VLOOKUP($B37,'Table data'!$A$3:$M$56,9,FALSE)>0,VLOOKUP($B37,'Table data'!$A$3:$M$56,9,FALSE),\"\")","v":""},{"$f":"IF(VLOOKUP($B37,'Table data'!$A$3:$M$56,10,FALSE)>0,VLOOKUP($B37,'Table data'!$A$3:$M$56,10,FALSE),\"\")","v":""},{"$f":"IF(VLOOKUP($B37,'Table data'!$A$3:$M$56,11,FALSE)>0,VLOOKUP($B37,'Table data'!$A$3:$M$56,11,FALSE),\"\")","v":""},{"$f":"IF(VLOOKUP($B37,'Table data'!$A$3:$M$56,12,FALSE)>0,VLOOKUP($B37,'Table data'!$A$3:$M$56,12,FALSE),\"\")","v":""},{"$f":"IF(VLOOKUP($B37,'Table data'!$A$3:$M$56,13,FALSE)>0,VLOOKUP($B37,'Table data'!$A$3:$M$56,13,FALSE),\"\")","v":""}]
["Powys Teaching",{"$f":"A38 & \"_\" & $C$4","v":"Powys Teaching_Circulatory"},{"$f":"VLOOKUP($B38,'Table data'!$A$3:$M$56,$E$3,FALSE)","v":183.4},{"$f":"IF(VLOOKUP($B38,'Table data'!$A$3:$M$56,4,FALSE)>0,VLOOKUP($B38,'Table data'!$A$3:$M$56,4,FALSE),\"\")","v":19.882034336099096},{"$f":"IF(VLOOKUP($B38,'Table data'!$A$3:$M$56,5,FALSE)>0,VLOOKUP($B38,'Table data'!$A$3:$M$56,5,FALSE),\"\")","v":1.3288203585307758},{"$f":"IF(VLOOKUP($B38,'Table data'!$A$3:$M$56,6,FALSE)>0,VLOOKUP($B38,'Table data'!$A$3:$M$56,6,FALSE),\"\")","v":4.1596078290019101},{"$f":"IF(VLOOKUP($B38,'Table data'!$A$3:$M$56,7,FALSE)>0,VLOOKUP($B38,'Table data'!$A$3:$M$56,7,FALSE),\"\")","v":73.927611085633231},{"$f":"IF(VLOOKUP($B38,'Table data'!$A$3:$M$56,8,FALSE)>0,VLOOKUP($B38,'Table data'!$A$3:$M$56,8,FALSE),\"\")","v":81.9961156788887},{"$f":"IF(VLOOKUP($B38,'Table data'!$A$3:$M$56,9,FALSE)>0,VLOOKUP($B38,'Table data'!$A$3:$M$56,9,FALSE),\"\")","v":""},{"$f":"IF(VLOOKUP($B38,'Table data'!$A$3:$M$56,10,FALSE)>0,VLOOKUP($B38,'Table data'!$A$3:$M$56,10,FALSE),\"\")","v":""},{"$f":"IF(VLOOKUP($B38,'Table data'!$A$3:$M$56,11,FALSE)>0,VLOOKUP($B38,'Table data'!$A$3:$M$56,11,FALSE),\"\")","v":""},{"$f":"IF(VLOOKUP($B38,'Table data'!$A$3:$M$56,12,FALSE)>0,VLOOKUP($B38,'Table data'!$A$3:$M$56,12,FALSE),\"\")","v":""},{"$f":"IF(VLOOKUP($B38,'Table data'!$A$3:$M$56,13,FALSE)>0,VLOOKUP($B38,'Table data'!$A$3:$M$56,13,FALSE),\"\")","v":""}]
["Hywel Dda",{"$f":"A39 & \"_\" & $C$4","v":"Hywel Dda_Circulatory"},{"$f":"VLOOKUP($B39,'Table data'!$A$3:$M$56,$E$3,FALSE)","v":157.5},{"$f":"IF(VLOOKUP($B39,'Table data'!$A$3:$M$56,4,FALSE)>0,VLOOKUP($B39,'Table data'!$A$3:$M$56,4,FALSE),\"\")","v":22.103846860627598},{"$f":"IF(VLOOKUP($B39,'Table data'!$A$3:$M$56,5,FALSE)>0,VLOOKUP($B39,'Table data'!$A$3:$M$56,5,FALSE),\"\")","v":1.491075474732118},{"$f":"IF(VLOOKUP($B39,'Table data'!$A$3:$M$56,6,FALSE)>0,VLOOKUP($B39,'Table data'!$A$3:$M$56,6,FALSE),\"\")","v":4.3216513125713352},{"$f":"IF(VLOOKUP($B39,'Table data'!$A$3:$M$56,7,FALSE)>0,VLOOKUP($B39,'Table data'!$A$3:$M$56,7,FALSE),\"\")","v":50.03886556370842},{"$f":"IF(VLOOKUP($B39,'Table data'!$A$3:$M$56,8,FALSE)>0,VLOOKUP($B39,'Table data'!$A$3:$M$56,8,FALSE),\"\")","v":98.449947328307303},{"$f":"IF(VLOOKUP($B39,'Table data'!$A$3:$M$56,9,FALSE)>0,VLOOKUP($B39,'Table data'!$A$3:$M$56,9,FALSE),\"\")","v":""},{"$f":"IF(VLOOKUP($B39,'Table data'!$A$3:$M$56,10,FALSE)>0,VLOOKUP($B39,'Table data'!$A$3:$M$56,10,FALSE),\"\")","v":""},{"$f":"IF(VLOOKUP($B39,'Table data'!$A$3:$M$56,11,FALSE)>0,VLOOKUP($B39,'Table data'!$A$3:$M$56,11,FALSE),\"\")","v":""},{"$f":"IF(VLOOKUP($B39,'Table data'!$A$3:$M$56,12,FALSE)>0,VLOOKUP($B39,'Table data'!$A$3:$M$56,12,FALSE),\"\")","v":""},{"$f":"IF(VLOOKUP($B39,'Table data'!$A$3:$M$56,13,FALSE)>0,VLOOKUP($B39,'Table data'!$A$3:$M$56,13,FALSE),\"\")","v":""}]
["Abertawe Bro Morgannwg University","Abertawe Bro Morgannwg University_Circulatory",{"$f":"VLOOKUP($B40,'Table data'!$A$3:$M$56,$E$3,FALSE)","v":150.80000000000001},{"$f":"IF(VLOOKUP($B40,'Table data'!$A$3:$M$56,4,FALSE)>0,VLOOKUP($B40,'Table data'!$A$3:$M$56,4,FALSE),\"\")","v":23.343784242752104},{"$f":"IF(VLOOKUP($B40,'Table data'!$A$3:$M$56,5,FALSE)>0,VLOOKUP($B40,'Table data'!$A$3:$M$56,5,FALSE),\"\")","v":2.2796829207626339},{"$f":"IF(VLOOKUP($B40,'Table data'!$A$3:$M$56,6,FALSE)>0,VLOOKUP($B40,'Table data'!$A$3:$M$56,6,FALSE),\"\")","v":4.1523782906168352},{"$f":"IF(VLOOKUP($B40,'Table data'!$A$3:$M$56,7,FALSE)>0,VLOOKUP($B40,'Table data'!$A$3:$M$56,7,FALSE),\"\")","v":50.959631952465266},{"$f":"IF(VLOOKUP($B40,'Table data'!$A$3:$M$56,8,FALSE)>0,VLOOKUP($B40,'Table data'!$A$3:$M$56,8,FALSE),\"\")","v":102.10087566515701},{"$f":"IF(VLOOKUP($B40,'Table data'!$A$3:$M$56,9,FALSE)>0,VLOOKUP($B40,'Table data'!$A$3:$M$56,9,FALSE),\"\")","v":""},{"$f":"IF(VLOOKUP($B40,'Table data'!$A$3:$M$56,10,FALSE)>0,VLOOKUP($B40,'Table data'!$A$3:$M$56,10,FALSE),\"\")","v":""},{"$f":"IF(VLOOKUP($B40,'Table data'!$A$3:$M$56,11,FALSE)>0,VLOOKUP($B40,'Table data'!$A$3:$M$56,11,FALSE),\"\")","v":""},{"$f":"IF(VLOOKUP($B40,'Table data'!$A$3:$M$56,12,FALSE)>0,VLOOKUP($B40,'Table data'!$A$3:$M$56,12,FALSE),\"\")","v":""},{"$f":"IF(VLOOKUP($B40,'Table data'!$A$3:$M$56,13,FALSE)>0,VLOOKUP($B40,'Table data'!$A$3:$M$56,13,FALSE),\"\")","v":""}]
["Cardiff and Vale University","Cardiff and Vale University_Circulatory",{"$f":"VLOOKUP($B41,'Table data'!$A$3:$M$56,$E$3,FALSE)","v":104.4},{"$f":"IF(VLOOKUP($B41,'Table data'!$A$3:$M$56,4,FALSE)>0,VLOOKUP($B41,'Table data'!$A$3:$M$56,4,FALSE),\"\")","v":21.220607242497422},{"$f":"IF(VLOOKUP($B41,'Table data'!$A$3:$M$56,5,FALSE)>0,VLOOKUP($B41,'Table data'!$A$3:$M$56,5,FALSE),\"\")","v":0.56424971666947987},{"$f":"IF(VLOOKUP($B41,'Table data'!$A$3:$M$56,6,FALSE)>0,VLOOKUP($B41,'Table data'!$A$3:$M$56,6,FALSE),\"\")","v":3.0215706571916181},{"$f":"IF(VLOOKUP($B41,'Table data'!$A$3:$M$56,7,FALSE)>0,VLOOKUP($B41,'Table data'!$A$3:$M$56,7,FALSE),\"\")","v":30.560431293881646},{"$f":"IF(VLOOKUP($B41,'Table data'!$A$3:$M$56,8,FALSE)>0,VLOOKUP($B41,'Table data'!$A$3:$M$56,8,FALSE),\"\")","v":67.192754227927594},{"$f":"IF(VLOOKUP($B41,'Table data'!$A$3:$M$56,9,FALSE)>0,VLOOKUP($B41,'Table data'!$A$3:$M$56,9,FALSE),\"\")","v":""},{"$f":"IF(VLOOKUP($B41,'Table data'!$A$3:$M$56,10,FALSE)>0,VLOOKUP($B41,'Table data'!$A$3:$M$56,10,FALSE),\"\")","v":""},{"$f":"IF(VLOOKUP($B41,'Table data'!$A$3:$M$56,11,FALSE)>0,VLOOKUP($B41,'Table data'!$A$3:$M$56,11,FALSE),\"\")","v":""},{"$f":"IF(VLOOKUP($B41,'Table data'!$A$3:$M$56,12,FALSE)>0,VLOOKUP($B41,'Table data'!$A$3:$M$56,12,FALSE),\"\")","v":""},{"$f":"IF(VLOOKUP($B41,'Table data'!$A$3:$M$56,13,FALSE)>0,VLOOKUP($B41,'Table data'!$A$3:$M$56,13,FALSE),\"\")","v":""}]
["Cwm Taf","Cwm Taf_Circulatory",{"$f":"VLOOKUP($B42,'Table data'!$A$3:$M$56,$E$3,FALSE)","v":154.6},{"$f":"IF(VLOOKUP($B42,'Table data'!$A$3:$M$56,4,FALSE)>0,VLOOKUP($B42,'Table data'!$A$3:$M$56,4,FALSE),\"\")","v":26.268038351461513},{"$f":"IF(VLOOKUP($B42,'Table data'!$A$3:$M$56,5,FALSE)>0,VLOOKUP($B42,'Table data'!$A$3:$M$56,5,FALSE),\"\")","v":1.1223215459445248},{"$f":"IF(VLOOKUP($B42,'Table data'!$A$3:$M$56,6,FALSE)>0,VLOOKUP($B42,'Table data'!$A$3:$M$56,6,FALSE),\"\")","v":4.0810430134710538},{"$f":"IF(VLOOKUP($B42,'Table data'!$A$3:$M$56,7,FALSE)>0,VLOOKUP($B42,'Table data'!$A$3:$M$56,7,FALSE),\"\")","v":39.928333759918097},{"$f":"IF(VLOOKUP($B42,'Table data'!$A$3:$M$56,8,FALSE)>0,VLOOKUP($B42,'Table data'!$A$3:$M$56,8,FALSE),\"\")","v":110.871027429492},{"$f":"IF(VLOOKUP($B42,'Table data'!$A$3:$M$56,9,FALSE)>0,VLOOKUP($B42,'Table data'!$A$3:$M$56,9,FALSE),\"\")","v":""},{"$f":"IF(VLOOKUP($B42,'Table data'!$A$3:$M$56,10,FALSE)>0,VLOOKUP($B42,'Table data'!$A$3:$M$56,10,FALSE),\"\")","v":""},{"$f":"IF(VLOOKUP($B42,'Table data'!$A$3:$M$56,11,FALSE)>0,VLOOKUP($B42,'Table data'!$A$3:$M$56,11,FALSE),\"\")","v":""},{"$f":"IF(VLOOKUP($B42,'Table data'!$A$3:$M$56,12,FALSE)>0,VLOOKUP($B42,'Table data'!$A$3:$M$56,12,FALSE),\"\")","v":""},{"$f":"IF(VLOOKUP($B42,'Table data'!$A$3:$M$56,13,FALSE)>0,VLOOKUP($B42,'Table data'!$A$3:$M$56,13,FALSE),\"\")","v":""}]
["Aneurin Bevan","Aneurin Bevan_Circulatory",{"$f":"VLOOKUP($B43,'Table data'!$A$3:$M$56,$E$3,FALSE)","v":135.1},{"$f":"IF(VLOOKUP($B43,'Table data'!$A$3:$M$56,4,FALSE)>0,VLOOKUP($B43,'Table data'!$A$3:$M$56,4,FALSE),\"\")","v":23.799081531332941},{"$f":"IF(VLOOKUP($B43,'Table data'!$A$3:$M$56,5,FALSE)>0,VLOOKUP($B43,'Table data'!$A$3:$M$56,5,FALSE),\"\")","v":1.0748388693723283},{"$f":"IF(VLOOKUP($B43,'Table data'!$A$3:$M$56,6,FALSE)>0,VLOOKUP($B43,'Table data'!$A$3:$M$56,6,FALSE),\"\")","v":4.0670503779767966},{"$f":"IF(VLOOKUP($B43,'Table data'!$A$3:$M$56,7,FALSE)>0,VLOOKUP($B43,'Table data'!$A$3:$M$56,7,FALSE),\"\")","v":40.014544417014186},{"$f":"IF(VLOOKUP($B43,'Table data'!$A$3:$M$56,8,FALSE)>0,VLOOKUP($B43,'Table data'!$A$3:$M$56,8,FALSE),\"\")","v":96.688756748988695},{"$f":"IF(VLOOKUP($B43,'Table data'!$A$3:$M$56,9,FALSE)>0,VLOOKUP($B43,'Table data'!$A$3:$M$56,9,FALSE),\"\")","v":""},{"$f":"IF(VLOOKUP($B43,'Table data'!$A$3:$M$56,10,FALSE)>0,VLOOKUP($B43,'Table data'!$A$3:$M$56,10,FALSE),\"\")","v":""},{"$f":"IF(VLOOKUP($B43,'Table data'!$A$3:$M$56,11,FALSE)>0,VLOOKUP($B43,'Table data'!$A$3:$M$56,11,FALSE),\"\")","v":""},{"$f":"IF(VLOOKUP($B43,'Table data'!$A$3:$M$56,12,FALSE)>0,VLOOKUP($B43,'Table data'!$A$3:$M$56,12,FALSE),\"\")","v":""},{"$f":"IF(VLOOKUP($B43,'Table data'!$A$3:$M$56,13,FALSE)>0,VLOOKUP($B43,'Table data'!$A$3:$M$56,13,FALSE),\"\")","v":""}]
["Wales","Wales_Circulatory",{"$f":"VLOOKUP($B44,'Table data'!$A$3:$M$56,$E$3,FALSE)","v":148.1},{"$f":"IF(VLOOKUP($B44,'Table data'!$A$3:$M$56,4,FALSE)>0,VLOOKUP($B44,'Table data'!$A$3:$M$56,4,FALSE),\"\")","v":22.849609494455528},{"$f":"IF(VLOOKUP($B44,'Table data'!$A$3:$M$56,5,FALSE)>0,VLOOKUP($B44,'Table data'!$A$3:$M$56,5,FALSE),\"\")","v":1.2609671641364582},{"$f":"IF(VLOOKUP($B44,'Table data'!$A$3:$M$56,6,FALSE)>0,VLOOKUP($B44,'Table data'!$A$3:$M$56,6,FALSE),\"\")","v":3.9930460725943315},{"$f":"IF(VLOOKUP($B44,'Table data'!$A$3:$M$56,7,FALSE)>0,VLOOKUP($B44,'Table data'!$A$3:$M$56,7,FALSE),\"\")","v":48.882279474435734},{"$f":"IF(VLOOKUP($B44,'Table data'!$A$3:$M$56,8,FALSE)>0,VLOOKUP($B44,'Table data'!$A$3:$M$56,8,FALSE),\"\")","v":94.314415067277295},{"$f":"IF(VLOOKUP($B44,'Table data'!$A$3:$M$56,9,FALSE)>0,VLOOKUP($B44,'Table data'!$A$3:$M$56,9,FALSE),\"\")","v":""},{"$f":"IF(VLOOKUP($B44,'Table data'!$A$3:$M$56,10,FALSE)>0,VLOOKUP($B44,'Table data'!$A$3:$M$56,10,FALSE),\"\")","v":""},{"$f":"IF(VLOOKUP($B44,'Table data'!$A$3:$M$56,11,FALSE)>0,VLOOKUP($B44,'Table data'!$A$3:$M$56,11,FALSE),\"\")","v":""},{"$f":"IF(VLOOKUP($B44,'Table data'!$A$3:$M$56,12,FALSE)>0,VLOOKUP($B44,'Table data'!$A$3:$M$56,12,FALSE),\"\")","v":""},{"$f":"IF(VLOOKUP($B44,'Table data'!$A$3:$M$56,13,FALSE)>0,VLOOKUP($B44,'Table data'!$A$3:$M$56,13,FALSE),\"\")","v":""}]
["England","England_Circulatory",{"$f":"VLOOKUP($B45,'Table data'!$A$3:$M$56,$E$3,FALSE)","v":131.45440222442679},{"$f":"IF(VLOOKUP($B45,'Table data'!$A$3:$M$56,4,FALSE)>0,VLOOKUP($B45,'Table data'!$A$3:$M$56,4,FALSE),\"\")","v":"n/a"},{"$f":"IF(VLOOKUP($B45,'Table data'!$A$3:$M$56,5,FALSE)>0,VLOOKUP($B45,'Table data'!$A$3:$M$56,5,FALSE),\"\")","v":"n/a"},{"$f":"IF(VLOOKUP($B45,'Table data'!$A$3:$M$56,6,FALSE)>0,VLOOKUP($B45,'Table data'!$A$3:$M$56,6,FALSE),\"\")","v":3.3777996839000002},{"$f":"IF(VLOOKUP($B45,'Table data'!$A$3:$M$56,7,FALSE)>0,VLOOKUP($B45,'Table data'!$A$3:$M$56,7,FALSE),\"\")","v":"n/a"},{"$f":"IF(VLOOKUP($B45,'Table data'!$A$3:$M$56,8,FALSE)>0,VLOOKUP($B45,'Table data'!$A$3:$M$56,8,FALSE),\"\")","v":74.975891048186597},{"$f":"IF(VLOOKUP($B45,'Table data'!$A$3:$M$56,9,FALSE)>0,VLOOKUP($B45,'Table data'!$A$3:$M$56,9,FALSE),\"\")","v":""},{"$f":"IF(VLOOKUP($B45,'Table data'!$A$3:$M$56,10,FALSE)>0,VLOOKUP($B45,'Table data'!$A$3:$M$56,10,FALSE),\"\")","v":""},{"$f":"IF(VLOOKUP($B45,'Table data'!$A$3:$M$56,11,FALSE)>0,VLOOKUP($B45,'Table data'!$A$3:$M$56,11,FALSE),\"\")","v":""},{"$f":"IF(VLOOKUP($B45,'Table data'!$A$3:$M$56,12,FALSE)>0,VLOOKUP($B45,'Table data'!$A$3:$M$56,12,FALSE),\"\")","v":""},{"$f":"IF(VLOOKUP($B45,'Table data'!$A$3:$M$56,13,FALSE)>0,VLOOKUP($B45,'Table data'!$A$3:$M$56,13,FALSE),\"\")","v":""}]
[]
[]
[]
["Health Board chart",null,null,"Exp per head","Measure"]
["Betsi Cadwaladr University",{"$f":"$B$4","v":"Smoking"},{"$f":"A50 & \"_\" & $C$4 & \"_\" & $B$50","v":"Betsi Cadwaladr University_Circulatory_Smoking"},{"$f":"VLOOKUP(C50,'Chart data'!$A$3:$D$387,$E$3,FALSE)","v":172.2},{"$f":"VLOOKUP(C50,'Chart data'!$A$3:$D$387,4,FALSE)","v":22.364305427236104}]
["Powys Teaching",{"$f":"$B$4","v":"Smoking"},{"$f":"A51 & \"_\" & $C$4 & \"_\" & $B$50","v":"Powys Teaching_Circulatory_Smoking"},{"$f":"VLOOKUP(C51,'Chart data'!$A$3:$D$387,$E$3,FALSE)","v":183.4},{"$f":"VLOOKUP(C51,'Chart data'!$A$3:$D$387,4,FALSE)","v":19.882034336099096}]
["Hywel Dda","Smoking","Hywel Dda_Circulatory_Smoking",{"$f":"VLOOKUP(C52,'Chart data'!$A$3:$D$387,$E$3,FALSE)","v":157.5},{"$f":"VLOOKUP(C52,'Chart data'!$A$3:$D$387,4,FALSE)","v":22.103846860627598}]
["Abertawe Bro Morgannwg University","Smoking","Abertawe Bro Morgannwg University_Circulatory_Smoking",{"$f":"VLOOKUP(C53,'Chart data'!$A$3:$D$387,$E$3,FALSE)","v":150.80000000000001},{"$f":"VLOOKUP(C53,'Chart data'!$A$3:$D$387,4,FALSE)","v":23.343784242752104}]
["Cardiff and Vale University","Smoking","Cardiff and Vale University_Circulatory_Smoking",{"$f":"VLOOKUP(C54,'Chart data'!$A$3:$D$387,$E$3,FALSE)","v":104.4},{"$f":"VLOOKUP(C54,'Chart data'!$A$3:$D$387,4,FALSE)","v":21.220607242497422}]
["Cwm Taf","Smoking","Cwm Taf_Circulatory_Smoking",{"$f":"VLOOKUP(C55,'Chart data'!$A$3:$D$387,$E$3,FALSE)","v":154.6},{"$f":"VLOOKUP(C55,'Chart data'!$A$3:$D$387,4,FALSE)","v":26.268038351461513}]
["Aneurin Bevan","Smoking","Aneurin Bevan_Circulatory_Smoking",{"$f":"VLOOKUP(C56,'Chart data'!$A$3:$D$387,$E$3,FALSE)","v":135.1},{"$f":"VLOOKUP(C56,'Chart data'!$A$3:$D$387,4,FALSE)","v":23.799081531332941}]
["Wales","Smoking","Wales_Circulatory_Smoking",{"$f":"VLOOKUP(C57,'Chart data'!$A$3:$D$387,$E$3,FALSE)","v":148.1},{"$f":"VLOOKUP(C57,'Chart data'!$A$3:$D$387,4,FALSE)","v":22.849609494455528}]
["England","Smoking","England_Circulatory_Smoking",{"$f":"VLOOKUP(C58,'Chart data'!$A$3:$D$387,$E$3,FALSE)","v":131.45440222442679},{"$f":"VLOOKUP(C58,'Chart data'!$A$3:$D$387,4,FALSE)","v":-10}]
[]
[]
["Check if there are data for this indicator",{"$f":"ISNUMBER(D57)","v":true}]
["Chart title",{"$f":"IF($B$61=TRUE,(IF($D$3=1,\"Expenditure per capita for \"&$C$6&\" against \"&$I$88&\"*, \"&$J$101&\", Wales health boards & England** \", \"Age-adjusted expenditure per capita for \"&$C$6&\" against \"&$I$88&\", \"&$J$101&\", Wales health boards & England* \")),\"Please select another measure\")","v":"Expenditure per capita for problems of the circulatory system against current smoker status*, observed percentage, adults, 2010-11, Wales health boards & England** "}]
["Table title",{"$f":"IF($D$3=1,\"Expenditure per capita for \"&C6&\" with selected indicators, Wales health boards & England \", \"Age-adjusted expenditure per capita for \"&C6&\" with selected indicators, Wales health boards & England \")","v":"Expenditure per capita for problems of the circulatory system with selected indicators, Wales health boards & England "}]
["Produced by statement",{"$f":"\"Produced by Public Health Wales Observatory, using \"&I115","v":"Produced by Public Health Wales Observatory, using WHS (WG)"}]
["Source",{"$f":"\"Source: \"&H131","v":"Source: (1) WHS (WG); (2) SSW, (3) PEDW (NWIS) & MYE (ONS), (4) StatsWales, England data from HSCIC; (5) ADDE (ONS) & MYE (ONS), England data from Mortality statistics & MYE (ONS)"}]
["x-axis ",{"$f":"INDEX(H101:H110,B3)","v":"Observed percentage, adults, 2010-11"}]
["y-axis",{"$f":"IF($D$3=1,\"Expenditure per capita (£), 2011/12\",\"Age-adjusted expenditure per capita (£), 2011/12\")","v":"Expenditure per capita (£), 2011/12"}]
["x-axis Wales label",{"$f":"\"Wales = \"&ROUND(E57,1)","v":"Wales = 22.8"}]
["y-axis Wales label",{"$f":"\"Wales = \"&ROUND(D57,0)","v":"Wales = 148"}]
[]
[]
["Measure for table"]
["Circulatory","Respiratory","Cancers & tumours","Musculoskeletal (excl. Trauma)","Healthy Individuals","Mental health disorders"]
["Current smoker status, adults","Current smoker status, adults","Current smoker status, adults","% of adults who are overweight or obese","Percentage of population in most deprived fifth","Out of work benefit claimants, % working age adults",null,{"$f":"IF(INDEX(A74:F83,,$C$3)=0,\"\",INDEX(A74:F83,,'HB comp controls'!$C$3))","v":"Current smoker status, adults"},null,null,null,{"$f":"IF(H74=\"\",\"\",H74&\" (1)\")","v":"Current smoker status, adults (1)"}]
["% of smokers treated by Stop Smoking Wales","% of smokers treated by Stop Smoking Wales","Adults meeting healthy eating guidelines","% of adults meeting physical activity guidelines","Uptake of scheduled vaccinations at age 4","QOF mental health register, % of list size",null,{"$f":"IF(INDEX(A75:F84,,$C$3)=0,\"\",INDEX(A75:F84,,'HB comp controls'!$C$3))","v":"% of smokers treated by Stop Smoking Wales"},null,null,null,{"$f":"IF(H75=\"\",\"\",H75&\" (2)\")","v":"% of smokers treated by Stop Smoking Wales (2)"}]
["QOF CHD register, % of list size","QOF COPD register, % of list size","HPV vaccination uptake","% of adults currently being treated for arthritis","Influenza vaccination uptake, aged 65+","People with Dementia, % on QOF register",null,{"$f":"IF(INDEX(A76:F84,,$C$3)=0,\"\",INDEX(A76:F84,,'HB comp controls'!$C$3))","v":"QOF CHD register, % of list size"},null,null,null,{"$f":"IF(H76=\"\",\"\",H76&\" (3)\")","v":"QOF CHD register, % of list size (3)"}]
["Elective hospital admissions, any mention of revascularisation","QOF COPD register: Patients having influenza immunisation","Cancer incidence, all malignancies excl NMSC","Elective hospital admissions per 100,000, hip replacement","Influenza vaccination uptake, aged under 65 at risk","In secondary care with care & treatment plan",null,{"$f":"IF(INDEX(A77:F84,,$C$3)=0,\"\",INDEX(A77:F84,,'HB comp controls'!$C$3))","v":"Elective hospital admissions, any mention of revascularisation"},null,null,null,{"$f":"IF(H77=\"\",\"\",H77&\" (4)\")","v":"Elective hospital admissions, any mention of revascularisation (4)"}]
["Mortality from circulatory disease, under 75","Emergency hospital admissions, primary diagnosis bronchitis, emphysema or COPD","% of new diagnoses via urgent suspected cancer route starting treatment within 62 days","Elective hospital admissions per 100,000, knee replacement","Adults reporting general health status as fair or poor","Emergency hospital admissions, any mention of self harm",null,{"$f":"IF(INDEX(A78:F84,,$C$3)=0,\"\",INDEX(A78:F84,,'HB comp controls'!$C$3))","v":"Mortality from circulatory disease, under 75"},null,null,null,{"$f":"IF(H78=\"\",\"\",H78&\" (5)\")","v":"Mortality from circulatory disease, under 75 (5)"}]
[null,"Mortality from bronchitis, emphysema and COPD, under 75","Survival rates, persons, all malignancies excl NMSC","Elective hospital admissions per 100,000, hip replacement revision","Bowel cancer screening","% adults free from common mental health problems",null,{"$f":"IF(INDEX(A79:F99,,$C$3)=0,\"\",INDEX(A79:F99,,'HB comp controls'!$C$3))","v":""},null,null,null,{"$f":"IF(H79=\"\",\"\",H79&\" (6)\")","v":""}]
[null,"Adults being treated for any respiratory illness","Mortality rates, persons, all malignancies excl NMSC","Elective hospital admissions per 100,000, knee replacement revision","Healthy life expectancy, males","% adults currently being treated for any mental illness",null,{"$f":"IF(INDEX(A80:F100,,$C$3)=0,\"\",INDEX(A80:F100,,'HB comp controls'!$C$3))","v":""},null,null,null,{"$f":"IF(H80=\"\",\"\",H80&\" (7)\")","v":""}]
[null,null,null,null,"Healthy life expectancy, females",null,null,{"$f":"IF(INDEX(A81:F101,,$C$3)=0,\"\",INDEX(A81:F101,,'HB comp controls'!$C$3))","v":""},null,null,null,{"$f":"IF(H81=\"\",\"\",H81&\" (8)\")","v":""}]
[null,null,null,null,"Disability-free life expectancy, males",null,null,{"$f":"IF(INDEX(A82:F102,,$C$3)=0,\"\",INDEX(A82:F102,,'HB comp controls'!$C$3))","v":""},null,null,null,{"$f":"IF(H82=\"\",\"\",H82&\" (9)\")","v":""}]
[null,null,null,null,"Disability-free life expectancy, females",null,null,{"$f":"IF(INDEX(A83:F103,,$C$3)=0,\"\",INDEX(A83:F103,,'HB comp controls'!$C$3))","v":""},null,null,null,{"$f":"IF(H83=\"\",\"\",H83&\" (10)\")","v":""}]
[]
[]
["Measure for chart heading"]
["Circulatory","Respiratory","Cancers & tumours","Musculoskeletal (excl. Trauma)","Healthy Individuals","Mental health disorders"]
["current smoker status","current smoker status","current smoker status","% of adults who are overweight or obese","percentage of population in most deprived fifth","out of work benefit claimants",null,{"$f":"IF(INDEX(A88:F97,,$C$3)=0,\"\",INDEX(A88:F97,,'HB comp controls'!$C$3))","v":"current smoker status"},{"$f":"INDEX(H88:H97,B3)","v":"current smoker status"}]
["% of smokers treated by Stop Smoking Wales","% of smokers treated by Stop Smoking Wales","adults meeting healthy eating guidelines","% of adults meeting physical activity guidelines","uptake of scheduled vaccinations","QOF mental health register",null,{"$f":"IF(INDEX(A89:F110,,$C$3)=0,\"\",INDEX(A89:F110,,'HB comp controls'!$C$3))","v":"% of smokers treated by Stop Smoking Wales"}]
["QOF CHD register","QOF COPD register","HPV vaccination uptake","% of adults currently being treated for arthritis","influenza vaccination uptake","people with dementia",null,{"$f":"IF(INDEX(A90:F111,,$C$3)=0,\"\",INDEX(A90:F111,,'HB comp controls'!$C$3))","v":"QOF CHD register"}]
["elective hospital admissions, any mention of revascularisation","QOF COPD register: Patients having influenza immunisation","cancer incidence, all malignancies excl NMSC","elective hospital admissions, hip replacement","influenza vaccination uptake","those in secondary care with care & treatment plan",null,{"$f":"IF(INDEX(A91:F112,,$C$3)=0,\"\",INDEX(A91:F112,,'HB comp controls'!$C$3))","v":"elective hospital admissions, any mention of revascularisation"}]
["mortality from circulatory disease","emergency hospital admissions, primary diagnosis bronchitis, emphysema or COPD","% of new diagnoses via urgent suspected cancer route starting treatment within 62 days","elective hospital admissions, knee replacement","adults reporting general health status as fair or poor","emergency hospital admissions, any mention of self harm",null,{"$f":"IF(INDEX(A92:F113,,$C$3)=0,\"\",INDEX(A92:F113,,'HB comp controls'!$C$3))","v":"mortality from circulatory disease"}]
[null,"mortality from bronchitis, emphysema and COPD","survival rates, all malignancies excl NMSC","elective hospital admissions, hip replacement revision","bowel cancer screening","% adults free from common mental health problems",null,{"$f":"IF(INDEX(A93:F114,,$C$3)=0,\"\",INDEX(A93:F114,,'HB comp controls'!$C$3))","v":""}]
[null,"adults being treated for any respiratory illness","mortality rates, all malignancies excl NMSC","elective hospital admissions, knee replacement revision","healthy life expectancy","% adults currently being treated for any mental illness",null,{"$f":"IF(INDEX(A94:F115,,$C$3)=0,\"\",INDEX(A94:F115,,'HB comp controls'!$C$3))","v":""}]
[null,null,null,null,"healthy life expectancy",null,null,{"$f":"IF(INDEX(A95:F116,,$C$3)=0,\"\",INDEX(A95:F116,,'HB comp controls'!$C$3))","v":""}]
[null,null,null,null,"disability-free life expectancy",null,null,{"$f":"IF(INDEX(A96:F117,,$C$3)=0,\"\",INDEX(A96:F117,,'HB comp controls'!$C$3))","v":""}]
[null,null,null,null,"disability-free life expectancy",null,null,{"$f":"IF(INDEX(A97:F118,,$C$3)=0,\"\",INDEX(A97:F118,,'HB comp controls'!$C$3))","v":""}]
[]
["Chart axis",null,null,null,null,null,null,null,"Chart x-axis","Chart title"]
["Circulatory","Respiratory","Cancers & tumours","Musculoskeletal (excl. Trauma)","Healthy Individuals","Mental health disorders",null,{"$f":"IF($D$3=1,\"Expenditure per capita (£)\",\"Age-adjusted expenditure per capita (£)\")","v":"Expenditure per capita (£)"}]
["Observed percentage, adults, 2010-11","Observed percentage, adults, 2010-11","Observed percentage, adults, 2010-11","Observed percentage, adults, 2010-11","Percentage of population in most deprived fifth","Percentage, residents aged 16-64, 2012",null,{"$f":"IF(INDEX(A101:F110,,$C$3)=0,\"\",INDEX(A101:F110,,'HB comp controls'!$C$3))","v":"Observed percentage, adults, 2010-11"},{"$f":"INDEX(H101:H110,B3)","v":"Observed percentage, adults, 2010-11"},{"$f":"LOWER(I101)","v":"observed percentage, adults, 2010-11"}]
["Percentage, adults, 2011/12","Percentage, adults, 2011/12","Observed percentage, adults, 2010-11","Observed percentage, adults, 2010-11","Percentage, resident children aged 4, 2011-12","Percentage, registered population, 2011/12",null,{"$f":"IF(INDEX(A102:F111,,$C$3)=0,\"\",INDEX(A102:F111,,'HB comp controls'!$C$3))","v":"Percentage, adults, 2011/12"}]
["Crude percentage, registered population, 2011-12","Crude percentage, registered population, 2011-12","Percentage, female residents aged 14, 2011-12","Observed percentage, adults, 2010-11","Percentage, registered population aged 65+, 2011-12","Percentage, registered population, 2012",null,{"$f":"IF(INDEX(A103:F112,,$C$3)=0,\"\",INDEX(A103:F112,,'HB comp controls'!$C$3))","v":"Crude percentage, registered population, 2011-12"}]
["Crude rate per 100,000, all ages, 2009/11","Crude percentage, registered population, 2011-12","Crude rate per 100,000, all ages, 2005-09","Crude rate per 100,000, all ages, 2009/11","Percentage, registered population aged under 65, 2011-12","Crude rate per 100,000, all ages, as at May 2013",null,{"$f":"IF(INDEX(A104:F113,,$C$3)=0,\"\",INDEX(A104:F113,,'HB comp controls'!$C$3))","v":"Crude rate per 100,000, all ages, 2009/11"}]
["Crude rate per 100,000, under 75, 2009/11","Crude rate per 100,000, all ages, 2009/11","Percentage, all ages, Q3 2009/10 - Q3 2012/13","Crude rate per 100,000, all ages, 2009/11","Observed percentage, adults, 2010-11","Crude rate per 100,000, all ages, 2009/11",null,{"$f":"IF(INDEX(A105:F114,,$C$3)=0,\"\",INDEX(A105:F114,,'HB comp controls'!$C$3))","v":"Crude rate per 100,000, under 75, 2009/11"}]
[null,"Crude rate per 100,000, under 75, 2009/11","Relative survival, adults, 2005-09","Crude rate per 100,000, all ages, 2009/11","Percentage, eligible residents aged 60-69, October 2008 - November 2010","Age-standardised percentage, adults, 2009-10",null,{"$f":"IF(INDEX(A106:F115,,$C$3)=0,\"\",INDEX(A106:F115,,'HB comp controls'!$C$3))","v":""}]
[null,"Observed percentage, adults, 2010-11","Crude rate per 100,000, all ages, 2005-09","Crude rate per 100,000, all ages, 2009/11","Years of healthy life expectancy, males, 2005-09","Observed percentage, adults, 2010-11",null,{"$f":"IF(INDEX(A107:F116,,$C$3)=0,\"\",INDEX(A107:F116,,'HB comp controls'!$C$3))","v":""}]
[null,null,null,null,"Years of healthy life expectancy, females, 2005-09",null,null,{"$f":"IF(INDEX(A108:F117,,$C$3)=0,\"\",INDEX(A108:F117,,'HB comp controls'!$C$3))","v":""}]
[null,null,null,null,"Years of disability-free life expectancy, males, 2005-09",null,null,{"$f":"IF(INDEX(A109:F118,,$C$3)=0,\"\",INDEX(A109:F118,,'HB comp controls'!$C$3))","v":""}]
[null,null,null,null,"Years of disability-free life expectancy, females, 2005-09",null,null,{"$f":"IF(INDEX(A110:F119,,$C$3)=0,\"\",INDEX(A110:F119,,'HB comp controls'!$C$3))","v":""}]
[]
[]
["Measure source"]
["Circulatory","Respiratory","Cancers & tumours","Musculoskeletal (excl. Trauma)","Healthy Individuals","Mental health disorders"]
["WHS (WG)","WHS (WG)","WHS (WG)","WHS (WG)","WIMD (WG) & MYE (ONS)","WPSL (DWP) & MYE (ONS)",null,{"$f":"IF(INDEX(A115:F124,,$C$3)=0,\"\",INDEX(A115:F124,,'HB comp controls'!$C$3))","v":"WHS (WG)"},{"$f":"INDEX(H115:H124,B3)","v":"WHS (WG)"}]
["SSW, MYE (ONS) & WHS (WG)","SSW, MYE (ONS) & WHS (WG)","WHS (WG)","WHS (WG)","CDSC & VPDP (PHW)","StatsWales; England data from HSCIC",null,{"$f":"IF(INDEX(A116:F125,,$C$3)=0,\"\",INDEX(A116:F125,,'HB comp controls'!$C$3))","v":"SSW, MYE (ONS) & WHS (WG)"}]
["StatsWales; England data from HSCIC","StatsWales; England data from HSCIC","CDSC & VPDP (PHW)","WHS (WG)","CDSC & VPDP (PHW); England data from HPA (DH)","Mapping the Dementia Gap (Alzheimer's society)",null,{"$f":"IF(INDEX(A117:F126,,$C$3)=0,\"\",INDEX(A117:F126,,'HB comp controls'!$C$3))","v":"StatsWales; England data from HSCIC"}]
["PEDW (NWIS) & MYE (ONS)","StatsWales; England data from HSCIC","Cancer registrations (WCISU) & MYE (ONS); England data from Cancer statistics registrations & MYE (ONS)","PEDW (NWIS) & MYE (ONS)","CDSC & VPDP (PHW); England data from HPA (DH)","WG",null,{"$f":"IF(INDEX(A118:F127,,$C$3)=0,\"\",INDEX(A118:F127,,'HB comp controls'!$C$3))","v":"PEDW (NWIS) & MYE (ONS)"}]
["ADDE & MYE (ONS); England data from Mortality statistics & MYE (ONS)","PEDW (NWIS) & MYE (ONS)","StatsWales; England data from NHS England","PEDW (NWIS) & MYE (ONS)","WHS (WG)","PEDW (NWIS) & MYE (ONS)",null,{"$f":"IF(INDEX(A119:F128,,$C$3)=0,\"\",INDEX(A119:F128,,'HB comp controls'!$C$3))","v":"ADDE & MYE (ONS); England data from Mortality statistics & MYE (ONS)"}]
[null,"ADDE & MYE (ONS); England data from Mortality statistics & MYE (ONS)","Cancer registrations (WCISU)","PEDW (NWIS) & MYE (ONS)","Bowel Screening Wales (PHW)","WHS (WG)",null,{"$f":"IF(INDEX(A120:F129,,$C$3)=0,\"\",INDEX(A120:F129,,'HB comp controls'!$C$3))","v":""}]
[null,"WHS (WG)","Cancer registrations (WCISU) & MYE (ONS); England data from Mortality Statistics & MYE (ONS)","PEDW (NWIS) & MYE (ONS)","ADDE, MYE (ONS) & WHS (WG)","WHS (WG)",null,{"$f":"IF(INDEX(A121:F130,,$C$3)=0,\"\",INDEX(A121:F130,,'HB comp controls'!$C$3))","v":""}]
[null,null,null,null,"ADDE, MYE (ONS) & WHS (WG)",null,null,{"$f":"IF(INDEX(A122:F131,,$C$3)=0,\"\",INDEX(A122:F131,,'HB comp controls'!$C$3))","v":""}]
[null,null,null,null,"ADDE, MYE (ONS) & WHS (WG)",null,null,{"$f":"IF(INDEX(A123:F132,,$C$3)=0,\"\",INDEX(A123:F132,,'HB comp controls'!$C$3))","v":""}]
[null,null,null,null,"ADDE, MYE (ONS) & WHS (WG)",null,null,{"$f":"IF(INDEX(A124:F133,,$C$3)=0,\"\",INDEX(A124:F133,,'HB comp controls'!$C$3))","v":""}]
[]
["All sources"]
["Circulatory","Respiratory","Cancers & tumours","Musculoskeletal (excl. Trauma)","Healthy Individuals","Mental health disorders"]
["WHS (WG), SSW, PEDW (NWIS), StatsWales, ADDE (ONS) & MYE (ONS); England data from HSCIC, Mortality statistics & MYE (ONS)","WHS (WG), SSW, PEDW (NWIS), StatsWales, ADDE (ONS) & MYE (ONS); England data from HSCIC, Mortality statistics & MYE (ONS)","WHS (WG), CDSC & VPDP (PHW), Cancer registrations (WCISU), MYE (ONS), StatsWales; England data from NHS England, Mortality Statistics & MYE (ONS)","WHS (WG), PEDW (NWIS) & MYE (ONS)","WIMD (WG), MYE (ONS), CDSC & VPDP (PHW), ADDE (ONS), WHS (WG), Bowel Screening Wales (PHW); England data from HPA (DH)","WPSL (DWP), StatsWales, Mapping the Gap (Alzheimer's society), WG, WHS (WG), PEDW (NWIS) & MYE (ONS); England data from Mapping the Gap (Alzheimer's society) & HSCIC",null,{"$f":"INDEX(A128:F128,C3)","v":"WHS (WG), SSW, PEDW (NWIS), StatsWales, ADDE (ONS) & MYE (ONS); England data from HSCIC, Mortality statistics & MYE (ONS)"}]
["WHS (WG), SSW, PEDW (NWIS), StatsWales, ADDE (ONS) & MYE (ONS); England data from HSCIC, Mortality statistics & MYE (ONS)","WHS (WG), SSW, PEDW (NWIS), StatsWales, ADDE (ONS) & MYE (ONS); England data from HSCIC, Mortality statistics & MYE (ONS)","WHS (WG), CDSC & VPDP (PHW), Cancer registrations (WCISU), MYE (ONS), StatsWales; England data from NHS England, Mortality Statistics & MYE (ONS)","WHS (WG), PEDW (NWIS) & MYE (ONS)","WIMD (WG), MYE (ONS), CDSC & VPDP (PHW), ADDE (ONS), WHS (WG), Bowel Screening Wales (PHW); England data from HPA (DH)","WPSL (DWP), StatsWales, Mapping the Gap (Alzheimer's society), WG, WHS (WG), PEDW (NWIS) & MYE (ONS); England data from Mapping the Gap (Alzheimer's society) & HSCIC"]
[]
["(1) WHS (WG); (2) SSW, (3) PEDW (NWIS) & MYE (ONS), (4) StatsWales, England data from HSCIC; (5) ADDE (ONS) & MYE (ONS), England data from Mortality statistics & MYE (ONS)","(1) WHS (WG), (2) SSW, (3) StatsWales, England data from HSCIC; (4) StatsWales, England data from HSCIC; (5) PEDW (NWIS) & MYE (ONS), (6) ADDE (ONS) & MYE (ONS), England data from Mortality statistics & MYE (ONS)","(1) WHS (WG); (2) WHS (WG); (3) CDSC & VPDP (PHW); (4) Cancer registrations (WCISU), England data from Cancer statistics registrations & MYE (ONS); (5) StatsWales, England data from NHS England; Cancer registrations (WCISU); (7) Cancer registrations (WCISU) & MYE (ONS), England data from Mortality Statistics & MYE (ONS); ","(1) WHS (WG), (2) WHS (WG), (3) WHS (WG), (4) PEDW (NWIS) & MYE (ONS), (5) PEDW (NWIS) & MYE (ONS), (6) PEDW (NWIS) & MYE (ONS), (7) PEDW (NWIS) & MYE (ONS)","(1) WIMD (WG) & MYE (ONS); (2) CDSC & VPDP (PHW); (3) CDSC & VPDP (PHW), England data from HPA (DH); (4) CDSC & VPDP (PHW), England data from HPA (DH); (5) WHS (WG); (6) Bowel Screening Wales (PHW); (7) ADDE (ONS), MYE (ONS) & WHS (WG); (8)ADDE (ONS), MYE (ONS) & WHS (WG); (9) ADDE (ONS), MYE (ONS) & WHS (WG); (10) ADDE (ONS), MYE (ONS) & WHS (WG)","(1) WPSL (DWP) & MYE (ONS); (2) StatsWales, England data from HSCIC; (3) Mapping the Gap (Alzheimer's society), England data from Mapping the Gap (Alzheimer's society); (4) WG; (5) PEDW (NWIS) & MYE (ONS); (6) WHS (WG); (7) WHS (WG)",null,{"$f":"INDEX(A131:F131,C3)","v":"(1) WHS (WG); (2) SSW, (3) PEDW (NWIS) & MYE (ONS), (4) StatsWales, England data from HSCIC; (5) ADDE (ONS) & MYE (ONS), England data from Mortality statistics & MYE (ONS)"}]

{"sheet":"Chart data","index":4,"n_rows":387,"n_cols":4,"rows_kept":387,"cut":false,"hidden":true,"merged":[]}
[]
["HB_ProgrammeBudget_Measure","crude","adjusted","Outcome"]
["Betsi Cadwaladr University_Circulatory_Smoking",172.2,167.69685575028578,22.364305427236104]
["Powys Teaching_Circulatory_Smoking",183.4,171.89634309871283,19.882034336099096]
["Hywel Dda_Circulatory_Smoking",157.5,150.94600446544194,22.103846860627598]
["Abertawe Bro Morgannwg University_Circulatory_Smoking",150.80000000000001,151.38146115318659,23.343784242752104]
["Cardiff and Vale University_Circulatory_Smoking",104.4,110.1453806500956,21.220607242497422]
["Cwm Taf_Circulatory_Smoking",154.6,158.54772512128494,26.268038351461513]
["Aneurin Bevan_Circulatory_Smoking",135.1,137.45214438127982,23.799081531332941]
["Wales_Circulatory_Smoking",148.1,148.10854146428088,22.849609494455528]
["Betsi Cadwaladr University_Circulatory_Smoking cessation",172.2,167.69685575028578,1.0568230395338896]
["Powys Teaching_Circulatory_Smoking cessation",183.4,171.89634309871283,1.3288203585307758]
["Hywel Dda_Circulatory_Smoking cessation",157.5,150.94600446544194,1.491075474732118]
["Abertawe Bro Morgannwg University_Circulatory_Smoking cessation",150.80000000000001,151.38146115318659,2.2796829207626339]
["Cardiff and Vale University_Circulatory_Smoking cessation",104.4,110.1453806500956,0.56424971666947987]
["Cwm Taf_Circulatory_Smoking cessation",154.6,158.54772512128494,1.1223215459445248]
["Aneurin Bevan_Circulatory_Smoking cessation",135.1,137.45214438127982,1.0748388693723283]
["Wales_Circulatory_Smoking cessation",148.1,148.10854146428088,1.2609671641364582]
["Betsi Cadwaladr University_Circulatory_QOF register",172.2,167.69685575028578,4.2424645459060297]
["Powys Teaching_Circulatory_QOF register",183.4,171.89634309871283,4.1596078290019101]
["Hywel Dda_Circulatory_QOF register",157.5,150.94600446544194,4.3216513125713352]
["Abertawe Bro Morgannwg University_Circulatory_QOF register",150.80000000000001,151.38146115318659,4.1523782906168352]
["Cardiff and Vale University_Circulatory_QOF register",104.4,110.1453806500956,3.0215706571916181]
["Cwm Taf_Circulatory_QOF register",154.6,158.54772512128494,4.0810430134710538]
["Aneurin Bevan_Circulatory_QOF register",135.1,137.45214438127982,4.0670503779767966]
["Wales_Circulatory_QOF register",148.1,148.10854146428088,3.9930460725943315]
["Abertawe Bro Morgannwg University_Circulatory_Elective admissions",150.80000000000001,151.38146115318659,50.959631952465266]
["Aneurin Bevan_Circulatory_Elective admissions",135.1,137.45214438127982,40.014544417014186]
["Betsi Cadwaladr University_Circulatory_Elective admissions",172.2,167.69685575028578,64.208950105954486]
["Cardiff and Vale University_Circulatory_Elective admissions",104.4,110.1453806500956,30.560431293881646]
["Cwm Taf_Circulatory_Elective admissions",154.6,158.54772512128494,39.928333759918097]
["Hywel Dda_Circulatory_Elective admissions",157.5,150.94600446544194,50.03886556370842]
["Powys Teaching_Circulatory_Elective admissions",183.4,171.89634309871283,73.927611085633231]
["Wales_Circulatory_Elective admissions",148.1,148.10854146428088,48.882279474435734]
["Abertawe Bro Morgannwg University_Circulatory_Mortality",150.80000000000001,151.38146115318659,102.10087566515701]
["Aneurin Bevan_Circulatory_Mortality",135.1,137.45214438127982,96.688756748988695]
["Betsi Cadwaladr University_Circulatory_Mortality",172.2,167.69685575028578,98.209786599879706]
["Cardiff and Vale University_Circulatory_Mortality",104.4,110.1453806500956,67.192754227927594]
["Cwm Taf_Circulatory_Mortality",154.6,158.54772512128494,110.871027429492]
["Hywel Dda_Circulatory_Mortality",157.5,150.94600446544194,98.449947328307303]
["Powys Teaching_Circulatory_Mortality",183.4,171.89634309871283,81.9961156788887]
["Wales_Circulatory_Mortality",148.1,148.10854146428088,94.314415067277295]
["Betsi Cadwaladr University_Respiratory_Smoking",124.9,121.63376898721735,22.364305427236104]
["Powys Teaching_Respiratory_Smoking",117.3,110.00915101141345,19.882034336099096]
["Hywel Dda_Respiratory_Smoking",106.1,101.72093424497538,22.103846860627598]
["Abertawe Bro Morgannwg University_Respiratory_Smoking",114.6,115.09325703575009,23.343784242752104]
["Cardiff and Vale University_Respiratory_Smoking",98.2,103.58037977808223,21.220607242497422]
["Cwm Taf_Respiratory_Smoking",139.1,142.61496742552706,26.268038351461513]
["Aneurin Bevan_Respiratory_Smoking",114.5,116.49745009334823,23.799081531332941]
["Wales_Respiratory_Smoking",115.8,115.77577742262334,22.849609494455528]
["Betsi Cadwaladr University_Respiratory_Smoking cessation",124.9,121.63376898721735,1.0568230395338896]
["Powys Teaching_Respiratory_Smoking cessation",117.3,110.00915101141345,1.3288203585307758]
["Hywel Dda_Respiratory_Smoking cessation",106.1,101.72093424497538,1.491075474732118]
["Abertawe Bro Morgannwg University_Respiratory_Smoking cessation",114.6,115.09325703575009,2.2796829207626339]
["Cardiff and Vale University_Respiratory_Smoking cessation",98.2,103.58037977808223,0.56424971666947987]
["Cwm Taf_Respiratory_Smoking cessation",139.1,142.61496742552706,1.1223215459445248]
["Aneurin Bevan_Respiratory_Smoking cessation",114.5,116.49745009334823,1.0748388693723283]
["Wales_Respiratory_Smoking cessation",115.8,115.77577742262334,1.2609671641364582]
["Betsi Cadwaladr University_Respiratory_QOF register",124.9,121.63376898721735,2.4078929309708119]
["Powys Teaching_Respiratory_QOF register",117.3,110.00915101141345,2.1079191147316441]
["Hywel Dda_Respiratory_QOF register",106.1,101.72093424497538,2.0289825533996413]
["Abertawe Bro Morgannwg University_Respiratory_QOF register",114.6,115.09325703575009,2.0744423626063471]
["Cardiff and Vale University_Respiratory_QOF register",98.2,103.58037977808223,1.4534314411213385]
["Cwm Taf_Respiratory_QOF register",139.1,142.61496742552706,2.647588967066016]
["Aneurin Bevan_Respiratory_QOF register",114.5,116.49745009334823,2.0754483776895145]
["Wales_Respiratory_QOF register",115.8,115.77577742262334,2.1017171981624454]
["Betsi Cadwaladr University_Respiratory_Flu immunisation",124.9,121.63376898721735,93.09394169136398]
["Powys Teaching_Respiratory_Flu immunisation",117.3,110.00915101141345,93.737291581943879]
["Hywel Dda_Respiratory_Flu immunisation",106.1,101.72093424497538,93.182164054177434]
["Abertawe Bro Morgannwg University_Respiratory_Flu immunisation",114.6,115.09325703575009,92.001767565178966]
["Cardiff and Vale University_Respiratory_Flu immunisation",98.2,103.58037977808223,93.169621076597821]
["Cwm Taf_Respiratory_Flu immunisation",139.1,142.61496742552706,94.443589348930274]
["Aneurin Bevan_Respiratory_Flu immunisation",114.5,116.49745009334823,93.389469608981798]
["Wales_Respiratory_Flu immunisation",115.8,115.77577742262334,93.176051395562283]
["Betsi Cadwaladr University_Respiratory_Emergency admissions",124.9,121.63376898721735,300.15984240151187]
["Powys Teaching_Respiratory_Emergency admissions",117.3,110.00915101141345,191.96118675116969]
["Hywel Dda_Respiratory_Emergency admissions",106.1,101.72093424497538,209.53227243927637]
["Abertawe Bro Morgannwg University_Respiratory_Emergency admissions",114.6,115.09325703575009,267.66740691783468]
["Cardiff and Vale University_Respiratory_Emergency admissions",98.2,103.58037977808223,204.30610011853744]
["Cwm Taf_Respiratory_Emergency admissions",139.1,142.61496742552706,365.156556607798]
["Aneurin Bevan_Respiratory_Emergency admissions",114.5,116.49745009334823,329.51107446010815]
["Wales_Respiratory_Emergency admissions",115.8,115.77577742262334,276.00897274993196]
["Betsi Cadwaladr University_Respiratory_Mortality",124.9,121.63376898721735,19.063622698777088]
["Powys Teaching_Respiratory_Mortality",117.3,110.00915101141345,13.992511208001478]
["Hywel Dda_Respiratory_Mortality",106.1,101.72093424497538,17.767594044457823]
["Abertawe Bro Morgannwg University_Respiratory_Mortality",114.6,115.09325703575009,18.724382042399068]
["Cardiff and Vale University_Respiratory_Mortality",98.2,103.58037977808223,15.494219582239021]
["Cwm Taf_Respiratory_Mortality",139.1,142.61496742552706,21.681445363989582]
["Aneurin Bevan_Respiratory_Mortality",114.5,116.49745009334823,18.593991682497823]
["Wales_Respiratory_Mortality",115.8,115.77577742262334,18.239375862174821]
["Betsi Cadwaladr University_Respiratory_Currently being treated",124.9,121.63376898721735,13.107637719004444]
["Powys Teaching_Respiratory_Currently being treated",117.3,110.00915101141345,14.269579410165733]
["Hywel Dda_Respiratory_Currently being treated",106.1,101.72093424497538,14.071304329564741]
["Abertawe Bro Morgannwg University_Respiratory_Currently being treated",114.6,115.09325703575009,13.990404742386565]
["Cardiff and Vale University_Respiratory_Currently being treated",98.2,103.58037977808223,13.501348561278848]
["Cwm Taf_Respiratory_Currently being treated",139.1,142.61496742552706,14.668181813728673]
["Aneurin Bevan_Respiratory_Currently being treated",114.5,116.49745009334823,14.239104964261484]
["Wales_Respiratory_Currently being treated",115.8,115.77577742262334,13.8474336089846]
["Betsi Cadwaladr University_Cancers_Smoking",130.69999999999999,127.3083609896335,22.364305427236104]
["Powys Teaching_Cancers_Smoking",131,122.83744660514961,19.882034336099096]
["Hywel Dda_Cancers_Smoking",130.1,124.66418471999143,22.103846860627598]
["Abertawe Bro Morgannwg University_Cancers_Smoking",121.5,122.02948195867268,23.343784242752104]
["Cardiff and Vale University_Cancers_Smoking",86.1,90.841551051625245,21.220607242497422]
["Cwm Taf_Cancers_Smoking",124.1,127.28021270737558,26.268038351461513]
["Aneurin Bevan_Cancers_Smoking",103.4,105.24250111658392,23.799081531332941]
["Wales_Cancers_Smoking",116.4,116.45507557477568,22.849609494455528]
["Betsi Cadwaladr University_Cancers_Healthy eating",130.69999999999999,127.3083609896335,35.654845734362894]
["Hywel Dda_Cancers_Healthy eating",130.1,124.66418471999143,38.479008584274254]
["Powys Teaching_Cancers_Healthy eating",131,122.83744660514961,39.895742619320124]
["Abertawe Bro Morgannwg University_Cancers_Healthy eating",121.5,122.02948195867268,32.647268661581492]
["Cwm Taf_Cancers_Healthy eating",124.1,127.28021270737558,30.122027288898877]
["Cardiff and Vale University_Cancers_Healthy eating",86.1,90.841551051625245,33.646030842986093]
["Aneurin Bevan_Cancers_Healthy eating",103.4,105.24250111658392,30.584188547467956]
["Wales_Cancers_Healthy eating",116.4,116.45507557477568,33.914006207873797]
["Betsi Cadwaladr University_Cancers_HPV vaccination",130.69999999999999,127.3083609896335,87.662517289073307]
["Powys Teaching_Cancers_HPV vaccination",131,122.83744660514961,82.369942196531781]
["Hywel Dda_Cancers_HPV vaccination",130.1,124.66418471999143,85.465116279069761]
["Abertawe Bro Morgannwg University_Cancers_HPV vaccination",121.5,122.02948195867268,88.246338715734126]
["Cardiff and Vale University_Cancers_HPV vaccination",86.1,90.841551051625245,83.493205435651475]
["Cwm Taf_Cancers_HPV vaccination",124.1,127.28021270737558,91.961414790996784]
["Aneurin Bevan_Cancers_HPV vaccination",103.4,105.24250111658392,86.290801186943625]
["Wales_Cancers_HPV vaccination",116.4,116.45507557477568,86.578162109493945]
["Betsi Cadwaladr University_Cancers_Incidence",130.69999999999999,127.3083609896335,634.89969409378375]
["Powys Teaching_Cancers_Incidence",131,122.83744660514961,635.48265734605218]
["Hywel Dda_Cancers_Incidence",130.1,124.66418471999143,602.3977699621139]
["Abertawe Bro Morgannwg University_Cancers_Incidence",121.5,122.02948195867268,578.1147406434668]
["Cardiff and Vale University_Cancers_Incidence",86.1,90.841551051625245,496.44060206438462]
["Cwm Taf_Cancers_Incidence",124.1,127.28021270737558,559.17290407870519]
["Aneurin Bevan_Cancers_Incidence",103.4,105.24250111658392,567.39806049305298]
["Wales_Cancers_Incidence",116.4,116.45507557477568,580.32019800326293]
["Betsi Cadwaladr University_Cancers_Treatment",130.69999999999999,127.3083609896335,88.6]
["Hywel Dda_Cancers_Treatment",130.1,124.66418471999143,81]
["Abertawe Bro Morgannwg University_Cancers_Treatment",121.5,122.02948195867268,76]
["Cwm Taf_Cancers_Treatment",124.1,127.28021270737558,86.5]
["Aneurin Bevan_Cancers_Treatment",103.4,105.24250111658392,93.2]
["Cardiff and Vale University_Cancers_Treatment",86.1,90.841551051625245,90]
["Wales_Cancers_Treatment",116.4,116.45507557477568,85.7]
["Betsi Cadwaladr University_Cancers_Survival",130.69999999999999,127.3083609896335,69.8]
["Powys Teaching_Cancers_Survival",131,122.83744660514961,72]
["Hywel Dda_Cancers_Survival",130.1,124.66418471999143,69]
["Abertawe Bro Morgannwg University_Cancers_Survival",121.5,122.02948195867268,67.599999999999994]
["Cwm Taf_Cancers_Survival",124.1,127.28021270737558,65.5]
["Aneurin Bevan_Cancers_Survival",103.4,105.24250111658392,67.599999999999994]
["Cardiff and Vale University_Cancers_Survival",86.1,90.841551051625245,70.099999999999994]
["Wales_Cancers_Survival",116.4,116.45507557477568,68.599999999999994]
["Betsi Cadwaladr University_Cancers_Mortality",130.69999999999999,127.3083609896335,309.55777292735877]
["Powys Teaching_Cancers_Mortality",131,122.83744660514961,290.66239471831841]
["Hywel Dda_Cancers_Mortality",130.1,124.66418471999143,298.08386071315419]
["Abertawe Bro Morgannwg University_Cancers_Mortality",121.5,122.02948195867268,285.76253851204604]
["Cardiff and Vale University_Cancers_Mortality",86.1,90.841551051625245,239.61686009702035]
["Cwm Taf_Cancers_Mortality",124.1,127.28021270737558,286.54611479398022]
["Aneurin Bevan_Cancers_Mortality",103.4,105.24250111658392,273.37724825173711]
["Wales_Cancers_Mortality",116.4,116.45507557477568,283.67468021295065]
["Betsi Cadwaladr University_Healthy Individuals_Deprivation",36.4,35.466553704455386,11.921540073784639]
["Powys Teaching_Healthy Individuals_Deprivation",65.2,61.091147385436564,0.86127392321704876]
["Hywel Dda_Healthy Individuals_Deprivation",49.5,47.440316272136556,7.9324119858782458]
["Abertawe Bro Morgannwg University_Healthy Individuals_Deprivation",42.8,42.962721280550674,26.637982119392987]
["Cardiff and Vale University_Healthy Individuals_Deprivation",44.7,47.175465918911193,22.115099886273416]
["Cwm Taf_Healthy Individuals_Deprivation",79.8,81.821495128983031,34.171815949904833]
["Aneurin Bevan_Healthy Individuals_Deprivation",47.2,48.057909190304173,22.870221937230596]
["Wales_Healthy Individuals_Deprivation",47.8,47.840739347978229,19.182485539327377]
["Betsi Cadwaladr University_Healthy Individuals_Childhood vaccinations",36.4,35.466553704455386,85.09171328216469]
["Powys Teaching_Healthy Individuals_Childhood vaccinations",65.2,61.091147385436564,84.74842767295597]
["Hywel Dda_Healthy Individuals_Childhood vaccinations",49.5,47.440316272136556,80.795395081109362]
["Abertawe Bro Morgannwg University_Healthy Individuals_Childhood vaccinations",42.8,42.962721280550674,82.572324851864764]
["Cardiff and Vale University_Healthy Individuals_Childhood vaccinations",44.7,47.175465918911193,79.189686924493557]
["Cwm Taf_Healthy Individuals_Childhood vaccinations",79.8,81.821495128983031,84.971590909090907]
["Aneurin Bevan_Healthy Individuals_Childhood vaccinations",47.2,48.057909190304173,80.940060370849508]
["Wales_Healthy Individuals_Childhood vaccinations",47.8,47.840739347978229,82.357966680905591]
["Betsi Cadwaladr University_Healthy Individuals_Flu vaccination, 65+",36.4,35.466553704455386,70.037831021437583]
["Powys Teaching_Healthy Individuals_Flu vaccination, 65+",65.2,61.091147385436564,67.682834349501022]
["Hywel Dda_Healthy Individuals_Flu vaccination, 65+",49.5,47.440316272136556,65.38167894100097]
["Abertawe Bro Morgannwg University_Healthy Individuals_Flu vaccination, 65+",42.8,42.962721280550674,65.36501370595046]
["Cardiff and Vale University_Healthy Individuals_Flu vaccination, 65+",44.7,47.175465918911193,69.260752869454961]
["Cwm Taf_Healthy Individuals_Flu vaccination, 65+",79.8,81.821495128983031,65.947634632549835]
["Aneurin Bevan_Healthy Individuals_Flu vaccination, 65+",47.2,48.057909190304173,68.094842310045948]
["Wales_Healthy Individuals_Flu vaccination, 65+",47.8,47.840739347978229,67.656556146045034]
["Betsi Cadwaladr University_Healthy Individuals_Flu vaccination, at risk",36.4,35.466553704455386,52.075706292740207]
["Powys Teaching_Healthy Individuals_Flu vaccination, at risk",65.2,61.091147385436564,49.277091521617066]
["Hywel Dda_Healthy Individuals_Flu vaccination, at risk",49.5,47.440316272136556,48.012331253263056]
["Abertawe Bro Morgannwg University_Healthy Individuals_Flu vaccination, at risk",42.8,42.962721280550674,45.209436687530093]
["Cardiff and Vale University_Healthy Individuals_Flu vaccination, at risk",44.7,47.175465918911193,51.475823348725569]
["Cwm Taf_Healthy Individuals_Flu vaccination, at risk",79.8,81.821495128983031,51.016839974233918]
["Aneurin Bevan_Healthy Individuals_Flu vaccination, at risk",47.2,48.057909190304173,50.204451150509243]
["Wales_Healthy Individuals_Flu vaccination, at risk",47.8,47.840739347978229,49.701693754935491]
["Betsi Cadwaladr University_Healthy Individuals_General health",36.4,35.466553704455386,17.851011865158465]
["Powys Teaching_Healthy Individuals_General health",65.2,61.091147385436564,19.824037858530559]
["Hywel Dda_Healthy Individuals_General health",49.5,47.440316272136556,20.196774795760092]
["Abertawe Bro Morgannwg University_Healthy Individuals_General health",42.8,42.962721280550674,21.004508206738311]
["Cardiff and Vale University_Healthy Individuals_General health",44.7,47.175465918911193,18.681580157480017]
["Cwm Taf_Healthy Individuals_General health",79.8,81.821495128983031,24.509174044473109]
["Aneurin Bevan_Healthy Individuals_General health",47.2,48.057909190304173,22.337943088705355]
["Wales_Healthy Individuals_General health",47.8,47.840739347978229,20.360005555949069]
["Betsi Cadwaladr University_Healthy Individuals_Bowel screening",36.4,35.466553704455386,54.128308988993901]
["Powys Teaching_Healthy Individuals_Bowel screening",65.2,61.091147385436564,56.899995355102419]
["Hywel Dda_Healthy Individuals_Bowel screening",49.5,47.440316272136556,56.975941367040207]
["Abertawe Bro Morgannwg University_Healthy Individuals_Bowel screening",42.8,42.962721280550674,56.992587257285201]
["Cardiff and Vale University_Healthy Individuals_Bowel screening",44.7,47.175465918911193,51.266207455429502]
["Cwm Taf_Healthy Individuals_Bowel screening",79.8,81.821495128983031,56.585744492920419]
["Aneurin Bevan_Healthy Individuals_Bowel screening",47.2,48.057909190304173,54.826901933442386]
["Wales_Healthy Individuals_Bowel screening",47.8,47.840739347978229,55.153879497182487]
["Betsi Cadwaladr University_Healthy Individuals_HLE males",36.4,35.466553704455386,65.700066639723602]
["Powys Teaching_Healthy Individuals_HLE males",65.2,61.091147385436564,67.702299038366604]
["Hywel Dda_Healthy Individuals_HLE males",49.5,47.440316272136556,64.011898111369405]
["Abertawe Bro Morgannwg University_Healthy Individuals_HLE males",42.8,42.962721280550674,61.7451871236184]
["Cardiff and Vale University_Healthy Individuals_HLE males",44.7,47.175465918911193,64.183417887689998]
["Cwm Taf_Healthy Individuals_HLE males",79.8,81.821495128983031,59.962055812735102]
["Aneurin Bevan_Healthy Individuals_HLE males",47.2,48.057909190304173,61.959426057131097]
["Wales_Healthy Individuals_HLE males",47.8,47.840739347978229,63.464981492925503]
["Betsi Cadwaladr University_Healthy Individuals_HLE females",36.4,35.466553704455386,67.880725350169001]
["Powys Teaching_Healthy Individuals_HLE females",65.2,61.091147385436564,67.4719126829049]
["Hywel Dda_Healthy Individuals_HLE females",49.5,47.440316272136556,65.679454595679402]
["Abertawe Bro Morgannwg University_Healthy Individuals_HLE females",42.8,42.962721280550674,64.475854547948302]
["Cardiff and Vale University_Healthy Individuals_HLE females",44.7,47.175465918911193,66.254720294352396]
["Cwm Taf_Healthy Individuals_HLE females",79.8,81.821495128983031,60.6242107829312]
["Aneurin Bevan_Healthy Individuals_HLE females",47.2,48.057909190304173,63.389162516298597]
["Wales_Healthy Individuals_HLE females",47.8,47.840739347978229,65.260581855773495]
["Betsi Cadwaladr University_Healthy Individuals_DFLE males",36.4,35.466553704455386,60.930549304845599]
["Powys Teaching_Healthy Individuals_DFLE males",65.2,61.091147385436564,62.468601925033497]
["Hywel Dda_Healthy Individuals_DFLE males",49.5,47.440316272136556,59.493332594320798]
["Abertawe Bro Morgannwg University_Healthy Individuals_DFLE males",42.8,42.962721280550674,57.577114735301002]
["Cardiff and Vale University_Healthy Individuals_DFLE males",44.7,47.175465918911193,60.128292230873299]
["Cwm Taf_Healthy Individuals_DFLE males",79.8,81.821495128983031,56.105130808694597]
["Aneurin Bevan_Healthy Individuals_DFLE males",47.2,48.057909190304173,57.894760937860497]
["Wales_Healthy Individuals_DFLE males",47.8,47.840739347978229,59.149713210280602]
["Betsi Cadwaladr University_Healthy Individuals_DFLE females",36.4,35.466553704455386,62.974339314322201]
["Powys Teaching_Healthy Individuals_DFLE females",65.2,61.091147385436564,63.339004907237801]
["Hywel Dda_Healthy Individuals_DFLE females",49.5,47.440316272136556,61.236573750440002]
["Abertawe Bro Morgannwg University_Healthy Individuals_DFLE females",42.8,42.962721280550674,59.496278380988201]
["Cardiff and Vale University_Healthy Individuals_DFLE females",44.7,47.175465918911193,62.496073896038098]
["Cwm Taf_Healthy Individuals_DFLE females",79.8,81.821495128983031,58.482767250787397]
["Aneurin Bevan_Healthy Individuals_DFLE females",47.2,48.057909190304173,60.067681693179502]
["Wales_Healthy Individuals_DFLE females",47.8,47.840739347978229,61.168295931220896]
["Betsi Cadwaladr University_Mental health problems_Benefit claimants",197.3,192.18489189334767,12.683751849850838]
["Powys Teaching_Mental health problems_Benefit claimants",211.2,197.99674681908212,9.9707957835629148]
["Hywel Dda_Mental health problems_Benefit claimants",198.9,190.66242777131768,12.966342341113169]
["Abertawe Bro Morgannwg University_Mental health problems_Benefit claimants",213.6,214.45690841901447,16.313838525463201]
["Cardiff and Vale University_Mental health problems_Benefit claimants",216.5,228.50762994354196,13.114914765542011]
["Cwm Taf_Mental health problems_Benefit claimants",267.3,274.04972713522051,19.859394972305068]
["Aneurin Bevan_Mental health problems_Benefit claimants",191.9,195.2274315773725,16.637767861789754]
["Wales_Mental health problems_Benefit claimants",209.5,209.51565813251437,14.735331626083429]
["Betsi Cadwaladr University_Mental health problems_QOF register",197.3,192.18489189334767,0.78103002579379954]
["Powys Teaching_Mental health problems_QOF register",211.2,197.99674681908212,0.86147857117110616]
["Hywel Dda_Mental health problems_QOF register",198.9,190.66242777131768,0.8402290885374204]
["Abertawe Bro Morgannwg University_Mental health problems_QOF register",213.6,214.45690841901447,0.95466271464741648]
["Cardiff and Vale University_Mental health problems_QOF register",216.5,228.50762994354196,0.80715105055535352]
["Cwm Taf_Mental health problems_QOF register",267.3,274.04972713522051,0.84838416305786024]
["Aneurin Bevan_Mental health problems_QOF register",191.9,195.2274315773725,0.81791974131221257]
["Wales_Mental health problems_QOF register",209.5,209.51565813251437,0.83894776957612816]
["Betsi Cadwaladr University_Mental health problems_Dementia",197.3,192.18489189334767,34.15300546448087]
["Powys Teaching_Mental health problems_Dementia",211.2,197.99674681908212,38.111157542833261]
["Hywel Dda_Mental health problems_Dementia",198.9,190.66242777131768,34.372436423297785]
["Abertawe Bro Morgannwg University_Mental health problems_Dementia",213.6,214.45690841901447,42.812895959453748]
["Cardiff and Vale University_Mental health problems_Dementia",216.5,228.50762994354196,44.384328358208961]
["Cwm Taf_Mental health problems_Dementia",267.3,274.04972713522051,38.774952146568225]
["Aneurin Bevan_Mental health problems_Dementia",191.9,195.2274315773725,40.930170928845897]
["Wales_Mental health problems_Dementia",209.5,209.51565813251437,38.53087582402798]
["Betsi Cadwaladr University_Mental health problems_Care & treatment plan",197.3,192.18489189334767,624.82402063503969]
["Hywel Dda_Mental health problems_Care & treatment plan",198.9,190.66242777131768,424.1908527637371]
["Abertawe Bro Morgannwg University_Mental health problems_Care & treatment plan",213.6,214.45690841901447,662.12258001643818]
["Cardiff and Vale University_Mental health problems_Care & treatment plan",216.5,228.50762994354196,568.98210316535278]
["Cwm Taf_Mental health problems_Care & treatment plan",267.3,274.04972713522051,607.71140003437245]
["Aneurin Bevan_Mental health problems_Care & treatment plan",191.9,195.2274315773725,579.07448297517681]
["Wales_Mental health problems_Care & treatment plan",209.5,209.51565813251437,562.63651540179399]
["Betsi Cadwaladr University_Mental health problems_Emergency admissions",197.3,192.18489189334767,178.54167971973425]
["Powys Teaching_Mental health problems_Emergency admissions",211.2,197.99674681908212,105.75407416317704]
["Hywel Dda_Mental health problems_Emergency admissions",198.9,190.66242777131768,127.94526046062046]
["Abertawe Bro Morgannwg University_Mental health problems_Emergency admissions",213.6,214.45690841901447,160.05721964765425]
["Cardiff and Vale University_Mental health problems_Emergency admissions",216.5,228.50762994354196,262.00761375034193]
["Cwm Taf_Mental health problems_Emergency admissions",267.3,274.04972713522051,122.28763188578903]
["Aneurin Bevan_Mental health problems_Emergency admissions",191.9,195.2274315773725,253.71540844121313]
["Wales_Mental health problems_Emergency admissions",209.5,209.51565813251437,188.15416513841257]
["Betsi Cadwaladr University_Mental health problems_No mental health problems",197.3,192.18489189334767,77.777760000000001]
["Powys Teaching_Mental health problems_No mental health problems",211.2,197.99674681908212,79.822099999999992]
["Hywel Dda_Mental health problems_No mental health problems",198.9,190.66242777131768,75.751429999999999]
["Abertawe Bro Morgannwg University_Mental health problems_No mental health problems",213.6,214.45690841901447,73.592159999999993]
["Cardiff and Vale University_Mental health problems_No mental health problems",216.5,228.50762994354196,74.618960000000001]
["Cwm Taf_Mental health problems_No mental health problems",267.3,274.04972713522051,70.010239999999996]
["Aneurin Bevan_Mental health problems_No mental health problems",191.9,195.2274315773725,71.45165999999999]
["Wales_Mental health problems_No mental health problems",209.5,209.51565813251437,74.51558]
["Betsi Cadwaladr University_Mental health problems_Currently being treated",197.3,192.18489189334767,9.3612371316683891]
["Powys Teaching_Mental health problems_Currently being treated",211.2,197.99674681908212,7.7114894034337649]
["Hywel Dda_Mental health problems_Currently being treated",198.9,190.66242777131768,9.0193474441450459]
["Abertawe Bro Morgannwg University_Mental health problems_Currently being treated",213.6,214.45690841901447,11.793640989139027]
["Cardiff and Vale University_Mental health problems_Currently being treated",216.5,228.50762994354196,10.448458400025528]
["Cwm Taf_Mental health problems_Currently being treated",267.3,274.04972713522051,13.518169761142923]
["Aneurin Bevan_Mental health problems_Currently being treated",191.9,195.2274315773725,11.77706820238733]
["Wales_Mental health problems_Currently being treated",209.5,209.51565813251437,10.661800714856984]
["Betsi Cadwaladr University_Musculoskeletal_Overweight or obese",124.6,121.32959614241071,55.453128893010394]
["Powys Teaching_Musculoskeletal_Overweight or obese",108.9,102.05574863616461,56.052874762871866]
["Hywel Dda_Musculoskeletal_Overweight or obese",132,126.49663251504195,56.807935066245733]
["Abertawe Bro Morgannwg University_Musculoskeletal_Overweight or obese",122.3,122.84368387807666,58.881989381024539]
["Cardiff and Vale University_Musculoskeletal_Overweight or obese",97.4,102.78238682223996,51.830200560728947]
["Cwm Taf_Musculoskeletal_Overweight or obese",103.3,105.88149797068937,63.262391360416629]
["Aneurin Bevan_Musculoskeletal_Overweight or obese",112.9,114.86289930195539,60.117931307631636]
["Wales_Musculoskeletal_Overweight or obese",116,116.01570252681938,57.281228133883829]
["Betsi Cadwaladr University_Musculoskeletal_Physical activity",124.6,121.32959614241071,31.513717680126575]
["Powys Teaching_Musculoskeletal_Physical activity",108.9,102.05574863616461,37.05354378909761]
["Hywel Dda_Musculoskeletal_Physical activity",132,126.49663251504195,31.759769003344967]
["Abertawe Bro Morgannwg University_Musculoskeletal_Physical activity",122.3,122.84368387807666,28.097779455253967]
["Cardiff and Vale University_Musculoskeletal_Physical activity",97.4,102.78238682223996,27.128143271325371]
["Cwm Taf_Musculoskeletal_Physical activity",103.3,105.88149797068937,26.977753078472816]
["Aneurin Bevan_Musculoskeletal_Physical activity",112.9,114.86289930195539,28.584447698889225]
["Wales_Musculoskeletal_Physical activity",116,116.01570252681938,29.562431807522838]
["Betsi Cadwaladr University_Musculoskeletal_Currently being treated",124.6,121.32959614241071,11.915482307405906]
["Powys Teaching_Musculoskeletal_Currently being treated",108.9,102.05574863616461,11.251918950213854]
["Hywel Dda_Musculoskeletal_Currently being treated",132,126.49663251504195,12.407132071839536]
["Abertawe Bro Morgannwg University_Musculoskeletal_Currently being treated",122.3,122.84368387807666,13.529544884968042]
["Cardiff and Vale University_Musculoskeletal_Currently being treated",97.4,102.78238682223996,10.503770677114222]
["Cwm Taf_Musculoskeletal_Currently being treated",103.3,105.88149797068937,16.664057363636974]
["Aneurin Bevan_Musculoskeletal_Currently being treated",112.9,114.86289930195539,14.102119246266614]
["Wales_Musculoskeletal_Currently being treated",116,116.01570252681938,12.858410745954387]
["Betsi Cadwaladr University_Musculoskeletal_Hip replacements",124.6,121.32959614241071,118.16972436292531]
["Powys Teaching_Musculoskeletal_Hip replacements",108.9,102.05574863616461,172.16362310450859]
["Hywel Dda_Musculoskeletal_Hip replacements",132,126.49663251504195,143.98223488821878]
["Abertawe Bro Morgannwg University_Musculoskeletal_Hip replacements",122.3,122.84368387807666,66.027644953638372]
["Cardiff and Vale University_Musculoskeletal_Hip replacements",97.4,102.78238682223996,71.735091638552021]
["Cwm Taf_Musculoskeletal_Hip replacements",103.3,105.88149797068937,82.70056593578478]
["Aneurin Bevan_Musculoskeletal_Hip replacements",112.9,114.86289930195539,85.422353516321579]
["Wales_Musculoskeletal_Hip replacements",116,116.01570252681938,99.206771932918286]
["Betsi Cadwaladr University_Musculoskeletal_Knee replacements",124.6,121.32959614241071,145.27153537587733]
["Powys Teaching_Musculoskeletal_Knee replacements",108.9,102.05574863616461,184.69372667834472]
["Hywel Dda_Musculoskeletal_Knee replacements",132,126.49663251504195,166.59173981893116]
["Abertawe Bro Morgannwg University_Musculoskeletal_Knee replacements",122.3,122.84368387807666,152.03819126934752]
["Cardiff and Vale University_Musculoskeletal_Knee replacements",97.4,102.78238682223996,130.64762469225857]
["Cwm Taf_Musculoskeletal_Knee replacements",103.3,105.88149797068937,120.353780962944]
["Aneurin Bevan_Musculoskeletal_Knee replacements",112.9,114.86289930195539,128.97441562817326]
["Wales_Musculoskeletal_Knee replacements",116,116.01570252681938,144.19944669280349]
["Betsi Cadwaladr University_Musculoskeletal_Hip revisions",124.6,121.32959614241071,8.4511023588775185]
["Powys Teaching_Musculoskeletal_Hip revisions",108.9,102.05574863616461,10.52528700202236]
["Hywel Dda_Musculoskeletal_Hip revisions",132,126.49663251504195,13.583229706435734]
["Abertawe Bro Morgannwg University_Musculoskeletal_Hip revisions",122.3,122.84368387807666,6.2082800348181033]
["Cardiff and Vale University_Musculoskeletal_Hip revisions",97.4,102.78238682223996,10.258046867876356]
["Cwm Taf_Musculoskeletal_Hip revisions",103.3,105.88149797068937,6.8253561982765971]
["Aneurin Bevan_Musculoskeletal_Hip revisions",112.9,114.86289930195539,8.8727902837727104]
["Wales_Musculoskeletal_Hip revisions",116,116.01570252681938,9.0793862859311805]
["Betsi Cadwaladr University_Musculoskeletal_Knee revisions",124.6,121.32959614241071,6.6540288687713796]
["Powys Teaching_Musculoskeletal_Knee revisions",108.9,102.05574863616461,6.5156538583947929]
["Hywel Dda_Musculoskeletal_Knee revisions",132,126.49663251504195,12.882159786103568]
["Abertawe Bro Morgannwg University_Musculoskeletal_Knee revisions",122.3,122.84368387807666,7.7603500435226298]
["Cardiff and Vale University_Musculoskeletal_Knee revisions",97.4,102.78238682223996,9.6169189386340843]
["Cwm Taf_Musculoskeletal_Knee revisions",103.3,105.88149797068937,6.8253561982765971]
["Aneurin Bevan_Musculoskeletal_Knee revisions",112.9,114.86289930195539,8.640821910340744]
["Wales_Musculoskeletal_Knee revisions",116,116.01570252681938,8.5658710567629903]
["England_Circulatory_Smoking",131.45440222442679,-10,-10]
["England_Circulatory_Smoking cessation",131.45440222442679,-10,-10]
["England_Circulatory_QOF register",131.45440222442679,-10,3.3777996839000002]
["England_Circulatory_Elective admissions",131.45440222442679,-10,-10]
["England_Circulatory_Mortality",131.45440222442679,-10,74.975891048186597]
["England_Respiratory_Smoking",83.824984014216909,-10,-10]
["England_Respiratory_Smoking cessation",83.824984014216909,-10,-10]
["England_Respiratory_QOF register",83.824984014216909,-10,1.6902271545000001]
["England_Respiratory_Flu immunisation",83.824984014216909,-10,93.134556257904507]
["England_Respiratory_Mortality",83.824984014216909,-10,13.984080725078909]
["England_Respiratory_Currently being treated",83.824984014216909,-10,-10]
["England_Respiratory_Emergency admissions",83.824984014216909,-10,-10]
["England_Cancers_Smoking",104.51665529188635,-10,-10]
["England_Cancers_Healthy eating",104.51665529188635,-10,-10]
["England_Cancers_HPV vaccination uptake",104.51665529188635,-10,-10]
["England_Cancers_Incidence",104.51665529188635,-10,484.88245345378323]
["England_Cancers_Treatment",104.51665529188635,-10,86.2]
["England_Cancers_Survival",104.51665529188635,-10,-10]
["England_Cancers_Mortality",104.51665529188635,-10,248.3603312016424]
["England_Healthy Individuals_Deprivation",38.251208506233226,-10,-10]
["England_Healthy Individuals_Childhood vaccinations",38.251208506233226,-10,-10]
["England_Healthy Individuals_Flu vaccination, 65+",38.251208506233226,-10,73.400000000000006]
["England_Healthy Individuals_Flu vaccination, at risk",38.251208506233226,-10,51.3]
["England_Healthy Individuals_General health",38.251208506233226,-10,-10]
["England_Healthy Individuals_Bowel screening",38.251208506233226,-10,-10]
["England_Healthy Individuals_HLE males",38.251208506233226,-10,-10]
["England_Healthy Individuals_HLE females",38.251208506233226,-10,-10]
["England_Healthy Individuals_DFLE males",38.251208506233226,-10,-10]
["England_Healthy Individuals_DFLE females",38.251208506233226,-10,-10]
["England_Mental health problems_Benefit claimants",211.97717237708861,-10,11.6]
["England_Mental health problems_QOF register",211.97717237708861,-10,0.81513198239999995]
["England_Mental health problems_Dementia",211.97717237708861,-10,44.2]
["England_Mental health problems_Care & treatment plan",211.97717237708861,-10,-10]
["England_Mental health problems_Emergency admissions",211.97717237708861,-10,-10]
["England_Mental health problems_No mental health problems",211.97717237708861,-10,-10]
["England_Mental health problems_Currently being treated",211.97717237708861,-10,-10]
["England_Musculoskeletal_Overweight or obese",98.028238481581326,-10,-10]
["England_Musculoskeletal_Physical activity",98.028238481581326,-10,-10]
["England_Musculoskeletal_Currently being treated",98.028238481581326,-10,-10]
["England_Musculoskeletal_Hip replacements",98.028238481581326,-10,-10]
["England_Musculoskeletal_Knee replacements",98.028238481581326,-10,-10]
["England_Musculoskeletal_Hip revisions",98.028238481581326,-10,-10]
["England_Musculoskeletal_Knee revisions",98.028238481581326,-10,-10]

{"sheet":"Table data","index":5,"n_rows":56,"n_cols":13,"rows_kept":56,"cut":false,"hidden":true,"merged":[[0,3,0,12]]}
[null,null,null,"Measures"]
["HB_ProgrammeBudget","crude exp","adj exp",4,5,6,7,8,9,10,11,12,13]
["Betsi Cadwaladr University_Circulatory",172.2,167.69685575028578,22.364305427236104,1.0568230395338896,4.2424645459060297,64.208950105954486,98.209786599879706]
["Powys Teaching_Circulatory",183.4,171.89634309871283,19.882034336099096,1.3288203585307758,4.1596078290019101,73.927611085633231,81.9961156788887]
["Hywel Dda_Circulatory",157.5,150.94600446544194,22.103846860627598,1.491075474732118,4.3216513125713352,50.03886556370842,98.449947328307303]
["Abertawe Bro Morgannwg University_Circulatory",150.80000000000001,151.38146115318659,23.343784242752104,2.2796829207626339,4.1523782906168352,50.959631952465266,102.10087566515701]
["Cardiff and Vale University_Circulatory",104.4,110.1453806500956,21.220607242497422,0.56424971666947987,3.0215706571916181,30.560431293881646,67.192754227927594]
["Cwm Taf_Circulatory",154.6,158.54772512128494,26.268038351461513,1.1223215459445248,4.0810430134710538,39.928333759918097,110.871027429492]
["Aneurin Bevan_Circulatory",135.1,137.45214438127982,23.799081531332941,1.0748388693723283,4.0670503779767966,40.014544417014186,96.688756748988695]
["Wales_Circulatory",148.1,148.10854146428088,22.849609494455528,1.2609671641364582,3.9930460725943315,48.882279474435734,94.314415067277295]
["Betsi Cadwaladr University_Respiratory",124.9,121.63376898721735,22.364305427236104,1.0568230395338896,2.4078929309708119,93.09394169136398,300.15984240151187,19.063622698777088,13.107637719004444]
["Powys Teaching_Respiratory",117.3,110.00915101141345,19.882034336099096,1.3288203585307758,2.1079191147316441,93.737291581943879,191.96118675116969,13.992511208001478,14.269579410165733]
["Hywel Dda_Respiratory",106.1,101.72093424497538,22.103846860627598,1.491075474732118,2.0289825533996413,93.182164054177434,209.53227243927637,17.767594044457823,14.071304329564741]
["Abertawe Bro Morgannwg University_Respiratory",114.6,115.09325703575009,23.343784242752104,2.2796829207626339,2.0744423626063471,92.001767565178966,267.66740691783468,18.724382042399068,13.990404742386565]
["Cardiff and Vale University_Respiratory",98.2,103.58037977808223,21.220607242497422,0.56424971666947987,1.4534314411213385,93.169621076597821,204.30610011853744,15.494219582239021,13.501348561278848]
["Cwm Taf_Respiratory",139.1,142.61496742552706,26.268038351461513,1.1223215459445248,2.647588967066016,94.443589348930274,365.156556607798,21.681445363989582,14.668181813728673]
["Aneurin Bevan_Respiratory",114.5,116.49745009334823,23.799081531332941,1.0748388693723283,2.0754483776895145,93.389469608981798,329.51107446010815,18.593991682497823,14.239104964261484]
["Wales_Respiratory",115.8,115.77577742262334,22.849609494455528,1.2609671641364582,2.1017171981624454,93.176051395562283,276.00897274993196,18.239375862174821,13.8474336089846]
["Betsi Cadwaladr University_Cancers",130.69999999999999,127.3083609896335,22.364305427236104,35.654845734362894,87.662517289073307,634.89969409378375,88.6,69.8,309.55777292735877]
["Powys Teaching_Cancers",131,122.83744660514961,19.882034336099096,39.895742619320124,82.369942196531781,635.48265734605218,"n/a",72,290.66239471831841]
["Hywel Dda_Cancers",130.1,124.66418471999143,22.103846860627598,38.479008584274254,85.465116279069761,602.3977699621139,81,69,298.08386071315419]
["Abertawe Bro Morgannwg University_Cancers",121.5,122.02948195867268,23.343784242752104,32.647268661581492,88.246338715734126,578.1147406434668,76,67.599999999999994,285.76253851204604]
["Cardiff and Vale University_Cancers",86.1,90.841551051625245,21.220607242497422,33.646030842986093,83.493205435651475,496.44060206438462,90,70.099999999999994,239.61686009702035]
["Cwm Taf_Cancers",124.1,127.28021270737558,26.268038351461513,30.122027288898877,91.961414790996784,559.17290407870519,86.5,65.5,286.54611479398022]
["Aneurin Bevan_Cancers",103.4,105.24250111658392,23.799081531332941,30.584188547467956,86.290801186943625,567.39806049305298,93.2,67.599999999999994,273.37724825173711]
["Wales_Cancers",116.4,116.45507557477568,22.849609494455528,33.914006207873797,86.578162109493945,580.32019800326293,85.7,68.599999999999994,283.67468021295065]
["Betsi Cadwaladr University_Healthy Individuals",36.4,35.466553704455386,11.921540073784639,85.09171328216469,70.037831021437583,52.075706292740207,17.851011865158501,54.128308988993901,65.700066639723602,67.880725350169001,60.930549304845599,62.974339314322201]
["Powys Teaching_Healthy Individuals",65.2,61.091147385436564,0.86127392321704876,84.74842767295597,67.682834349501022,49.277091521617066,19.824037858530559,56.899995355102419,67.702299038366604,67.4719126829049,62.468601925033497,63.339004907237801]
["Hywel Dda_Healthy Individuals",49.5,47.440316272136556,7.9324119858782458,80.795395081109362,65.38167894100097,48.012331253263056,20.196774795760092,56.975941367040207,64.011898111369405,65.679454595679402,59.493332594320798,61.236573750440002]
["Abertawe Bro Morgannwg University_Healthy Individuals",42.8,42.962721280550674,26.637982119392987,82.572324851864764,65.36501370595046,45.209436687530093,21.004508206738311,56.992587257285201,61.7451871236184,64.475854547948302,57.577114735301002,59.496278380988201]
["Cardiff and Vale University_Healthy Individuals",44.7,47.175465918911193,22.115099886273416,79.189686924493557,69.260752869454961,51.475823348725569,18.681580157480017,51.266207455429502,64.183417887689998,66.254720294352396,60.128292230873299,62.496073896038098]
["Cwm Taf_Healthy Individuals",79.8,81.821495128983031,34.171815949904833,84.971590909090907,65.947634632549835,51.016839974233918,24.509174044473109,56.585744492920419,59.962055812735102,60.6242107829312,56.105130808694597,58.482767250787397]
["Aneurin Bevan_Healthy Individuals",47.2,48.057909190304173,22.870221937230596,80.940060370849508,68.094842310045948,50.204451150509243,22.337943088705355,54.826901933442386,61.959426057131097,63.389162516298597,57.894760937860497,60.067681693179502]
["Wales_Healthy Individuals",47.8,47.840739347978229,19.182485539327377,82.357966680905591,67.656556146045034,49.701693754935491,20.360005555949069,55.153879497182487,63.464981492925503,65.260581855773495,59.149713210280602,61.168295931220896]
["Betsi Cadwaladr University_Mental health problems",197.3,192.18489189334767,12.683751849850838,0.78103002579379954,34.15300546448087,624.82402063503969,178.54167971973425,77.777760000000001,9.3612371316683891]
["Powys Teaching_Mental health problems",211.2,197.99674681908212,9.9707957835629148,0.86147857117110616,38.111157542833261,"n/a",105.75407416317704,79.822099999999992,7.7114894034337649]
["Hywel Dda_Mental health problems",198.9,190.66242777131768,12.966342341113169,0.8402290885374204,34.372436423297785,424.1908527637371,127.94526046062046,75.751429999999999,9.0193474441450459]
["Abertawe Bro Morgannwg University_Mental health problems",213.6,214.45690841901447,16.313838525463201,0.95466271464741648,42.812895959453748,662.12258001643818,160.05721964765425,73.592159999999993,11.793640989139027]
["Cardiff and Vale University_Mental health problems",216.5,228.50762994354196,13.114914765542011,0.80715105055535352,44.384328358208961,568.98210316535278,262.00761375034193,74.618960000000001,10.448458400025528]
["Cwm Taf_Mental health problems",267.3,274.04972713522051,19.859394972305068,0.84838416305786024,38.774952146568225,607.71140003437245,122.28763188578903,70.010239999999996,13.518169761142923]
["Aneurin Bevan_Mental health problems",191.9,195.2274315773725,16.637767861789754,0.81791974131221257,40.930170928845897,579.07448297517681,253.71540844121313,71.45165999999999,11.77706820238733]
["Wales_Mental health problems",209.5,209.51565813251437,14.735331626083429,0.83894776957612816,38.53087582402798,562.63651540179399,188.15416513841257,74.51558,10.661800714856984]
["Betsi Cadwaladr University_Musculoskeletal",124.6,121.32959614241071,55.453128893010394,31.513717680126575,11.915482307405906,118.16972436292531,145.27153537587733,8.4511023588775185,6.6540288687713796]
["Powys Teaching_Musculoskeletal",108.9,102.05574863616461,56.052874762871866,37.05354378909761,11.251918950213854,172.16362310450859,184.69372667834472,10.52528700202236,6.5156538583947929]
["Hywel Dda_Musculoskeletal",132,126.49663251504195,56.807935066245733,31.759769003344967,12.407132071839536,143.98223488821878,166.59173981893116,13.583229706435734,12.882159786103568]
["Abertawe Bro Morgannwg University_Musculoskeletal",122.3,122.84368387807666,58.881989381024539,28.097779455253967,13.529544884968042,66.027644953638372,152.03819126934752,6.2082800348181033,7.7603500435226298]
["Cardiff and Vale University_Musculoskeletal",97.4,102.78238682223996,51.830200560728947,27.128143271325371,10.503770677114222,71.735091638552021,130.64762469225857,10.258046867876356,9.6169189386340843]
["Cwm Taf_Musculoskeletal",103.3,105.88149797068937,63.262391360416629,26.977753078472816,16.664057363636974,82.70056593578478,120.353780962944,6.8253561982765971,6.8253561982765971]
["Aneurin Bevan_Musculoskeletal",112.9,114.86289930195539,60.117931307631636,28.584447698889225,14.102119246266614,85.422353516321579,128.97441562817326,8.8727902837727104,8.640821910340744]
["Wales_Musculoskeletal",116,116.01570252681938,57.281228133883829,29.562431807522838,12.858410745954387,99.206771932918286,144.19944669280349,9.0793862859311805,8.5658710567629903]
["England_Circulatory",131.45440222442679,"n/a","n/a","n/a",3.3777996839000002,"n/a",74.975891048186597]
["England_Respiratory",83.824984014216909,"n/a","n/a","n/a",1.6902271545000001,93.134556257904507,"n/a",13.984080725078909,"n/a"]
["England_Cancers",104.51665529188635,"n/a","n/a","n/a","n/a",484.88245345378323,86.2,"n/a",248.3603312016424]
["England_Healthy Individuals",38.251208506233226,"n/a","n/a","n/a",73.400000000000006,51.3,"n/a","n/a","n/a","n/a","n/a","n/a"]
["England_Mental health problems",211.97717237708861,"n/a",11.6,0.81513198239999995,44.2,"n/a","n/a","n/a","n/a"]
["England_Musculoskeletal",98.028238481581326,"n/a","n/a","n/a","n/a","n/a","n/a","n/a","n/a"]