{"text_format":"1","workbook":"xlsx","n_sheets":6,"sheets":["README","Copy tables and charts","HBcomp","HB comp controls","Chart data","Table data"],"not_rendered":{"charts":1,"images":6,"macros":1,"external_links":0,"defined_names":0,"comments":0,"pivot_tables":0},"unopened":[],"bounds":{"document_bytes":16777216,"sheet_cells":100000,"rows_first":2000,"rows_last":500,"rows_between":2000,"halvings":0,"cell_chars":16384,"cell_head_chars":4096},"cells_cut":0,"cells_raw":0,"read":"whole","date_system":"1900"}

{"sheet":"README","index":0,"n_rows":21,"n_cols":4,"rows_kept":21,"cut":false,"hidden":false,"merged":[[10,3,10,4],[11,3,11,5]]}
[]
[]
[]
[]
[]
[]
[]
[]
[]
["TOPIC:","NHS Expenditure & Health Tool (NEHT)",null,"Contents (click links to access):"]
["SUBJECT:","Interactive spreadsheet",null,"Chart"]
["SOURCE: ","Various, for full details visit",null,"How to copy tables and charts"]
[null,"www.publichealthwalesobservatory.org/NEHT"]
["GEOGRAPHY:","England, Wales and Local Health Boards"]
["PERIOD:","Various, for full details visit"]
[null,"www.publichealthwalesobservatory.org/NEHT"]
["DEMOGRAPHY:","Various, for full details visit"]
[null,"www.publichealthwalesobservatory.org/NEHT"]
["STATISTICS:","Various, for full details visit"]
[null,"www.publichealthwalesobservatory.org/NEHT"]
["NOTES:"]

{"sheet":"Copy tables and charts","index":1,"n_rows":35,"n_cols":13,"rows_kept":35,"cut":false,"hidden":false,"merged":[]}
[]
[null,null,null,null,null,null,null,null,null,null,null,null,"Figure 1"]
[]
[]
[]
[]
["Copying and pasting charts and tables to use in documents, reports or presentations"]
[]
["Why use this method to copy and paste charts "]
["If the standard {Copy} and {Paste} option is used for inserting Excel charts into documents, reports"]
["or presentations then frequently the chart will lose some of its formatting and/or the axes labels may be"]
["truncated. Similarly, table column sizes are often distorted using the standard {Copy} and {Paste}"]
["method if a table is too wide. The technique descibed below overcomes these issues."]
[]
["Copying and pasting a chart"]
[1,"Select the chart you want to copy by left clicking on it once i.e. so that the surronding points are "]
[null,"displayed "]
[2,"On the 'Home' tab click the paste icon"]
[3,"Click 'As picture' option and 'Copy as picture' (see figure 1)"]
[4,"Choose 'As shown on screen' and 'picture'"]
[5,"Using your mouse click on the point where you want to insert a copy of the chart e.g. in a Word "]
[null,"document / presentation"]
[6,"On the 'Home' tab click 'paste' then 'paste special' and choose to insert as 'Picture (enhanced metafile)' "]
[]
[null,null,null,null,null,null,null,null,null,null,null,null,"Figure 2"]
[]
["Copying and pasting a table as a picture"]
[1,"Highlight the table you want to copy by left clicking on the top left hand corner "]
[null,"and dragging the mouse to the bottom right corner. "]
[2,"On the 'Home' tab click the paste icon"]
{"$rows_left_out":6}
{"sheet":"HBcomp","index":2,"n_rows":47,"n_cols":12,"rows_kept":47,"cut":false,"hidden":false,"merged":[[34,0,34,7],[80,11,80,12],[7,9,7,14],[8,11,8,12],[20,9,20,14],[26,11,26,12],[46,0,46,6]]}
[]
[]
[]
[]
[]
[]
[]
[]
[]
[]
[]
[]
[]
[]
[]
[]
[]
[]
[]
[]
[]
[]
[]
[]
[]
[]
[]
[]
[]
[]
{"$rows_left_out":18}
{"sheet":"HB comp controls","index":3,"n_rows":131,"n_cols":13,"rows_kept":131,"cut":false,"hidden":true,"merged":[]}
[]
[null,"Measure","Programme budget","Expenditure"]
["Current selection (list number)",1,1,1,{"$f":"IF(D3=1,2,3)","v":2}]
["Current selection",{"$f":"INDEX(H21:H30,B3,1)","v":"Smoking"},{"$f":"INDEX(A11:C16,C3, 2)","v":"Circulatory"},{"$f":"C4&\" \"&B4","v":"Circulatory Smoking"}]
[null,null,{"$f":"INDEX(A11:C16,C3,1)","v":"Circulatory system"}]
[null,null,{"$f":"INDEX(A11:C16,C3,3)","v":"problems of the circulatory system"}]
[]
[]
["Values for list boxes:"]
["Programme budget line:"]
["Circulatory system","Circulatory","problems of the circulatory system"]
["Respiratory system","Respiratory","problems of the respiratory system"]
["Cancers & tumours","Cancers","cancers & tumours"]
["Musculoskeletal (excl. Trauma)","Musculoskeletal","musculoskeletal (excl. trauma)"]
["Healthy Individuals","Healthy Individuals","healthy individuals"]
["Mental health disorders","Mental health problems","mental health disorders"]
[]
[]
["Measure:"]
["Circulatory","Respiratory","Cancers & tumours","Musculoskeletal system problems (exc Trauma)","Healthy Individuals","Mental health disorders",null,"Measures chosen"]
["Smoking","Smoking","Smoking","Overweight or obese","Deprivation","Benefit claimants",null,{"$f":"IF(INDEX(A21:F29,,$C$3)=0,\"\",INDEX('HB comp controls'!A21:F29,,'HB comp controls'!$C$3))","v":"Smoking"}]
["Smoking cessation","Smoking cessation","Healthy eating","Physical activity","Childhood vaccinations","QOF register",null,{"$f":"IF(INDEX(A22:F30,,$C$3)=0,\"\",INDEX('HB comp controls'!A22:F30,,'HB comp controls'!$C$3))","v":"Smoking cessation"}]
["QOF register","QOF register","HPV vaccination","Currently being treated","Flu vaccination, 65+","Dementia",null,{"$f":"IF(INDEX(A23:F31,,$C$3)=0,\"\",INDEX('HB comp controls'!A23:F31,,'HB comp controls'!$C$3))","v":"QOF register"}]
["Elective admissions","Flu immunisation","Incidence","Hip replacements","Flu vaccination, at risk","Care & treatment plan",null,{"$f":"IF(INDEX(A24:F32,,$C$3)=0,\"\",INDEX('HB comp controls'!A24:F32,,'HB comp controls'!$C$3))","v":"Elective admissions"}]
["Mortality","Emergency admissions","Treatment","Knee replacements","General health","Emergency admissions",null,{"$f":"IF(INDEX(A25:F33,,$C$3)=0,\"\",INDEX('HB comp controls'!A25:F33,,'HB comp controls'!$C$3))","v":"Mortality"}]
[null,"Mortality","Survival","Hip revisions","Bowel screening","No mental health problems",null,{"$f":"IF(INDEX(A26:F34,,$C$3)=0,\"\",INDEX('HB comp controls'!A26:F34,,'HB comp controls'!$C$3))","v":""}]
[null,"Currently being treated","Mortality","Knee revisions","HLE males","Currently being treated",null,{"$f":"IF(INDEX(A27:F34,,$C$3)=0,\"\",INDEX('HB comp controls'!A27:F34,,'HB comp controls'!$C$3))","v":""}]
[null,null,null,null,"HLE females",null,null,{"$f":"IF(INDEX(A28:F34,,$C$3)=0,\"\",INDEX('HB comp controls'!A28:F34,,'HB comp controls'!$C$3))","v":""}]
[null,null,null,null,"DFLE males",null,null,{"$f":"IF(INDEX(A29:F34,,$C$3)=0,\"\",INDEX('HB comp controls'!A29:F34,,'HB comp controls'!$C$3))","v":""}]
[null,null,null,null,"DFLE females",null,null,{"$f":"IF(INDEX(A30:F34,,$C$3)=0,\"\",INDEX('HB comp controls'!A30:F34,,'HB comp controls'!$C$3))","v":""}]
{"$rows_left_out":102}
{"sheet":"Chart data","index":4,"n_rows":387,"n_cols":4,"rows_kept":387,"cut":false,"hidden":true,"merged":[]}
[]
["HB_ProgrammeBudget_Measure","crude","adjusted","Outcome"]
["Betsi Cadwaladr University_Circulatory_Smoking",172.2,167.69685575028578,22.364305427236104]
["Powys Teaching_Circulatory_Smoking",183.4,171.89634309871283,19.882034336099096]
["Hywel Dda_Circulatory_Smoking",157.5,150.94600446544194,22.103846860627598]
["Abertawe Bro Morgannwg University_Circulatory_Smoking",150.80000000000001,151.38146115318659,23.343784242752104]
["Cardiff and Vale University_Circulatory_Smoking",104.4,110.1453806500956,21.220607242497422]
["Cwm Taf_Circulatory_Smoking",154.6,158.54772512128494,26.268038351461513]
["Aneurin Bevan_Circulatory_Smoking",135.1,137.45214438127982,23.799081531332941]
["Wales_Circulatory_Smoking",148.1,148.10854146428088,22.849609494455528]
["Betsi Cadwaladr University_Circulatory_Smoking cessation",172.2,167.69685575028578,1.0568230395338896]
["Powys Teaching_Circulatory_Smoking cessation",183.4,171.89634309871283,1.3288203585307758]
["Hywel Dda_Circulatory_Smoking cessation",157.5,150.94600446544194,1.491075474732118]
["Abertawe Bro Morgannwg University_Circulatory_Smoking cessation",150.80000000000001,151.38146115318659,2.2796829207626339]
["Cardiff and Vale University_Circulatory_Smoking cessation",104.4,110.1453806500956,0.56424971666947987]
["Cwm Taf_Circulatory_Smoking cessation",154.6,158.54772512128494,1.1223215459445248]
["Aneurin Bevan_Circulatory_Smoking cessation",135.1,137.45214438127982,1.0748388693723283]
["Wales_Circulatory_Smoking cessation",148.1,148.10854146428088,1.2609671641364582]
["Betsi Cadwaladr University_Circulatory_QOF register",172.2,167.69685575028578,4.2424645459060297]
["Powys Teaching_Circulatory_QOF register",183.4,171.89634309871283,4.1596078290019101]
["Hywel Dda_Circulatory_QOF register",157.5,150.94600446544194,4.3216513125713352]
["Abertawe Bro Morgannwg University_Circulatory_QOF register",150.80000000000001,151.38146115318659,4.1523782906168352]
["Cardiff and Vale University_Circulatory_QOF register",104.4,110.1453806500956,3.0215706571916181]
["Cwm Taf_Circulatory_QOF register",154.6,158.54772512128494,4.0810430134710538]
["Aneurin Bevan_Circulatory_QOF register",135.1,137.45214438127982,4.0670503779767966]
["Wales_Circulatory_QOF register",148.1,148.10854146428088,3.9930460725943315]
["Abertawe Bro Morgannwg University_Circulatory_Elective admissions",150.80000000000001,151.38146115318659,50.959631952465266]
["Aneurin Bevan_Circulatory_Elective admissions",135.1,137.45214438127982,40.014544417014186]
["Betsi Cadwaladr University_Circulatory_Elective admissions",172.2,167.69685575028578,64.208950105954486]
["Cardiff and Vale University_Circulatory_Elective admissions",104.4,110.1453806500956,30.560431293881646]
{"$rows_left_out":358}
{"sheet":"Table data","index":5,"n_rows":56,"n_cols":13,"rows_kept":56,"cut":false,"hidden":true,"merged":[[0,3,0,12]]}
[null,null,null,"Measures"]
["HB_ProgrammeBudget","crude exp","adj exp",4,5,6,7,8,9,10,11,12,13]
["Betsi Cadwaladr University_Circulatory",172.2,167.69685575028578,22.364305427236104,1.0568230395338896,4.2424645459060297,64.208950105954486,98.209786599879706]
["Powys Teaching_Circulatory",183.4,171.89634309871283,19.882034336099096,1.3288203585307758,4.1596078290019101,73.927611085633231,81.9961156788887]
["Hywel Dda_Circulatory",157.5,150.94600446544194,22.103846860627598,1.491075474732118,4.3216513125713352,50.03886556370842,98.449947328307303]
["Abertawe Bro Morgannwg University_Circulatory",150.80000000000001,151.38146115318659,23.343784242752104,2.2796829207626339,4.1523782906168352,50.959631952465266,102.10087566515701]
["Cardiff and Vale University_Circulatory",104.4,110.1453806500956,21.220607242497422,0.56424971666947987,3.0215706571916181,30.560431293881646,67.192754227927594]
["Cwm Taf_Circulatory",154.6,158.54772512128494,26.268038351461513,1.1223215459445248,4.0810430134710538,39.928333759918097,110.871027429492]
["Aneurin Bevan_Circulatory",135.1,137.45214438127982,23.799081531332941,1.0748388693723283,4.0670503779767966,40.014544417014186,96.688756748988695]
["Wales_Circulatory",148.1,148.10854146428088,22.849609494455528,1.2609671641364582,3.9930460725943315,48.882279474435734,94.314415067277295]
["Betsi Cadwaladr University_Respiratory",124.9,121.63376898721735,22.364305427236104,1.0568230395338896,2.4078929309708119,93.09394169136398,300.15984240151187,19.063622698777088,13.107637719004444]
["Powys Teaching_Respiratory",117.3,110.00915101141345,19.882034336099096,1.3288203585307758,2.1079191147316441,93.737291581943879,191.96118675116969,13.992511208001478,14.269579410165733]
["Hywel Dda_Respiratory",106.1,101.72093424497538,22.103846860627598,1.491075474732118,2.0289825533996413,93.182164054177434,209.53227243927637,17.767594044457823,14.071304329564741]
["Abertawe Bro Morgannwg University_Respiratory",114.6,115.09325703575009,23.343784242752104,2.2796829207626339,2.0744423626063471,92.001767565178966,267.66740691783468,18.724382042399068,13.990404742386565]
["Cardiff and Vale University_Respiratory",98.2,103.58037977808223,21.220607242497422,0.56424971666947987,1.4534314411213385,93.169621076597821,204.30610011853744,15.494219582239021,13.501348561278848]
["Cwm Taf_Respiratory",139.1,142.61496742552706,26.268038351461513,1.1223215459445248,2.647588967066016,94.443589348930274,365.156556607798,21.681445363989582,14.668181813728673]
["Aneurin Bevan_Respiratory",114.5,116.49745009334823,23.799081531332941,1.0748388693723283,2.0754483776895145,93.389469608981798,329.51107446010815,18.593991682497823,14.239104964261484]
["Wales_Respiratory",115.8,115.77577742262334,22.849609494455528,1.2609671641364582,2.1017171981624454,93.176051395562283,276.00897274993196,18.239375862174821,13.8474336089846]
["Betsi Cadwaladr University_Cancers",130.69999999999999,127.3083609896335,22.364305427236104,35.654845734362894,87.662517289073307,634.89969409378375,88.6,69.8,309.55777292735877]
["Powys Teaching_Cancers",131,122.83744660514961,19.882034336099096,39.895742619320124,82.369942196531781,635.48265734605218,"n/a",72,290.66239471831841]
["Hywel Dda_Cancers",130.1,124.66418471999143,22.103846860627598,38.479008584274254,85.465116279069761,602.3977699621139,81,69,298.08386071315419]
["Abertawe Bro Morgannwg University_Cancers",121.5,122.02948195867268,23.343784242752104,32.647268661581492,88.246338715734126,578.1147406434668,76,67.599999999999994,285.76253851204604]
["Cardiff and Vale University_Cancers",86.1,90.841551051625245,21.220607242497422,33.646030842986093,83.493205435651475,496.44060206438462,90,70.099999999999994,239.61686009702035]
["Cwm Taf_Cancers",124.1,127.28021270737558,26.268038351461513,30.122027288898877,91.961414790996784,559.17290407870519,86.5,65.5,286.54611479398022]
["Aneurin Bevan_Cancers",103.4,105.24250111658392,23.799081531332941,30.584188547467956,86.290801186943625,567.39806049305298,93.2,67.599999999999994,273.37724825173711]
["Wales_Cancers",116.4,116.45507557477568,22.849609494455528,33.914006207873797,86.578162109493945,580.32019800326293,85.7,68.599999999999994,283.67468021295065]
["Betsi Cadwaladr University_Healthy Individuals",36.4,35.466553704455386,11.921540073784639,85.09171328216469,70.037831021437583,52.075706292740207,17.851011865158501,54.128308988993901,65.700066639723602,67.880725350169001,60.930549304845599,62.974339314322201]
["Powys Teaching_Healthy Individuals",65.2,61.091147385436564,0.86127392321704876,84.74842767295597,67.682834349501022,49.277091521617066,19.824037858530559,56.899995355102419,67.702299038366604,67.4719126829049,62.468601925033497,63.339004907237801]
["Hywel Dda_Healthy Individuals",49.5,47.440316272136556,7.9324119858782458,80.795395081109362,65.38167894100097,48.012331253263056,20.196774795760092,56.975941367040207,64.011898111369405,65.679454595679402,59.493332594320798,61.236573750440002]
["Abertawe Bro Morgannwg University_Healthy Individuals",42.8,42.962721280550674,26.637982119392987,82.572324851864764,65.36501370595046,45.209436687530093,21.004508206738311,56.992587257285201,61.7451871236184,64.475854547948302,57.577114735301002,59.496278380988201]
{"$rows_left_out":26}