{"text_format":"1","workbook":"xlsx","n_sheets":8,"sheets":["Readme","QC","Overview table","Interactive","Interactive controls","Copy tables and charts","Overview (controls)","All Data"],"not_rendered":{"charts":1,"images":4,"macros":1,"external_links":1,"defined_names":19,"comments":0,"pivot_tables":0},"unopened":[],"bounds":{"document_bytes":16777216,"sheet_cells":100000,"rows_first":2000,"rows_last":500,"rows_between":2000,"halvings":0,"cell_chars":16384,"cell_head_chars":4096},"cells_cut":0,"cells_raw":0,"read":"whole","date_system":"1900"}

{"sheet":"Readme","index":0,"n_rows":32,"n_cols":2,"rows_kept":32,"cut":false,"hidden":false,"merged":[[9,0,12,0],[5,0,5,1]]}
[]
[]
[]
[]
[]
["This file contains macros which need to be enabled. For some PC setups this file needs to be saved locally to ensure functionality."]
[]
["TOPIC:","Our Healthy Future"]
{"$rows_left_out":25}
{"sheet":"QC","index":1,"n_rows":92,"n_cols":6,"rows_kept":92,"cut":false,"hidden":true,"merged":[[81,3,81,4],[43,4,43,5],[45,4,45,5],[35,4,35,5],[36,4,36,5],[38,4,38,5],[40,4,40,5],[41,4,41,5],[42,4,42,5],[79,4,79,5],[69,4,69,5],[72,4,72,5],[73,4,73,5],[74,4,74,5],[77,4,77,5],[78,4,78,5],[34,4,34,5],[15,4,15,5],[24,4,24,5],[26,4,26,5],[27,4,27,5],[28,4,28,5],[31,4,31,5],[68,4,68,5],[52,4,52,5],[55,4,55,5],[56,4,56,5],[57,4,57,5],[58,4,58,5],[63,4,63,5],[64,4,64,5],[65,4,65,5],[66,4,66,5],[67,4,67,5],[61,0,62,0],[61,4,61,5],[62,4,62,5],[46,4,46,5],[49,4,49,5],[50,4,50,5],[51,4,51,5]]}
["OAT Quality Control"]
[]
["Audit trail"]
[]
["Date","Name","Items QA'd",null,"Time taken","Additional notes / changes made"]
["2012-10-04","Dee Hickey","see end of sheet",null,"2 days ","inserted readme sheet"]
["2012-10-05","Dee Hickey","plus 'copy tables&charts', 'interactive guide' and 'table guide' tabs & formatting"]
["2012-10-10","Dee Hickey","spot checked length of error bars"]
{"$rows_left_out":85}
{"sheet":"Overview table","index":2,"n_rows":45,"n_cols":65,"rows_kept":45,"cut":false,"hidden":false,"merged":[[40,12,42,24],[1,65,1,66],[1,67,1,68],[1,29,1,30],[1,31,1,32],[1,33,1,34],[1,43,1,44],[1,45,1,46],[1,61,1,62],[1,35,1,36],[1,37,1,38],[1,39,1,40],[1,41,1,42],[1,49,1,50],[1,51,1,52],[1,53,1,54],[1,59,1,60],[3,2,3,3],[3,5,3,7],[3,11,3,14],[1,63,1,64],[3,21,3,25],[1,55,1,56],[1,47,1,48],[1,57,1,58]]}
[]
[null,null,null,null,null,null,null,null,null,null,null,null,null,null,null,null,null,null,null,null,null,null,null,null,null,null,null,null,null,"M",null,"F",null,"M",null,"F",null,"P",null,"P",null,"P",null,"P",null,"P",null,"P",null,"P",null,"M",null,"F",null,"F",null,"P",null,"M",null,"F",null,"P"]
[]
[null,null,null,null,null,null,null,null,null,null,null,null,null,null,null,null,null,null,null,null,null,null,null,null,null,null,null,null,null,"HLE","HLE","HLE","HLE","LE","LE","LE","LE","MENT","MENT","EMP","EMP","SMO","SMO","ACT","ACT","FRU","FRU","OBE","OBE","ALC","ALC","ALC","ALC","ALC","ALC","CONCEP","CONCEP","HIP","HIP","HIP","HIP","HIP","HIP","VACC","VACC"]
[]
[null,null,null,null,null,null,null,null,null,null,null,null,null,null,null,null,null,null,null,null,null,null,null,null,null,null,null,null,null,"LCL","UCL","LCL","UCL","LCL","UCL","LCL","UCL","LCL","UCL","LCL","UCL","LCL","UCL","LCL","UCL","LCL","UCL","LCL","UCL","LCL","UCL","LCL","UCL","LCL","UCL","LCL","UCL","LCL","UCL","LCL","UCL","LCL","UCL","LCL","UCL"]
[null,"Isle of Anglesey",null,null,null,{"$f":"VLOOKUP(($B7&\"_\"&AF$44&\"_\"&AF$43&\"_\"&AF$45&\"_\"&$AC7),'All Data'!$A$2:$L$1048576,8,FALSE)","v":6.8199509999999997},{"$f":"VLOOKUP(($B7&\"_\"&AG$44&\"_\"&AG$43&\"_\"&AG$45&\"_\"&$AC7),'All Data'!$A$2:$L$1048576,8,FALSE)","v":4.5579559999999999},null,{"$f":"VLOOKUP(($B7&\"_\"&AH$44&\"_\"&AH$43&\"_\"&AH$45&\"_\"&$AC7),'All Data'!$A$2:$L$1048576,8,FALSE)","v":77.081630000000004},{"$f":"VLOOKUP(($B7&\"_\"&AJ$44&\"_\"&AJ$43&\"_\"&AJ$45&\"_\"&$AC7),'All Data'!$A$2:$L$1048576,8,FALSE)","v":23.887846218788951},{"$f":"VLOOKUP(($B7&\"_\"&AL$44&\"_\"&AL$43&\"_\"&AL$45&\"_\"&$AC7),'All Data'!$A$2:$L$1048576,8,FALSE)","v":2.5100356293876294},{"$f":"VLOOKUP(($B7&\"_\"&AM$44&\"_\"&AM$43&\"_\"&AM$45&\"_\"&$AC7),'All Data'!$A$2:$L$1048576,8,FALSE)","v":37.704562938468868},{"$f":"VLOOKUP(($B7&\"_\"&AN$44&\"_\"&AN$43&\"_\"&AN$45&\"_\"&$AC7),'All Data'!$A$2:$L$1048576,8,FALSE)","v":54.165547923818572},null,{"$f":"VLOOKUP(($B7&\"_\"&AO$44&\"_\"&AO$43&\"_\"&AO$45&\"_\"&$AC7),'All Data'!$A$2:$L$1048576,8,FALSE)","v":404.13981999999999},{"$f":"VLOOKUP(($B7&\"_\"&AP$44&\"_\"&AP$43&\"_\"&AP$45&\"_\"&$AC7),'All Data'!$A$2:$L$1048576,8,FALSE)","v":580.31137999999999},{"$f":"VLOOKUP(($B7&\"_\"&AQ$44&\"_\"&AQ$43&\"_\"&AQ$45&\"_\"&$AC7),'All Data'!$A$2:$L$1048576,8,FALSE)","v":232.21964},null,{"$f":"VLOOKUP(($B7&\"_\"&AR$44&\"_\"&AR$43&\"_\"&AR$45&\"_\"&$AC7),'All Data'!$A$2:$L$1048576,8,FALSE)","v":34.008097165991899},null,{"$f":"VLOOKUP(($B7&\"_\"&AS$44&\"_\"&AS$43&\"_\"&AS$45&\"_\"&$AC7),'All Data'!$A$2:$L$1048576,8,FALSE)","v":789.92660000000001},{"$f":"VLOOKUP(($B7&\"_\"&AT$44&\"_\"&AT$43&\"_\"&AT$45&\"_\"&$AC7),'All Data'!$A$2:$L$1048576,8,FALSE)","v":559.97810000000004},{"$f":"VLOOKUP(($B7&\"_\"&AU$44&\"_\"&AU$43&\"_\"&AU$45&\"_\"&$AC7),'All Data'!$A$2:$L$1048576,8,FALSE)","v":904.55679999999995},null,{"$f":"VLOOKUP(($B7&\"_\"&AV$44&\"_\"&AV$43&\"_\"&AV$45&\"_\"&$AC7),'All Data'!$A$2:$L$1048576,8,FALSE)","v":82.222222222222214},null,null,null,"LA",{"$f":"'Overview (controls)'!C7","v":0},{"$f":"'Overview (controls)'!D7","v":0},{"$f":"'Overview (controls)'!E7","v":0},{"$f":"'Overview (controls)'!F7","v":0},{"$f":"'Overview (controls)'!G7","v":-8.5565299999999997E-2},{"$f":"'Overview (controls)'!H7","v":13.72547},{"$f":"'Overview (controls)'!I7","v":1.7588820000000001},{"$f":"'Overview (controls)'!J7","v":7.35703},{"$f":"'Overview (controls)'!K7","v":74.259509999999992},{"$f":"'Overview (controls)'!L7","v":79.903739999999999},{"$f":"'Overview (controls)'!M7","v":{"$error":"#N/A"}},{"$f":"'Overview (controls)'!N7","v":{"$error":"#N/A"}},{"$f":"'Overview (controls)'!O7","v":21.015519999999999},{"$f":"'Overview (controls)'!P7","v":26.760169999999999},{"$f":"'Overview (controls)'!Q7","v":2.3789169999999999},{"$f":"'Overview (controls)'!R7","v":2.6411539999999998},{"$f":"'Overview (controls)'!S7","v":34.49156},{"$f":"'Overview (controls)'!T7","v":40.917569999999998},{"$f":"'Overview (controls)'!U7","v":51.028300000000002},{"$f":"'Overview (controls)'!V7","v":57.302790000000002},{"$f":"'Overview (controls)'!W7","v":355.90109000000001},{"$f":"'Overview (controls)'!X7","v":456.84264999999999},{"$f":"'Overview (controls)'!Y7","v":498.51384000000002},{"$f":"'Overview (controls)'!Z7","v":671.28650000000005},{"$f":"'Overview (controls)'!AA7","v":182.43272999999999},{"$f":"'Overview (controls)'!AB7","v":290.67597999999998},{"$f":"'Overview (controls)'!AC7","v":24.510121457489877},{"$f":"'Overview (controls)'!AD7","v":45.969230769230769},{"$f":"'Overview (controls)'!AE7","v":663.76607000000001},{"$f":"'Overview (controls)'!AF7","v":932.65922999999998},{"$f":"'Overview (controls)'!AG7","v":398.36189999999999},{"$f":"'Overview (controls)'!AH7","v":764.63932999999997},{"$f":"'Overview (controls)'!AI7","v":732.39571999999998},{"$f":"'Overview (controls)'!AJ7","v":1103.61754},{"$f":"'Overview (controls)'!AK7","v":79.353896049810942},{"$f":"'Overview (controls)'!AL7","v":84.768544775451389}]
[null,"Gwynedd",null,null,null,{"$f":"VLOOKUP(($B8&\"_\"&AF$44&\"_\"&AF$43&\"_\"&AF$45&\"_\"&$AC8),'All Data'!$A$2:$L$1048576,8,FALSE)","v":3.4251330000000002},{"$f":"VLOOKUP(($B8&\"_\"&AG$44&\"_\"&AG$43&\"_\"&AG$45&\"_\"&$AC8),'All Data'!$A$2:$L$1048576,8,FALSE)","v":2.428353},null,{"$f":"VLOOKUP(($B8&\"_\"&AH$44&\"_\"&AH$43&\"_\"&AH$45&\"_\"&$AC8),'All Data'!$A$2:$L$1048576,8,FALSE)","v":77.978200000000001},{"$f":"VLOOKUP(($B8&\"_\"&AJ$44&\"_\"&AJ$43&\"_\"&AJ$45&\"_\"&$AC8),'All Data'!$A$2:$L$1048576,8,FALSE)","v":24.116288329025675},{"$f":"VLOOKUP(($B8&\"_\"&AL$44&\"_\"&AL$43&\"_\"&AL$45&\"_\"&$AC8),'All Data'!$A$2:$L$1048576,8,FALSE)","v":2.5006581836896564},{"$f":"VLOOKUP(($B8&\"_\"&AM$44&\"_\"&AM$43&\"_\"&AM$45&\"_\"&$AC8),'All Data'!$A$2:$L$1048576,8,FALSE)","v":40.710576856966604},{"$f":"VLOOKUP(($B8&\"_\"&AN$44&\"_\"&AN$43&\"_\"&AN$45&\"_\"&$AC8),'All Data'!$A$2:$L$1048576,8,FALSE)","v":56.101251216356729},null,{"$f":"VLOOKUP(($B8&\"_\"&AO$44&\"_\"&AO$43&\"_\"&AO$45&\"_\"&$AC8),'All Data'!$A$2:$L$1048576,8,FALSE)","v":365.87833999999998},{"$f":"VLOOKUP(($B8&\"_\"&AP$44&\"_\"&AP$43&\"_\"&AP$45&\"_\"&$AC8),'All Data'!$A$2:$L$1048576,8,FALSE)","v":484.22366},{"$f":"VLOOKUP(($B8&\"_\"&AQ$44&\"_\"&AQ$43&\"_\"&AQ$45&\"_\"&$AC8),'All Data'!$A$2:$L$1048576,8,FALSE)","v":249.91433000000001},null,{"$f":"VLOOKUP(($B8&\"_\"&AR$44&\"_\"&AR$43&\"_\"&AR$45&\"_\"&$AC8),'All Data'!$A$2:$L$1048576,8,FALSE)","v":33.712984054669704},null,{"$f":"VLOOKUP(($B8&\"_\"&AS$44&\"_\"&AS$43&\"_\"&AS$45&\"_\"&$AC8),'All Data'!$A$2:$L$1048576,8,FALSE)","v":798.90480000000002},{"$f":"VLOOKUP(($B8&\"_\"&AT$44&\"_\"&AT$43&\"_\"&AT$45&\"_\"&$AC8),'All Data'!$A$2:$L$1048576,8,FALSE)","v":508.28640000000001},{"$f":"VLOOKUP(($B8&\"_\"&AU$44&\"_\"&AU$43&\"_\"&AU$45&\"_\"&$AC8),'All Data'!$A$2:$L$1048576,8,FALSE)","v":1002.0168},null,{"$f":"VLOOKUP(($B8&\"_\"&AV$44&\"_\"&AV$43&\"_\"&AV$45&\"_\"&$AC8),'All Data'!$A$2:$L$1048576,8,FALSE)","v":85.064935064935071},null,null,null,"LA",{"$f":"'Overview (controls)'!C8","v":0},{"$f":"'Overview (controls)'!D8","v":0},{"$f":"'Overview (controls)'!E8","v":0},{"$f":"'Overview (controls)'!F8","v":0},{"$f":"'Overview (controls)'!G8","v":0.18031449999999999},{"$f":"'Overview (controls)'!H8","v":6.6699520000000003},{"$f":"'Overview (controls)'!I8","v":-3.2088549999999998},{"$f":"'Overview (controls)'!J8","v":8.0655599999999996},{"$f":"'Overview (controls)'!K8","v":75.214410000000001},{"$f":"'Overview (controls)'!L8","v":80.741990000000001},{"$f":"'Overview (controls)'!M8","v":{"$error":"#N/A"}},{"$f":"'Overview (controls)'!N8","v":{"$error":"#N/A"}},{"$f":"'Overview (controls)'!O8","v":21.190719999999999},{"$f":"'Overview (controls)'!P8","v":27.04186},{"$f":"'Overview (controls)'!Q8","v":2.3645700000000001},{"$f":"'Overview (controls)'!R8","v":2.636746},{"$f":"'Overview (controls)'!S8","v":37.3797},{"$f":"'Overview (controls)'!T8","v":44.041449999999998},{"$f":"'Overview (controls)'!U8","v":52.863050000000001},{"$f":"'Overview (controls)'!V8","v":59.339450000000006},{"$f":"'Overview (controls)'!W8","v":330.94650999999999},{"$f":"'Overview (controls)'!X8","v":403.39877000000001},{"$f":"'Overview (controls)'!Y8","v":427.42394999999999},{"$f":"'Overview (controls)'!Z8","v":546.27972999999997},{"$f":"'Overview (controls)'!AA8","v":210.11350999999999},{"$f":"'Overview (controls)'!AB8","v":294.86779000000001},{"$f":"'Overview (controls)'!AC8","v":26.471981776765375},{"$f":"'Overview (controls)'!AD8","v":42.323462414578593},{"$f":"'Overview (controls)'!AE8","v":696.38687000000004},{"$f":"'Overview (controls)'!AF8","v":911.86860999999999},{"$f":"'Overview (controls)'!AG8","v":383.79665},{"$f":"'Overview (controls)'!AH8","v":659.95825000000002},{"$f":"'Overview (controls)'!AI8","v":850.11874999999998},{"$f":"'Overview (controls)'!AJ8","v":1171.85617},{"$f":"'Overview (controls)'!AK8","v":82.965694500450965},{"$f":"'Overview (controls)'!AL8","v":86.946177700646672}]
{"$rows_left_out":38}
{"sheet":"Interactive","index":3,"n_rows":43,"n_cols":18,"rows_kept":43,"cut":false,"hidden":false,"merged":[[5,13,5,17],[7,15,7,16],[42,13,43,17]]}
[]
[]
[]
[]
[]
[null,null,null,null,null,null,null,null,null,null,null,null,null,{"$f":"'Interactive controls'!K48","v":"Inequality gap in life expectancy (SII in years), males, all ages, Wales health boards and local authorities, 2005-2009"}]
[]
[null,null,null,null,null,null,null,null,null,null,null,null,null,null,{"$f":"'Interactive controls'!K47","v":" "},{"$f":"'Interactive controls'!A18","v":"SII in LE (95% CI)"},null,{"$f":"'Interactive controls'!K49","v":"Compared to Wales*"}]
{"$rows_left_out":36}
{"sheet":"Interactive controls","index":4,"n_rows":75,"n_cols":27,"rows_kept":75,"cut":false,"hidden":true,"merged":[[63,7,71,7],[4,5,4,6],[4,23,4,25],[25,6,25,7],[63,8,67,8],[56,8,57,8],[18,5,18,6],[55,6,72,6],[56,7,62,7],[6,23,6,25],[7,17,8,17],[17,8,18,8]]}
[null,null,null,null,null,"LA/HB selection"]
[null,null,null,null,null,1,"Wales health boards"]
["Current selection (list number)",4,1,null,null,{"$f":"INDEX(G2:G3,F2)","v":"Wales health boards"},"Wales local authorities"]
["Current selection"]
[null,null,null,null,null,"For year selection ",null,null,null,null,null,null,null,null,null,null,null,null,null,null,null,null,null,"X,Y values for chart"]
[null,null,null,null,null,{"$f":"HLOOKUP(A15,$J$56:$V$72,14,FALSE)","v":0},1,null,null,"Data for tables"]
[null,null,null,null,null,{"$f":"HLOOKUP(A15,$J$56:$V$72,15,FALSE)","v":1},null,null,null,null,null,null,null,null,null,null,null,null,null,null,null,null,null,"Wales line"]
[null,null,null,null,null,{"$f":"HLOOKUP(A15,$J$56:$V$72,16,FALSE)","v":5},null,null,null,null,null,null,null,null,2,7,8,"For decimal places on chart",9,10,11,12,13,"Wales line","Wales line 1dp","XY","Significance"]
{"$rows_left_out":68}
{"sheet":"Copy tables and charts","index":5,"n_rows":35,"n_cols":13,"rows_kept":35,"cut":false,"hidden":false,"merged":[]}
[]
[null,null,null,null,null,null,null,null,null,null,null,null,"Figure 1"]
[]
[]
[]
[]
["Copying and pasting charts and tables to use in documents, reports or presentations"]
[]
{"$rows_left_out":28}
{"sheet":"Overview (controls)","index":6,"n_rows":36,"n_cols":38,"rows_kept":36,"cut":false,"hidden":true,"merged":[[2,1,3,1]]}
[null,null,9,10,9,10,9,10,9,10,9,10,9,10,9,10,9,10,9,10,9,10,9,10,9,10,9,10,9,10,9,10,9,10,9,10,9,10]
[null,null,"HLE","HLE","HLE","HLE","LE","LE","LE","LE","MENT","MENT","EMP","EMP","SMO","SMO","ACT","ACT","FRU","FRU","OBE","OBE","ALC","ALC","ALC","ALC","ALC","ALC","CONCEP","CONCEP","HIP","HIP","HIP","HIP","HIP","HIP","VACC","VACC"]
[null,"Complete green sections","Males","Males","Females","Females","Males","Males","Females","Females","Persons","Persons","Persons","Persons","Persons","Persons","Persons","Persons","Persons","Persons","Persons","Persons","Persons","Persons","Males","Males","Females","Females","Females","Females","Persons","Persons","Males","Males","Females","Females","Children at age 4","Children at age 4"]
[null,null,"2005-2009","2005-2009","2005-2009","2005-2009","2005-2009","2005-2009","2005-2009","2005-2009","2009-2010","2009-2010","2009-2010","2009-2010","2009-2010","2009-2010","2009-2010","2009-2010","2009-2010","2009-2010","2009-2010","2009-2010",2010,2010,2010,2010,2010,2010,2010,2010,2010,2010,2010,2010,2010,2010,"2011-2012 (FY)","2011-2012 (FY)"]
[null,null,"LCL","UCL","LCL","UCL","LCL","UCL","LCL","UCL","LCL","UCL","LCL","UCL","LCL","UCL","LCL","UCL","LCL","UCL","LCL","UCL","LCL","UCL","LCL","UCL","LCL","UCL","LCL","UCL","LCL","UCL","LCL","UCL","LCL","UCL","LCL","UCL"]
[null,"LOCAL"]
["LA","Isle of Anglesey",{"$f":"VLOOKUP(($B7&\"_\"&C$2&\"_\"&C$3&\"_\"&C$4&\"_\"&$A7),'All Data'!$A$2:$L$1048576,C$1,FALSE)","v":0},{"$f":"VLOOKUP(($B7&\"_\"&D$2&\"_\"&D$3&\"_\"&D$4&\"_\"&$A7),'All Data'!$A$2:$L$1048576,D$1,FALSE)","v":0},{"$f":"VLOOKUP(($B7&\"_\"&E$2&\"_\"&E$3&\"_\"&E$4&\"_\"&$A7),'All Data'!$A$2:$L$1048576,E$1,FALSE)","v":0},{"$f":"VLOOKUP(($B7&\"_\"&F$2&\"_\"&F$3&\"_\"&F$4&\"_\"&$A7),'All Data'!$A$2:$L$1048576,F$1,FALSE)","v":0},{"$f":"VLOOKUP(($B7&\"_\"&G$2&\"_\"&G$3&\"_\"&G$4&\"_\"&$A7),'All Data'!$A$2:$L$1048576,G$1,FALSE)","v":-8.5565299999999997E-2},{"$f":"VLOOKUP(($B7&\"_\"&H$2&\"_\"&H$3&\"_\"&H$4&\"_\"&$A7),'All Data'!$A$2:$L$1048576,H$1,FALSE)","v":13.72547},{"$f":"VLOOKUP(($B7&\"_\"&I$2&\"_\"&I$3&\"_\"&I$4&\"_\"&$A7),'All Data'!$A$2:$L$1048576,I$1,FALSE)","v":1.7588820000000001},{"$f":"VLOOKUP(($B7&\"_\"&J$2&\"_\"&J$3&\"_\"&J$4&\"_\"&$A7),'All Data'!$A$2:$L$1048576,J$1,FALSE)","v":7.35703},{"$f":"VLOOKUP(($B7&\"_\"&K$2&\"_\"&K$3&\"_\"&K$4&\"_\"&$A7),'All Data'!$A$2:$L$1048576,K$1,FALSE)","v":74.259509999999992},{"$f":"VLOOKUP(($B7&\"_\"&L$2&\"_\"&L$3&\"_\"&L$4&\"_\"&$A7),'All Data'!$A$2:$L$1048576,L$1,FALSE)","v":79.903739999999999},{"$f":"VLOOKUP(($B7&\"_\"&M$2&\"_\"&M$3&\"_\"&M$4&\"_\"&$A7),'All Data'!$A$2:$L$1048576,M$1,FALSE)","v":{"$error":"#N/A"}},{"$f":"VLOOKUP(($B7&\"_\"&N$2&\"_\"&N$3&\"_\"&N$4&\"_\"&$A7),'All Data'!$A$2:$L$1048576,N$1,FALSE)","v":{"$error":"#N/A"}},{"$f":"VLOOKUP(($B7&\"_\"&O$2&\"_\"&O$3&\"_\"&O$4&\"_\"&$A7),'All Data'!$A$2:$L$1048576,O$1,FALSE)","v":21.015519999999999},{"$f":"VLOOKUP(($B7&\"_\"&P$2&\"_\"&P$3&\"_\"&P$4&\"_\"&$A7),'All Data'!$A$2:$L$1048576,P$1,FALSE)","v":26.760169999999999},{"$f":"VLOOKUP(($B7&\"_\"&Q$2&\"_\"&Q$3&\"_\"&Q$4&\"_\"&$A7),'All Data'!$A$2:$L$1048576,Q$1,FALSE)","v":2.3789169999999999},{"$f":"VLOOKUP(($B7&\"_\"&R$2&\"_\"&R$3&\"_\"&R$4&\"_\"&$A7),'All Data'!$A$2:$L$1048576,R$1,FALSE)","v":2.6411539999999998},{"$f":"VLOOKUP(($B7&\"_\"&S$2&\"_\"&S$3&\"_\"&S$4&\"_\"&$A7),'All Data'!$A$2:$L$1048576,S$1,FALSE)","v":34.49156},{"$f":"VLOOKUP(($B7&\"_\"&T$2&\"_\"&T$3&\"_\"&T$4&\"_\"&$A7),'All Data'!$A$2:$L$1048576,T$1,FALSE)","v":40.917569999999998},{"$f":"VLOOKUP(($B7&\"_\"&U$2&\"_\"&U$3&\"_\"&U$4&\"_\"&$A7),'All Data'!$A$2:$L$1048576,U$1,FALSE)","v":51.028300000000002},{"$f":"VLOOKUP(($B7&\"_\"&V$2&\"_\"&V$3&\"_\"&V$4&\"_\"&$A7),'All Data'!$A$2:$L$1048576,V$1,FALSE)","v":57.302790000000002},{"$f":"VLOOKUP(($B7&\"_\"&W$2&\"_\"&W$3&\"_\"&W$4&\"_\"&$A7),'All Data'!$A$2:$L$1048576,W$1,FALSE)","v":355.90109000000001},{"$f":"VLOOKUP(($B7&\"_\"&X$2&\"_\"&X$3&\"_\"&X$4&\"_\"&$A7),'All Data'!$A$2:$L$1048576,X$1,FALSE)","v":456.84264999999999},{"$f":"VLOOKUP(($B7&\"_\"&Y$2&\"_\"&Y$3&\"_\"&Y$4&\"_\"&$A7),'All Data'!$A$2:$L$1048576,Y$1,FALSE)","v":498.51384000000002},{"$f":"VLOOKUP(($B7&\"_\"&Z$2&\"_\"&Z$3&\"_\"&Z$4&\"_\"&$A7),'All Data'!$A$2:$L$1048576,Z$1,FALSE)","v":671.28650000000005},{"$f":"VLOOKUP(($B7&\"_\"&AA$2&\"_\"&AA$3&\"_\"&AA$4&\"_\"&$A7),'All Data'!$A$2:$L$1048576,AA$1,FALSE)","v":182.43272999999999},{"$f":"VLOOKUP(($B7&\"_\"&AB$2&\"_\"&AB$3&\"_\"&AB$4&\"_\"&$A7),'All Data'!$A$2:$L$1048576,AB$1,FALSE)","v":290.67597999999998},{"$f":"VLOOKUP(($B7&\"_\"&AC$2&\"_\"&AC$3&\"_\"&AC$4&\"_\"&$A7),'All Data'!$A$2:$L$1048576,AC$1,FALSE)","v":24.510121457489877},{"$f":"VLOOKUP(($B7&\"_\"&AD$2&\"_\"&AD$3&\"_\"&AD$4&\"_\"&$A7),'All Data'!$A$2:$L$1048576,AD$1,FALSE)","v":45.969230769230769},{"$f":"VLOOKUP(($B7&\"_\"&AE$2&\"_\"&AE$3&\"_\"&AE$4&\"_\"&$A7),'All Data'!$A$2:$L$1048576,AE$1,FALSE)","v":663.76607000000001},{"$f":"VLOOKUP(($B7&\"_\"&AF$2&\"_\"&AF$3&\"_\"&AF$4&\"_\"&$A7),'All Data'!$A$2:$L$1048576,AF$1,FALSE)","v":932.65922999999998},{"$f":"VLOOKUP(($B7&\"_\"&AG$2&\"_\"&AG$3&\"_\"&AG$4&\"_\"&$A7),'All Data'!$A$2:$L$1048576,AG$1,FALSE)","v":398.36189999999999},{"$f":"VLOOKUP(($B7&\"_\"&AH$2&\"_\"&AH$3&\"_\"&AH$4&\"_\"&$A7),'All Data'!$A$2:$L$1048576,AH$1,FALSE)","v":764.63932999999997},{"$f":"VLOOKUP(($B7&\"_\"&AI$2&\"_\"&AI$3&\"_\"&AI$4&\"_\"&$A7),'All Data'!$A$2:$L$1048576,AI$1,FALSE)","v":732.39571999999998},{"$f":"VLOOKUP(($B7&\"_\"&AJ$2&\"_\"&AJ$3&\"_\"&AJ$4&\"_\"&$A7),'All Data'!$A$2:$L$1048576,AJ$1,FALSE)","v":1103.61754},{"$f":"VLOOKUP(($B7&\"_\"&AK$2&\"_\"&AK$3&\"_\"&AK$4&\"_\"&$A7),'All Data'!$A$2:$L$1048576,AK$1,FALSE)","v":79.353896049810942},{"$f":"VLOOKUP(($B7&\"_\"&AL$2&\"_\"&AL$3&\"_\"&AL$4&\"_\"&$A7),'All Data'!$A$2:$L$1048576,AL$1,FALSE)","v":84.768544775451389}]
["LA","Gwynedd",{"$f":"VLOOKUP(($B8&\"_\"&C$2&\"_\"&C$3&\"_\"&C$4&\"_\"&$A8),'All Data'!$A$2:$L$1048576,C$1,FALSE)","v":0},{"$f":"VLOOKUP(($B8&\"_\"&D$2&\"_\"&D$3&\"_\"&D$4&\"_\"&$A8),'All Data'!$A$2:$L$1048576,D$1,FALSE)","v":0},{"$f":"VLOOKUP(($B8&\"_\"&E$2&\"_\"&E$3&\"_\"&E$4&\"_\"&$A8),'All Data'!$A$2:$L$1048576,E$1,FALSE)","v":0},{"$f":"VLOOKUP(($B8&\"_\"&F$2&\"_\"&F$3&\"_\"&F$4&\"_\"&$A8),'All Data'!$A$2:$L$1048576,F$1,FALSE)","v":0},{"$f":"VLOOKUP(($B8&\"_\"&G$2&\"_\"&G$3&\"_\"&G$4&\"_\"&$A8),'All Data'!$A$2:$L$1048576,G$1,FALSE)","v":0.18031449999999999},{"$f":"VLOOKUP(($B8&\"_\"&H$2&\"_\"&H$3&\"_\"&H$4&\"_\"&$A8),'All Data'!$A$2:$L$1048576,H$1,FALSE)","v":6.6699520000000003},{"$f":"VLOOKUP(($B8&\"_\"&I$2&\"_\"&I$3&\"_\"&I$4&\"_\"&$A8),'All Data'!$A$2:$L$1048576,I$1,FALSE)","v":-3.2088549999999998},{"$f":"VLOOKUP(($B8&\"_\"&J$2&\"_\"&J$3&\"_\"&J$4&\"_\"&$A8),'All Data'!$A$2:$L$1048576,J$1,FALSE)","v":8.0655599999999996},{"$f":"VLOOKUP(($B8&\"_\"&K$2&\"_\"&K$3&\"_\"&K$4&\"_\"&$A8),'All Data'!$A$2:$L$1048576,K$1,FALSE)","v":75.214410000000001},{"$f":"VLOOKUP(($B8&\"_\"&L$2&\"_\"&L$3&\"_\"&L$4&\"_\"&$A8),'All Data'!$A$2:$L$1048576,L$1,FALSE)","v":80.741990000000001},{"$f":"VLOOKUP(($B8&\"_\"&M$2&\"_\"&M$3&\"_\"&M$4&\"_\"&$A8),'All Data'!$A$2:$L$1048576,M$1,FALSE)","v":{"$error":"#N/A"}},{"$f":"VLOOKUP(($B8&\"_\"&N$2&\"_\"&N$3&\"_\"&N$4&\"_\"&$A8),'All Data'!$A$2:$L$1048576,N$1,FALSE)","v":{"$error":"#N/A"}},{"$f":"VLOOKUP(($B8&\"_\"&O$2&\"_\"&O$3&\"_\"&O$4&\"_\"&$A8),'All Data'!$A$2:$L$1048576,O$1,FALSE)","v":21.190719999999999},{"$f":"VLOOKUP(($B8&\"_\"&P$2&\"_\"&P$3&\"_\"&P$4&\"_\"&$A8),'All Data'!$A$2:$L$1048576,P$1,FALSE)","v":27.04186},{"$f":"VLOOKUP(($B8&\"_\"&Q$2&\"_\"&Q$3&\"_\"&Q$4&\"_\"&$A8),'All Data'!$A$2:$L$1048576,Q$1,FALSE)","v":2.3645700000000001},{"$f":"VLOOKUP(($B8&\"_\"&R$2&\"_\"&R$3&\"_\"&R$4&\"_\"&$A8),'All Data'!$A$2:$L$1048576,R$1,FALSE)","v":2.636746},{"$f":"VLOOKUP(($B8&\"_\"&S$2&\"_\"&S$3&\"_\"&S$4&\"_\"&$A8),'All Data'!$A$2:$L$1048576,S$1,FALSE)","v":37.3797},{"$f":"VLOOKUP(($B8&\"_\"&T$2&\"_\"&T$3&\"_\"&T$4&\"_\"&$A8),'All Data'!$A$2:$L$1048576,T$1,FALSE)","v":44.041449999999998},{"$f":"VLOOKUP(($B8&\"_\"&U$2&\"_\"&U$3&\"_\"&U$4&\"_\"&$A8),'All Data'!$A$2:$L$1048576,U$1,FALSE)","v":52.863050000000001},{"$f":"VLOOKUP(($B8&\"_\"&V$2&\"_\"&V$3&\"_\"&V$4&\"_\"&$A8),'All Data'!$A$2:$L$1048576,V$1,FALSE)","v":59.339450000000006},{"$f":"VLOOKUP(($B8&\"_\"&W$2&\"_\"&W$3&\"_\"&W$4&\"_\"&$A8),'All Data'!$A$2:$L$1048576,W$1,FALSE)","v":330.94650999999999},{"$f":"VLOOKUP(($B8&\"_\"&X$2&\"_\"&X$3&\"_\"&X$4&\"_\"&$A8),'All Data'!$A$2:$L$1048576,X$1,FALSE)","v":403.39877000000001},{"$f":"VLOOKUP(($B8&\"_\"&Y$2&\"_\"&Y$3&\"_\"&Y$4&\"_\"&$A8),'All Data'!$A$2:$L$1048576,Y$1,FALSE)","v":427.42394999999999},{"$f":"VLOOKUP(($B8&\"_\"&Z$2&\"_\"&Z$3&\"_\"&Z$4&\"_\"&$A8),'All Data'!$A$2:$L$1048576,Z$1,FALSE)","v":546.27972999999997},{"$f":"VLOOKUP(($B8&\"_\"&AA$2&\"_\"&AA$3&\"_\"&AA$4&\"_\"&$A8),'All Data'!$A$2:$L$1048576,AA$1,FALSE)","v":210.11350999999999},{"$f":"VLOOKUP(($B8&\"_\"&AB$2&\"_\"&AB$3&\"_\"&AB$4&\"_\"&$A8),'All Data'!$A$2:$L$1048576,AB$1,FALSE)","v":294.86779000000001},{"$f":"VLOOKUP(($B8&\"_\"&AC$2&\"_\"&AC$3&\"_\"&AC$4&\"_\"&$A8),'All Data'!$A$2:$L$1048576,AC$1,FALSE)","v":26.471981776765375},{"$f":"VLOOKUP(($B8&\"_\"&AD$2&\"_\"&AD$3&\"_\"&AD$4&\"_\"&$A8),'All Data'!$A$2:$L$1048576,AD$1,FALSE)","v":42.323462414578593},{"$f":"VLOOKUP(($B8&\"_\"&AE$2&\"_\"&AE$3&\"_\"&AE$4&\"_\"&$A8),'All Data'!$A$2:$L$1048576,AE$1,FALSE)","v":696.38687000000004},{"$f":"VLOOKUP(($B8&\"_\"&AF$2&\"_\"&AF$3&\"_\"&AF$4&\"_\"&$A8),'All Data'!$A$2:$L$1048576,AF$1,FALSE)","v":911.86860999999999},{"$f":"VLOOKUP(($B8&\"_\"&AG$2&\"_\"&AG$3&\"_\"&AG$4&\"_\"&$A8),'All Data'!$A$2:$L$1048576,AG$1,FALSE)","v":383.79665},{"$f":"VLOOKUP(($B8&\"_\"&AH$2&\"_\"&AH$3&\"_\"&AH$4&\"_\"&$A8),'All Data'!$A$2:$L$1048576,AH$1,FALSE)","v":659.95825000000002},{"$f":"VLOOKUP(($B8&\"_\"&AI$2&\"_\"&AI$3&\"_\"&AI$4&\"_\"&$A8),'All Data'!$A$2:$L$1048576,AI$1,FALSE)","v":850.11874999999998},{"$f":"VLOOKUP(($B8&\"_\"&AJ$2&\"_\"&AJ$3&\"_\"&AJ$4&\"_\"&$A8),'All Data'!$A$2:$L$1048576,AJ$1,FALSE)","v":1171.85617},{"$f":"VLOOKUP(($B8&\"_\"&AK$2&\"_\"&AK$3&\"_\"&AK$4&\"_\"&$A8),'All Data'!$A$2:$L$1048576,AK$1,FALSE)","v":82.965694500450965},{"$f":"VLOOKUP(($B8&\"_\"&AL$2&\"_\"&AL$3&\"_\"&AL$4&\"_\"&$A8),'All Data'!$A$2:$L$1048576,AL$1,FALSE)","v":86.946177700646672}]
{"$rows_left_out":29}
{"sheet":"All Data","index":7,"n_rows":511,"n_cols":12,"rows_kept":511,"cut":false,"hidden":true,"merged":[]}
["lookup","Short name","Year","Sex","AreaName","Type","Annual average","EASR","95% LCL","95% UCL","error +","error -"]
[{"$f":"TRIM(E2)&\"_\"&B2&\"_\"&D2&\"_\"&C2&\"_\"&F2","v":"Blaenau Gwent_Smo_Persons_2009-2010_LA"},"Smo","2009-2010","Persons","Blaenau Gwent","LA",{"$f":"\" \"","v":" "},27.653882963345282,24.712419999999998,30.59535,2.9414670366547178,2.941462963345284]
[{"$f":"TRIM(E3)&\"_\"&B3&\"_\"&D3&\"_\"&C3&\"_\"&F3","v":"Rhondda Cynon Taf_Smo_Persons_2009-2010_LA"},"Smo","2009-2010","Persons","Rhondda Cynon Taf","LA",{"$f":"\" \"","v":" "},26.834278615030797,24.324860000000001,29.343700000000002,2.5094213849692046,2.5094186150307962]
["Merthyr Tydfil_Smo_Persons_2009-2010_LA","Smo","2009-2010","Persons","Merthyr Tydfil","LA"," ",26.26629676734699,23.340600000000002,29.191990000000001,2.9256932326530105,2.925696767346988]
["Wrexham_Smo_Persons_2009-2010_LA","Smo","2009-2010","Persons","Wrexham","LA"," ",26.159974646678211,23.267699999999998,29.052240000000001,2.8922653533217897,2.8922746466782137]
["Neath Port Talbot_Smo_Persons_2009-2010_LA","Smo","2009-2010","Persons","Neath Port Talbot","LA"," ",25.941954998516572,23.169039999999999,28.714869999999998,2.7729150014834261,2.7729149985165726]
["Torfaen_Smo_Persons_2009-2010_LA","Smo","2009-2010","Persons","Torfaen","LA"," ",25.553244565993875,22.64048,28.466010000000004,2.9127654340061291,2.912764565993875]
["Newport_Smo_Persons_2009-2010_LA","Smo","2009-2010","Persons","Newport","LA"," ",24.710212443068098,21.837029999999999,27.583400000000001,2.873187556931903,2.8731824430680994]
{"$rows_left_out":503}