{"text_format":"1","workbook":"xlsx","n_sheets":8,"sheets":["Readme","QC","Overview table","Interactive","Interactive controls","Copy tables and charts","Overview (controls)","All Data"],"not_rendered":{"charts":1,"images":4,"macros":1,"external_links":1,"defined_names":19,"comments":0,"pivot_tables":0},"unopened":[],"bounds":{"document_bytes":16777216,"sheet_cells":100000,"rows_first":2000,"rows_last":500,"rows_between":2000,"halvings":0,"cell_chars":16384,"cell_head_chars":4096},"cells_cut":0,"cells_raw":0,"read":"whole","date_system":"1900"}

{"sheet":"Readme","index":0,"n_rows":32,"n_cols":2,"rows_kept":32,"cut":false,"hidden":false,"merged":[[9,0,12,0],[5,0,5,1]]}
[]
[]
[]
[]
[]
["This file contains macros which need to be enabled. For some PC setups this file needs to be saved locally to ensure functionality."]
[]
["TOPIC:","Our Healthy Future"]
["SUBJECT:","Our Healthy Future Indicators (interim release)"]
["SOURCE:","Annual District Deaths Extract, conceptions data and Mid-year population estimates (Office for National Statistics)"]
[null,"Welsh Index of Multiple Deprivation 2008 and Welsh Health Survey (Welsh Government) "]
[null,"Patient Episode Database Wales (NHS Wales Informatics Service) "]
[null,"National Community Child Health Database (NCCHD) (NHS Wales Informatics Service) "]
["GEOGRAPHY:","Wales; local authorities; health boards"]
["PERIOD:","See individual indicators"]
["DEMOGRAPHY:","Males; females; persons"]
["STATISTICS:","Refer to the technical guide for statistics used and caveats associated with each indicator available at:"]
[null,"http://www.wales.nhs.uk/sitesplus/922/page/65976 "]
["INDICATORS:","Inequality Gap in Healthy Life Expectancy (SII in years)"]
[null,"Inequality Gap in Life Expectancy (SII in years)"]
[null,"Free from a common mental disorder (%)"]
[null,"Currently smoking (%)"]
[null,"Average days 30 minutes of moderate/vigorous physical activity"]
[null,"Five fruit/veg the previous day (%) "]
[null,"Obese/overweight (%) "]
[null,"Alcohol-specific admission rates "]
[null,"Conception rates <18s"]
[null,"Hip fracture admission rates 65+"]
[null,"Childhood vaccinations uptake (%)"]
[]
["NOTES:","The rates contained in the interactive data file are based on ONS population estimates which were released prior to the 2011 Census update. This is an interim release and the data will be revised as part of the next update due in summer."]
[null,"This version is designed for Excel 2007 and later versions and macros need to be enabled for the data file to work correctly. Also, for some PC setups and security settings the file needs to be downloaded and saved on the PC to work correctly. For older versions there is also a 2003 version available (see weblink above)"]

{"sheet":"QC","index":1,"n_rows":92,"n_cols":6,"rows_kept":92,"cut":false,"hidden":true,"merged":[[81,3,81,4],[43,4,43,5],[45,4,45,5],[35,4,35,5],[36,4,36,5],[38,4,38,5],[40,4,40,5],[41,4,41,5],[42,4,42,5],[79,4,79,5],[69,4,69,5],[72,4,72,5],[73,4,73,5],[74,4,74,5],[77,4,77,5],[78,4,78,5],[34,4,34,5],[15,4,15,5],[24,4,24,5],[26,4,26,5],[27,4,27,5],[28,4,28,5],[31,4,31,5],[68,4,68,5],[52,4,52,5],[55,4,55,5],[56,4,56,5],[57,4,57,5],[58,4,58,5],[63,4,63,5],[64,4,64,5],[65,4,65,5],[66,4,66,5],[67,4,67,5],[61,0,62,0],[61,4,61,5],[62,4,62,5],[46,4,46,5],[49,4,49,5],[50,4,50,5],[51,4,51,5]]}
["OAT Quality Control"]
[]
["Audit trail"]
[]
["Date","Name","Items QA'd",null,"Time taken","Additional notes / changes made"]
["2012-10-04","Dee Hickey","see end of sheet",null,"2 days ","inserted readme sheet"]
["2012-10-05","Dee Hickey","plus 'copy tables&charts', 'interactive guide' and 'table guide' tabs & formatting"]
["2012-10-10","Dee Hickey","spot checked length of error bars"]
[null,null,"README sheet and VB script needs to be QC'd"]
["2012-10-11","Jo Arthur","VB code check"]
["2012-10-11","Beth Patterson","checked ReadMe sheet",null,null,"Took out 2005-2009 period note as the indicators have various periods ranginf from 2005 up to FY 2011/12; put sources in full; subject changed to 'Public Health Shared Indicators'"]
["2012-11-21","Dee Hickey","Checked all data (in both overview table&  in interactive table) against the orginal version that I QC'd (version 0g)",null,null,"no changes made"]
["2012-11-27","Jo Arthur","VB code 2nd check"]
["Key to symbols (pick from drop-down list in 'Pass/fail' column)",null,null,null,"Refer to 'Guidelines to Presenting data' when "]
[null,null,null,null,"QAing tables, charts and maps (section nos. in brackets):"]
["not applicable","Not applicable",null,null,{"$f":"HYPERLINK(\"\\\\epobclstr.nhswales.wales.nhs\\Observatory\\Health Intelligence\\Method\\Presenting data\\20090202_GuidelinesForPresentingData_HCGD_v2a.doc\", \"Charts (3); tables (4); maps (5); implementation guide (6)\")","v":"Charts (3); tables (4); maps (5); implementation guide (6)"}]
["pass","Passed"]
["?","Further clarification needed - insert note to explain why",null,null,"Guide to formatting Readme sheet / headers & footers:"]
["fail","Failed - enter note to explain why and flag with author(s)",null,null,{"$f":"HYPERLINK(\"\\\\epobclstr.nhswales.wales.nhs\\Observatory\\Health Intelligence\\Method\\Quality Assurance\\20100408_ReadmeFormatting_HC_v0a.ppt\", \"Readme\")","v":"Readme"}]
["corrected","QA point which has been actioned",null,null,{"$f":"HYPERLINK(\"\\\\epobclstr\\Observatory\\Health Intelligence\\Method\\Quality Assurance\\20100331_HeaderFooter_HC_v0a.ppt\", \"Header and footers\")","v":"Header and footers"}]
[]
[]
["QA template"]
[]
["Overall product",null,"Pass / fail etc",null,"Notes"]
[]
["Content","Does the analysis answer the question being asked?","pass"]
[null,"Are there any information governance concerns,  e.g. small numbers / sensitive personal information?","pass"]
[null,"References included as appropriate","pass"]
[]
["Excel methods","Data are linked using cell references, rather than copied-and-pasted, enabling automation and making QA easier","pass"]
[null,"It is clear where all the data have come from, e.g. by including links to other workbooks or web pages","pass",null,"All data checked against orginal data in 'data' folder"]
[null,"Raw data remains unchanged in a separate sheet, making QA easier and enabling future updating of the analysis","not applicable"]
[]
["Formatting","Do the readme and outputs print correctly, i.e. within distinct sheets?","not applicable"]
[null,{"$f":"HYPERLINK(\"\\\\epobclstr\\Observatory\\Health Intelligence\\Method\\Quality Assurance\\20100331_HeaderFooter_HC_v0a.ppt\", \"Header and footers\")","v":"Header and footers"},"not applicable"]
[null,"Referencing - check Public Health Wales guidance","not applicable"]
[]
["Readme sheet",null,"Pass / fail etc",null,"Notes"]
[]
["Content","All sections completed","?"]
[null,"Notes and caveats are sufficiently detailed","?"]
[null,"Source is clear and mentions numerator and denominator","not applicable"]
[null,"ICD / OPCS codes included as appropriate","not applicable"]
[]
["Formatting",{"$f":"HYPERLINK(\"\\\\epobclstr.nhswales.wales.nhs\\Observatory\\Health Intelligence\\Method\\Quality Assurance\\20100408_ReadmeFormatting_HC_v0a.ppt\", \"Readme formatting guide\")","v":"Readme formatting guide"},"not applicable"]
["Analysis 1",null,"Pass / fail etc",null,"Notes"]
[]
["Raw data","Numerator"]
[null,"Extracted from correct SQL table / spreadsheet / website","not applicable"]
[null,"Extract is for correct age/sex, time period and area","not applicable"]
[null,"Correct ICD/OPCS codes used in query to extract data","not applicable"]
[null,"Data have been copied into spreadsheet correctly","not applicable"]
[]
[null,"Denominator"]
[null,"Extracted from correct SQL table / spreadsheet / website","not applicable"]
[null,"Matches numerator in age/sex, time period and area","not applicable"]
[null,"Population data are unrounded for rate calculation","not applicable"]
[null,"Data have been copied into spreadsheet correctly","not applicable"]
[]
[]
["Analytical method","Appropriate use of crude or age-standardised rates","not applicable"]
[null,"Correct decision to include or omit confidence intervals","not applicable"]
[null,"Correct method used for deriving 95% C.I.","not applicable"]
[null,"Are 95% C.I.s referenced correctly? Check + / - error bars  ","not applicable"]
[null,"Correct method used for testing statistical significance","not applicable"]
[null,"Comparator (eg Wales average) provided as appropriate","not applicable"]
[null,"Correct weightings used for direct standardisation","not applicable"]
[null,"Spot check formulae for accuracy and consistency","not applicable"]
[null,"Spot check cells referencing data from other sheets","not applicable"]
[]
[]
["Results","Do the figures look OK?","not applicable"]
[null,"Comparable to previous findings?","not applicable"]
[null,"Comparable to Healthshow / e-pedw?","not applicable"]
[]
[]
["Formatting","Tables - section 4 of 'Guidelines to Presenting Data'","pass",null,"All font in verdana (font size all between 9-10)"]
[null,"Charts - section 3 of 'Guidelines to Presenting Data'","pass",null,"All font in verdana (font size all between 9-10)"]
[null,"Maps - section 5 of 'Guidelines to Presenting Data'","not applicable"]
[]
["QC Checks completed","Interactive (check against controls and orginal data)","Overview tables (EASR figures)","Overview tables (stat signif and colour coding)"]
[null,"Free from a mental health disorder ","Free from a mental health disorder ","Free from a mental health disorder "]
[null,"Hip Fractures","Hip Fractures","Hip Fractures"]
[null,"SII in years","SII in years","N/A"]
[null,"Childhood vaccinations","Childhood vaccinations","Childhood vaccinations"]
[null,"Smoking","Smoking","Smoking"]
[null,"F&V consumption","F&V consumption","F&V consumption"]
[null,"Obesity","Obesity","Obesity"]
[null,"Physical Activity","Physical Activity","Physical Activity"]
[null,"Teenage Conceptions","Teenage Conceptions","Teenage Conceptions"]
[null,"Alcohol admissions","Alcohol admissions","Alcohol admissions"]

{"sheet":"Overview table","index":2,"n_rows":45,"n_cols":65,"rows_kept":45,"cut":false,"hidden":false,"merged":[[40,12,42,24],[1,65,1,66],[1,67,1,68],[1,29,1,30],[1,31,1,32],[1,33,1,34],[1,43,1,44],[1,45,1,46],[1,61,1,62],[1,35,1,36],[1,37,1,38],[1,39,1,40],[1,41,1,42],[1,49,1,50],[1,51,1,52],[1,53,1,54],[1,59,1,60],[3,2,3,3],[3,5,3,7],[3,11,3,14],[1,63,1,64],[3,21,3,25],[1,55,1,56],[1,47,1,48],[1,57,1,58]]}
[]
[null,null,null,null,null,null,null,null,null,null,null,null,null,null,null,null,null,null,null,null,null,null,null,null,null,null,null,null,null,"M",null,"F",null,"M",null,"F",null,"P",null,"P",null,"P",null,"P",null,"P",null,"P",null,"P",null,"M",null,"F",null,"F",null,"P",null,"M",null,"F",null,"P"]
[]
[null,null,null,null,null,null,null,null,null,null,null,null,null,null,null,null,null,null,null,null,null,null,null,null,null,null,null,null,null,"HLE","HLE","HLE","HLE","LE","LE","LE","LE","MENT","MENT","EMP","EMP","SMO","SMO","ACT","ACT","FRU","FRU","OBE","OBE","ALC","ALC","ALC","ALC","ALC","ALC","CONCEP","CONCEP","HIP","HIP","HIP","HIP","HIP","HIP","VACC","VACC"]
[]
[null,null,null,null,null,null,null,null,null,null,null,null,null,null,null,null,null,null,null,null,null,null,null,null,null,null,null,null,null,"LCL","UCL","LCL","UCL","LCL","UCL","LCL","UCL","LCL","UCL","LCL","UCL","LCL","UCL","LCL","UCL","LCL","UCL","LCL","UCL","LCL","UCL","LCL","UCL","LCL","UCL","LCL","UCL","LCL","UCL","LCL","UCL","LCL","UCL","LCL","UCL"]
[null,"Isle of Anglesey",null,null,null,{"$f":"VLOOKUP(($B7&\"_\"&AF$44&\"_\"&AF$43&\"_\"&AF$45&\"_\"&$AC7),'All Data'!$A$2:$L$1048576,8,FALSE)","v":6.8199509999999997},{"$f":"VLOOKUP(($B7&\"_\"&AG$44&\"_\"&AG$43&\"_\"&AG$45&\"_\"&$AC7),'All Data'!$A$2:$L$1048576,8,FALSE)","v":4.5579559999999999},null,{"$f":"VLOOKUP(($B7&\"_\"&AH$44&\"_\"&AH$43&\"_\"&AH$45&\"_\"&$AC7),'All Data'!$A$2:$L$1048576,8,FALSE)","v":77.081630000000004},{"$f":"VLOOKUP(($B7&\"_\"&AJ$44&\"_\"&AJ$43&\"_\"&AJ$45&\"_\"&$AC7),'All Data'!$A$2:$L$1048576,8,FALSE)","v":23.887846218788951},{"$f":"VLOOKUP(($B7&\"_\"&AL$44&\"_\"&AL$43&\"_\"&AL$45&\"_\"&$AC7),'All Data'!$A$2:$L$1048576,8,FALSE)","v":2.5100356293876294},{"$f":"VLOOKUP(($B7&\"_\"&AM$44&\"_\"&AM$43&\"_\"&AM$45&\"_\"&$AC7),'All Data'!$A$2:$L$1048576,8,FALSE)","v":37.704562938468868},{"$f":"VLOOKUP(($B7&\"_\"&AN$44&\"_\"&AN$43&\"_\"&AN$45&\"_\"&$AC7),'All Data'!$A$2:$L$1048576,8,FALSE)","v":54.165547923818572},null,{"$f":"VLOOKUP(($B7&\"_\"&AO$44&\"_\"&AO$43&\"_\"&AO$45&\"_\"&$AC7),'All Data'!$A$2:$L$1048576,8,FALSE)","v":404.13981999999999},{"$f":"VLOOKUP(($B7&\"_\"&AP$44&\"_\"&AP$43&\"_\"&AP$45&\"_\"&$AC7),'All Data'!$A$2:$L$1048576,8,FALSE)","v":580.31137999999999},{"$f":"VLOOKUP(($B7&\"_\"&AQ$44&\"_\"&AQ$43&\"_\"&AQ$45&\"_\"&$AC7),'All Data'!$A$2:$L$1048576,8,FALSE)","v":232.21964},null,{"$f":"VLOOKUP(($B7&\"_\"&AR$44&\"_\"&AR$43&\"_\"&AR$45&\"_\"&$AC7),'All Data'!$A$2:$L$1048576,8,FALSE)","v":34.008097165991899},null,{"$f":"VLOOKUP(($B7&\"_\"&AS$44&\"_\"&AS$43&\"_\"&AS$45&\"_\"&$AC7),'All Data'!$A$2:$L$1048576,8,FALSE)","v":789.92660000000001},{"$f":"VLOOKUP(($B7&\"_\"&AT$44&\"_\"&AT$43&\"_\"&AT$45&\"_\"&$AC7),'All Data'!$A$2:$L$1048576,8,FALSE)","v":559.97810000000004},{"$f":"VLOOKUP(($B7&\"_\"&AU$44&\"_\"&AU$43&\"_\"&AU$45&\"_\"&$AC7),'All Data'!$A$2:$L$1048576,8,FALSE)","v":904.55679999999995},null,{"$f":"VLOOKUP(($B7&\"_\"&AV$44&\"_\"&AV$43&\"_\"&AV$45&\"_\"&$AC7),'All Data'!$A$2:$L$1048576,8,FALSE)","v":82.222222222222214},null,null,null,"LA",{"$f":"'Overview (controls)'!C7","v":0},{"$f":"'Overview (controls)'!D7","v":0},{"$f":"'Overview (controls)'!E7","v":0},{"$f":"'Overview (controls)'!F7","v":0},{"$f":"'Overview (controls)'!G7","v":-8.5565299999999997E-2},{"$f":"'Overview (controls)'!H7","v":13.72547},{"$f":"'Overview (controls)'!I7","v":1.7588820000000001},{"$f":"'Overview (controls)'!J7","v":7.35703},{"$f":"'Overview (controls)'!K7","v":74.259509999999992},{"$f":"'Overview (controls)'!L7","v":79.903739999999999},{"$f":"'Overview (controls)'!M7","v":{"$error":"#N/A"}},{"$f":"'Overview (controls)'!N7","v":{"$error":"#N/A"}},{"$f":"'Overview (controls)'!O7","v":21.015519999999999},{"$f":"'Overview (controls)'!P7","v":26.760169999999999},{"$f":"'Overview (controls)'!Q7","v":2.3789169999999999},{"$f":"'Overview (controls)'!R7","v":2.6411539999999998},{"$f":"'Overview (controls)'!S7","v":34.49156},{"$f":"'Overview (controls)'!T7","v":40.917569999999998},{"$f":"'Overview (controls)'!U7","v":51.028300000000002},{"$f":"'Overview (controls)'!V7","v":57.302790000000002},{"$f":"'Overview (controls)'!W7","v":355.90109000000001},{"$f":"'Overview (controls)'!X7","v":456.84264999999999},{"$f":"'Overview (controls)'!Y7","v":498.51384000000002},{"$f":"'Overview (controls)'!Z7","v":671.28650000000005},{"$f":"'Overview (controls)'!AA7","v":182.43272999999999},{"$f":"'Overview (controls)'!AB7","v":290.67597999999998},{"$f":"'Overview (controls)'!AC7","v":24.510121457489877},{"$f":"'Overview (controls)'!AD7","v":45.969230769230769},{"$f":"'Overview (controls)'!AE7","v":663.76607000000001},{"$f":"'Overview (controls)'!AF7","v":932.65922999999998},{"$f":"'Overview (controls)'!AG7","v":398.36189999999999},{"$f":"'Overview (controls)'!AH7","v":764.63932999999997},{"$f":"'Overview (controls)'!AI7","v":732.39571999999998},{"$f":"'Overview (controls)'!AJ7","v":1103.61754},{"$f":"'Overview (controls)'!AK7","v":79.353896049810942},{"$f":"'Overview (controls)'!AL7","v":84.768544775451389}]
[null,"Gwynedd",null,null,null,{"$f":"VLOOKUP(($B8&\"_\"&AF$44&\"_\"&AF$43&\"_\"&AF$45&\"_\"&$AC8),'All Data'!$A$2:$L$1048576,8,FALSE)","v":3.4251330000000002},{"$f":"VLOOKUP(($B8&\"_\"&AG$44&\"_\"&AG$43&\"_\"&AG$45&\"_\"&$AC8),'All Data'!$A$2:$L$1048576,8,FALSE)","v":2.428353},null,{"$f":"VLOOKUP(($B8&\"_\"&AH$44&\"_\"&AH$43&\"_\"&AH$45&\"_\"&$AC8),'All Data'!$A$2:$L$1048576,8,FALSE)","v":77.978200000000001},{"$f":"VLOOKUP(($B8&\"_\"&AJ$44&\"_\"&AJ$43&\"_\"&AJ$45&\"_\"&$AC8),'All Data'!$A$2:$L$1048576,8,FALSE)","v":24.116288329025675},{"$f":"VLOOKUP(($B8&\"_\"&AL$44&\"_\"&AL$43&\"_\"&AL$45&\"_\"&$AC8),'All Data'!$A$2:$L$1048576,8,FALSE)","v":2.5006581836896564},{"$f":"VLOOKUP(($B8&\"_\"&AM$44&\"_\"&AM$43&\"_\"&AM$45&\"_\"&$AC8),'All Data'!$A$2:$L$1048576,8,FALSE)","v":40.710576856966604},{"$f":"VLOOKUP(($B8&\"_\"&AN$44&\"_\"&AN$43&\"_\"&AN$45&\"_\"&$AC8),'All Data'!$A$2:$L$1048576,8,FALSE)","v":56.101251216356729},null,{"$f":"VLOOKUP(($B8&\"_\"&AO$44&\"_\"&AO$43&\"_\"&AO$45&\"_\"&$AC8),'All Data'!$A$2:$L$1048576,8,FALSE)","v":365.87833999999998},{"$f":"VLOOKUP(($B8&\"_\"&AP$44&\"_\"&AP$43&\"_\"&AP$45&\"_\"&$AC8),'All Data'!$A$2:$L$1048576,8,FALSE)","v":484.22366},{"$f":"VLOOKUP(($B8&\"_\"&AQ$44&\"_\"&AQ$43&\"_\"&AQ$45&\"_\"&$AC8),'All Data'!$A$2:$L$1048576,8,FALSE)","v":249.91433000000001},null,{"$f":"VLOOKUP(($B8&\"_\"&AR$44&\"_\"&AR$43&\"_\"&AR$45&\"_\"&$AC8),'All Data'!$A$2:$L$1048576,8,FALSE)","v":33.712984054669704},null,{"$f":"VLOOKUP(($B8&\"_\"&AS$44&\"_\"&AS$43&\"_\"&AS$45&\"_\"&$AC8),'All Data'!$A$2:$L$1048576,8,FALSE)","v":798.90480000000002},{"$f":"VLOOKUP(($B8&\"_\"&AT$44&\"_\"&AT$43&\"_\"&AT$45&\"_\"&$AC8),'All Data'!$A$2:$L$1048576,8,FALSE)","v":508.28640000000001},{"$f":"VLOOKUP(($B8&\"_\"&AU$44&\"_\"&AU$43&\"_\"&AU$45&\"_\"&$AC8),'All Data'!$A$2:$L$1048576,8,FALSE)","v":1002.0168},null,{"$f":"VLOOKUP(($B8&\"_\"&AV$44&\"_\"&AV$43&\"_\"&AV$45&\"_\"&$AC8),'All Data'!$A$2:$L$1048576,8,FALSE)","v":85.064935064935071},null,null,null,"LA",{"$f":"'Overview (controls)'!C8","v":0},{"$f":"'Overview (controls)'!D8","v":0},{"$f":"'Overview (controls)'!E8","v":0},{"$f":"'Overview (controls)'!F8","v":0},{"$f":"'Overview (controls)'!G8","v":0.18031449999999999},{"$f":"'Overview (controls)'!H8","v":6.6699520000000003},{"$f":"'Overview (controls)'!I8","v":-3.2088549999999998},{"$f":"'Overview (controls)'!J8","v":8.0655599999999996},{"$f":"'Overview (controls)'!K8","v":75.214410000000001},{"$f":"'Overview (controls)'!L8","v":80.741990000000001},{"$f":"'Overview (controls)'!M8","v":{"$error":"#N/A"}},{"$f":"'Overview (controls)'!N8","v":{"$error":"#N/A"}},{"$f":"'Overview (controls)'!O8","v":21.190719999999999},{"$f":"'Overview (controls)'!P8","v":27.04186},{"$f":"'Overview (controls)'!Q8","v":2.3645700000000001},{"$f":"'Overview (controls)'!R8","v":2.636746},{"$f":"'Overview (controls)'!S8","v":37.3797},{"$f":"'Overview (controls)'!T8","v":44.041449999999998},{"$f":"'Overview (controls)'!U8","v":52.863050000000001},{"$f":"'Overview (controls)'!V8","v":59.339450000000006},{"$f":"'Overview (controls)'!W8","v":330.94650999999999},{"$f":"'Overview (controls)'!X8","v":403.39877000000001},{"$f":"'Overview (controls)'!Y8","v":427.42394999999999},{"$f":"'Overview (controls)'!Z8","v":546.27972999999997},{"$f":"'Overview (controls)'!AA8","v":210.11350999999999},{"$f":"'Overview (controls)'!AB8","v":294.86779000000001},{"$f":"'Overview (controls)'!AC8","v":26.471981776765375},{"$f":"'Overview (controls)'!AD8","v":42.323462414578593},{"$f":"'Overview (controls)'!AE8","v":696.38687000000004},{"$f":"'Overview (controls)'!AF8","v":911.86860999999999},{"$f":"'Overview (controls)'!AG8","v":383.79665},{"$f":"'Overview (controls)'!AH8","v":659.95825000000002},{"$f":"'Overview (controls)'!AI8","v":850.11874999999998},{"$f":"'Overview (controls)'!AJ8","v":1171.85617},{"$f":"'Overview (controls)'!AK8","v":82.965694500450965},{"$f":"'Overview (controls)'!AL8","v":86.946177700646672}]
[null,"Conwy",null,null,null,{"$f":"VLOOKUP(($B9&\"_\"&AF$44&\"_\"&AF$43&\"_\"&AF$45&\"_\"&$AC9),'All Data'!$A$2:$L$1048576,8,FALSE)","v":8.0631459999999997},{"$f":"VLOOKUP(($B9&\"_\"&AG$44&\"_\"&AG$43&\"_\"&AG$45&\"_\"&$AC9),'All Data'!$A$2:$L$1048576,8,FALSE)","v":6.7851800000000004},null,{"$f":"VLOOKUP(($B9&\"_\"&AH$44&\"_\"&AH$43&\"_\"&AH$45&\"_\"&$AC9),'All Data'!$A$2:$L$1048576,8,FALSE)","v":79.965969999999999},{"$f":"VLOOKUP(($B9&\"_\"&AJ$44&\"_\"&AJ$43&\"_\"&AJ$45&\"_\"&$AC9),'All Data'!$A$2:$L$1048576,8,FALSE)","v":22.14657576926319},{"$f":"VLOOKUP(($B9&\"_\"&AL$44&\"_\"&AL$43&\"_\"&AL$45&\"_\"&$AC9),'All Data'!$A$2:$L$1048576,8,FALSE)","v":2.5626001241292231},{"$f":"VLOOKUP(($B9&\"_\"&AM$44&\"_\"&AM$43&\"_\"&AM$45&\"_\"&$AC9),'All Data'!$A$2:$L$1048576,8,FALSE)","v":34.636084217506429},{"$f":"VLOOKUP(($B9&\"_\"&AN$44&\"_\"&AN$43&\"_\"&AN$45&\"_\"&$AC9),'All Data'!$A$2:$L$1048576,8,FALSE)","v":51.133775870175981},null,{"$f":"VLOOKUP(($B9&\"_\"&AO$44&\"_\"&AO$43&\"_\"&AO$45&\"_\"&$AC9),'All Data'!$A$2:$L$1048576,8,FALSE)","v":411.61941999999999},{"$f":"VLOOKUP(($B9&\"_\"&AP$44&\"_\"&AP$43&\"_\"&AP$45&\"_\"&$AC9),'All Data'!$A$2:$L$1048576,8,FALSE)","v":527.79268000000002},{"$f":"VLOOKUP(($B9&\"_\"&AQ$44&\"_\"&AQ$43&\"_\"&AQ$45&\"_\"&$AC9),'All Data'!$A$2:$L$1048576,8,FALSE)","v":301.37362000000002},null,{"$f":"VLOOKUP(($B9&\"_\"&AR$44&\"_\"&AR$43&\"_\"&AR$45&\"_\"&$AC9),'All Data'!$A$2:$L$1048576,8,FALSE)","v":38.654618473895582},null,{"$f":"VLOOKUP(($B9&\"_\"&AS$44&\"_\"&AS$43&\"_\"&AS$45&\"_\"&$AC9),'All Data'!$A$2:$L$1048576,8,FALSE)","v":715.74059999999997},{"$f":"VLOOKUP(($B9&\"_\"&AT$44&\"_\"&AT$43&\"_\"&AT$45&\"_\"&$AC9),'All Data'!$A$2:$L$1048576,8,FALSE)","v":504.64429999999999},{"$f":"VLOOKUP(($B9&\"_\"&AU$44&\"_\"&AU$43&\"_\"&AU$45&\"_\"&$AC9),'All Data'!$A$2:$L$1048576,8,FALSE)","v":860.23649999999998},null,{"$f":"VLOOKUP(($B9&\"_\"&AV$44&\"_\"&AV$43&\"_\"&AV$45&\"_\"&$AC9),'All Data'!$A$2:$L$1048576,8,FALSE)","v":81.227436823104696},null,null,null,"LA",{"$f":"'Overview (controls)'!C9","v":0},{"$f":"'Overview (controls)'!D9","v":0},{"$f":"'Overview (controls)'!E9","v":0},{"$f":"'Overview (controls)'!F9","v":0},{"$f":"'Overview (controls)'!G9","v":5.7928949999999997},{"$f":"'Overview (controls)'!H9","v":10.333399999999999},{"$f":"'Overview (controls)'!I9","v":4.1375900000000003},{"$f":"'Overview (controls)'!J9","v":9.4327699999999997},{"$f":"'Overview (controls)'!K9","v":77.47878},{"$f":"'Overview (controls)'!L9","v":82.45317},{"$f":"'Overview (controls)'!M9","v":{"$error":"#N/A"}},{"$f":"'Overview (controls)'!N9","v":{"$error":"#N/A"}},{"$f":"'Overview (controls)'!O9","v":19.44904},{"$f":"'Overview (controls)'!P9","v":24.844110000000001},{"$f":"'Overview (controls)'!Q9","v":2.43085},{"$f":"'Overview (controls)'!R9","v":2.69435},{"$f":"'Overview (controls)'!S9","v":31.545840000000002},{"$f":"'Overview (controls)'!T9","v":37.726330000000004},{"$f":"'Overview (controls)'!U9","v":48.064019999999999},{"$f":"'Overview (controls)'!V9","v":54.203539999999997},{"$f":"'Overview (controls)'!W9","v":372.39395999999999},{"$f":"'Overview (controls)'!X9","v":453.66752000000002},{"$f":"'Overview (controls)'!Y9","v":465.96588000000003},{"$f":"'Overview (controls)'!Z9","v":595.21693000000005},{"$f":"'Overview (controls)'!AA9","v":253.77180999999999},{"$f":"'Overview (controls)'!AB9","v":354.86909000000003},{"$f":"'Overview (controls)'!AC9","v":30.505522088353416},{"$f":"'Overview (controls)'!AD9","v":48.311746987951807},{"$f":"'Overview (controls)'!AE9","v":627.92705000000001},{"$f":"'Overview (controls)'!AF9","v":811.96808999999996},{"$f":"'Overview (controls)'!AG9","v":392.51495999999997},{"$f":"'Overview (controls)'!AH9","v":638.29253000000006},{"$f":"'Overview (controls)'!AI9","v":733.54246999999998},{"$f":"'Overview (controls)'!AJ9","v":1001.30242},{"$f":"'Overview (controls)'!AK9","v":78.821662305346919},{"$f":"'Overview (controls)'!AL9","v":83.417419232886587}]
[null,"Denbighshire",null,null,null,{"$f":"VLOOKUP(($B10&\"_\"&AF$44&\"_\"&AF$43&\"_\"&AF$45&\"_\"&$AC10),'All Data'!$A$2:$L$1048576,8,FALSE)","v":7.6459210000000004},{"$f":"VLOOKUP(($B10&\"_\"&AG$44&\"_\"&AG$43&\"_\"&AG$45&\"_\"&$AC10),'All Data'!$A$2:$L$1048576,8,FALSE)","v":3.7368510000000001},null,{"$f":"VLOOKUP(($B10&\"_\"&AH$44&\"_\"&AH$43&\"_\"&AH$45&\"_\"&$AC10),'All Data'!$A$2:$L$1048576,8,FALSE)","v":77.013559999999998},{"$f":"VLOOKUP(($B10&\"_\"&AJ$44&\"_\"&AJ$43&\"_\"&AJ$45&\"_\"&$AC10),'All Data'!$A$2:$L$1048576,8,FALSE)","v":23.047920134699481},{"$f":"VLOOKUP(($B10&\"_\"&AL$44&\"_\"&AL$43&\"_\"&AL$45&\"_\"&$AC10),'All Data'!$A$2:$L$1048576,8,FALSE)","v":2.508173772744934},{"$f":"VLOOKUP(($B10&\"_\"&AM$44&\"_\"&AM$43&\"_\"&AM$45&\"_\"&$AC10),'All Data'!$A$2:$L$1048576,8,FALSE)","v":36.067370574949862},{"$f":"VLOOKUP(($B10&\"_\"&AN$44&\"_\"&AN$43&\"_\"&AN$45&\"_\"&$AC10),'All Data'!$A$2:$L$1048576,8,FALSE)","v":54.445516385663936},null,{"$f":"VLOOKUP(($B10&\"_\"&AO$44&\"_\"&AO$43&\"_\"&AO$45&\"_\"&$AC10),'All Data'!$A$2:$L$1048576,8,FALSE)","v":366.91975000000002},{"$f":"VLOOKUP(($B10&\"_\"&AP$44&\"_\"&AP$43&\"_\"&AP$45&\"_\"&$AC10),'All Data'!$A$2:$L$1048576,8,FALSE)","v":443.86833999999999},{"$f":"VLOOKUP(($B10&\"_\"&AQ$44&\"_\"&AQ$43&\"_\"&AQ$45&\"_\"&$AC10),'All Data'!$A$2:$L$1048576,8,FALSE)","v":294.00943000000001},null,{"$f":"VLOOKUP(($B10&\"_\"&AR$44&\"_\"&AR$43&\"_\"&AR$45&\"_\"&$AC10),'All Data'!$A$2:$L$1048576,8,FALSE)","v":35.218783351120592},null,{"$f":"VLOOKUP(($B10&\"_\"&AS$44&\"_\"&AS$43&\"_\"&AS$45&\"_\"&$AC10),'All Data'!$A$2:$L$1048576,8,FALSE)","v":454.87430000000001},{"$f":"VLOOKUP(($B10&\"_\"&AT$44&\"_\"&AT$43&\"_\"&AT$45&\"_\"&$AC10),'All Data'!$A$2:$L$1048576,8,FALSE)","v":264.49790000000002},{"$f":"VLOOKUP(($B10&\"_\"&AU$44&\"_\"&AU$43&\"_\"&AU$45&\"_\"&$AC10),'All Data'!$A$2:$L$1048576,8,FALSE)","v":586.81780000000003},null,{"$f":"VLOOKUP(($B10&\"_\"&AV$44&\"_\"&AV$43&\"_\"&AV$45&\"_\"&$AC10),'All Data'!$A$2:$L$1048576,8,FALSE)","v":82.324687800192123},null,null,null,"LA",{"$f":"'Overview (controls)'!C10","v":0},{"$f":"'Overview (controls)'!D10","v":0},{"$f":"'Overview (controls)'!E10","v":0},{"$f":"'Overview (controls)'!F10","v":0},{"$f":"'Overview (controls)'!G10","v":-3.09605},{"$f":"'Overview (controls)'!H10","v":18.387889999999999},{"$f":"'Overview (controls)'!I10","v":-2.9595189999999998},{"$f":"'Overview (controls)'!J10","v":10.43322},{"$f":"'Overview (controls)'!K10","v":74.474209999999999},{"$f":"'Overview (controls)'!L10","v":79.552900000000008},{"$f":"'Overview (controls)'!M10","v":{"$error":"#N/A"}},{"$f":"'Overview (controls)'!N10","v":{"$error":"#N/A"}},{"$f":"'Overview (controls)'!O10","v":20.35108},{"$f":"'Overview (controls)'!P10","v":25.744759999999999},{"$f":"'Overview (controls)'!Q10","v":2.3791579999999999},{"$f":"'Overview (controls)'!R10","v":2.6371899999999999},{"$f":"'Overview (controls)'!S10","v":33.01999},{"$f":"'Overview (controls)'!T10","v":39.114750000000001},{"$f":"'Overview (controls)'!U10","v":51.3506},{"$f":"'Overview (controls)'!V10","v":57.540430000000001},{"$f":"'Overview (controls)'!W10","v":328.41045000000003},{"$f":"'Overview (controls)'!X10","v":408.56401},{"$f":"'Overview (controls)'!Y10","v":384.24912999999998},{"$f":"'Overview (controls)'!Z10","v":509.87144000000001},{"$f":"'Overview (controls)'!AA10","v":245.96544},{"$f":"'Overview (controls)'!AB10","v":348.34120000000001},{"$f":"'Overview (controls)'!AC10","v":27.237993596584843},{"$f":"'Overview (controls)'!AD10","v":44.806830309498395},{"$f":"'Overview (controls)'!AE10","v":378.21557999999999},{"$f":"'Overview (controls)'!AF10","v":541.99528999999995},{"$f":"'Overview (controls)'!AG10","v":175.15889000000001},{"$f":"'Overview (controls)'!AH10","v":383.02936},{"$f":"'Overview (controls)'!AI10","v":471.04228000000001},{"$f":"'Overview (controls)'!AJ10","v":720.49932999999999},{"$f":"'Overview (controls)'!AK10","v":79.889767026769547},{"$f":"'Overview (controls)'!AL10","v":84.521910303076424}]
[null,"Flintshire",null,null,null,{"$f":"VLOOKUP(($B11&\"_\"&AF$44&\"_\"&AF$43&\"_\"&AF$45&\"_\"&$AC11),'All Data'!$A$2:$L$1048576,8,FALSE)","v":7.4599970000000004},{"$f":"VLOOKUP(($B11&\"_\"&AG$44&\"_\"&AG$43&\"_\"&AG$45&\"_\"&$AC11),'All Data'!$A$2:$L$1048576,8,FALSE)","v":6.81},null,{"$f":"VLOOKUP(($B11&\"_\"&AH$44&\"_\"&AH$43&\"_\"&AH$45&\"_\"&$AC11),'All Data'!$A$2:$L$1048576,8,FALSE)","v":79.393460000000005},{"$f":"VLOOKUP(($B11&\"_\"&AJ$44&\"_\"&AJ$43&\"_\"&AJ$45&\"_\"&$AC11),'All Data'!$A$2:$L$1048576,8,FALSE)","v":21.480608707914048},{"$f":"VLOOKUP(($B11&\"_\"&AL$44&\"_\"&AL$43&\"_\"&AL$45&\"_\"&$AC11),'All Data'!$A$2:$L$1048576,8,FALSE)","v":2.4696432265063626},{"$f":"VLOOKUP(($B11&\"_\"&AM$44&\"_\"&AM$43&\"_\"&AM$45&\"_\"&$AC11),'All Data'!$A$2:$L$1048576,8,FALSE)","v":35.648718003113444},{"$f":"VLOOKUP(($B11&\"_\"&AN$44&\"_\"&AN$43&\"_\"&AN$45&\"_\"&$AC11),'All Data'!$A$2:$L$1048576,8,FALSE)","v":56.2438316227448},null,{"$f":"VLOOKUP(($B11&\"_\"&AO$44&\"_\"&AO$43&\"_\"&AO$45&\"_\"&$AC11),'All Data'!$A$2:$L$1048576,8,FALSE)","v":322.61637999999999},{"$f":"VLOOKUP(($B11&\"_\"&AP$44&\"_\"&AP$43&\"_\"&AP$45&\"_\"&$AC11),'All Data'!$A$2:$L$1048576,8,FALSE)","v":383.02123999999998},{"$f":"VLOOKUP(($B11&\"_\"&AQ$44&\"_\"&AQ$43&\"_\"&AQ$45&\"_\"&$AC11),'All Data'!$A$2:$L$1048576,8,FALSE)","v":265.37837999999999},null,{"$f":"VLOOKUP(($B11&\"_\"&AR$44&\"_\"&AR$43&\"_\"&AR$45&\"_\"&$AC11),'All Data'!$A$2:$L$1048576,8,FALSE)","v":37.756202804746493},null,{"$f":"VLOOKUP(($B11&\"_\"&AS$44&\"_\"&AS$43&\"_\"&AS$45&\"_\"&$AC11),'All Data'!$A$2:$L$1048576,8,FALSE)","v":734.0874},{"$f":"VLOOKUP(($B11&\"_\"&AT$44&\"_\"&AT$43&\"_\"&AT$45&\"_\"&$AC11),'All Data'!$A$2:$L$1048576,8,FALSE)","v":472.80970000000002},{"$f":"VLOOKUP(($B11&\"_\"&AU$44&\"_\"&AU$43&\"_\"&AU$45&\"_\"&$AC11),'All Data'!$A$2:$L$1048576,8,FALSE)","v":927.49829999999997},null,{"$f":"VLOOKUP(($B11&\"_\"&AV$44&\"_\"&AV$43&\"_\"&AV$45&\"_\"&$AC11),'All Data'!$A$2:$L$1048576,8,FALSE)","v":83.065855008301043},null,null,null,"LA",{"$f":"'Overview (controls)'!C11","v":0},{"$f":"'Overview (controls)'!D11","v":0},{"$f":"'Overview (controls)'!E11","v":0},{"$f":"'Overview (controls)'!F11","v":0},{"$f":"'Overview (controls)'!G11","v":1.470987},{"$f":"'Overview (controls)'!H11","v":13.449009999999999},{"$f":"'Overview (controls)'!I11","v":4.1297090000000001},{"$f":"'Overview (controls)'!J11","v":9.4902899999999999},{"$f":"'Overview (controls)'!K11","v":77.054169999999999},{"$f":"'Overview (controls)'!L11","v":81.732749999999996},{"$f":"'Overview (controls)'!M11","v":{"$error":"#N/A"}},{"$f":"'Overview (controls)'!N11","v":{"$error":"#N/A"}},{"$f":"'Overview (controls)'!O11","v":18.910820000000001},{"$f":"'Overview (controls)'!P11","v":24.0504},{"$f":"'Overview (controls)'!Q11","v":2.3481489999999998},{"$f":"'Overview (controls)'!R11","v":2.5911369999999998},{"$f":"'Overview (controls)'!S11","v":32.514189999999999},{"$f":"'Overview (controls)'!T11","v":38.783250000000002},{"$f":"'Overview (controls)'!U11","v":53.399319999999996},{"$f":"'Overview (controls)'!V11","v":59.088339999999995},{"$f":"'Overview (controls)'!W11","v":294.10234000000003},{"$f":"'Overview (controls)'!X11","v":353.09652999999997},{"$f":"'Overview (controls)'!Y11","v":339.83902999999998},{"$f":"'Overview (controls)'!Z11","v":430.08524},{"$f":"'Overview (controls)'!AA11","v":228.68026},{"$f":"'Overview (controls)'!AB11","v":306.17178000000001},{"$f":"'Overview (controls)'!AC11","v":30.87967511640387},{"$f":"'Overview (controls)'!AD11","v":45.717308549562944},{"$f":"'Overview (controls)'!AE11","v":640.13422000000003},{"$f":"'Overview (controls)'!AF11","v":837.76833999999997},{"$f":"'Overview (controls)'!AG11","v":359.11914000000002},{"$f":"'Overview (controls)'!AH11","v":610.85365000000002},{"$f":"'Overview (controls)'!AI11","v":787.12114999999994},{"$f":"'Overview (controls)'!AJ11","v":1084.92247},{"$f":"'Overview (controls)'!AK11","v":81.266821004160278},{"$f":"'Overview (controls)'!AL11","v":84.724594258223817}]
[null,"Wrexham",null,null,null,{"$f":"VLOOKUP(($B12&\"_\"&AF$44&\"_\"&AF$43&\"_\"&AF$45&\"_\"&$AC12),'All Data'!$A$2:$L$1048576,8,FALSE)","v":9.1770169999999993},{"$f":"VLOOKUP(($B12&\"_\"&AG$44&\"_\"&AG$43&\"_\"&AG$45&\"_\"&$AC12),'All Data'!$A$2:$L$1048576,8,FALSE)","v":8.1565510000000003},null,{"$f":"VLOOKUP(($B12&\"_\"&AH$44&\"_\"&AH$43&\"_\"&AH$45&\"_\"&$AC12),'All Data'!$A$2:$L$1048576,8,FALSE)","v":74.888400000000004},{"$f":"VLOOKUP(($B12&\"_\"&AJ$44&\"_\"&AJ$43&\"_\"&AJ$45&\"_\"&$AC12),'All Data'!$A$2:$L$1048576,8,FALSE)","v":26.159974646678211},{"$f":"VLOOKUP(($B12&\"_\"&AL$44&\"_\"&AL$43&\"_\"&AL$45&\"_\"&$AC12),'All Data'!$A$2:$L$1048576,8,FALSE)","v":2.3664298997357038},{"$f":"VLOOKUP(($B12&\"_\"&AM$44&\"_\"&AM$43&\"_\"&AM$45&\"_\"&$AC12),'All Data'!$A$2:$L$1048576,8,FALSE)","v":31.744437650527217},{"$f":"VLOOKUP(($B12&\"_\"&AN$44&\"_\"&AN$43&\"_\"&AN$45&\"_\"&$AC12),'All Data'!$A$2:$L$1048576,8,FALSE)","v":54.349552822078387},null,{"$f":"VLOOKUP(($B12&\"_\"&AO$44&\"_\"&AO$43&\"_\"&AO$45&\"_\"&$AC12),'All Data'!$A$2:$L$1048576,8,FALSE)","v":383.82038},{"$f":"VLOOKUP(($B12&\"_\"&AP$44&\"_\"&AP$43&\"_\"&AP$45&\"_\"&$AC12),'All Data'!$A$2:$L$1048576,8,FALSE)","v":473.49266},{"$f":"VLOOKUP(($B12&\"_\"&AQ$44&\"_\"&AQ$43&\"_\"&AQ$45&\"_\"&$AC12),'All Data'!$A$2:$L$1048576,8,FALSE)","v":296.58775000000003},null,{"$f":"VLOOKUP(($B12&\"_\"&AR$44&\"_\"&AR$43&\"_\"&AR$45&\"_\"&$AC12),'All Data'!$A$2:$L$1048576,8,FALSE)","v":42.764578833693307},null,{"$f":"VLOOKUP(($B12&\"_\"&AS$44&\"_\"&AS$43&\"_\"&AS$45&\"_\"&$AC12),'All Data'!$A$2:$L$1048576,8,FALSE)","v":485.54579999999999},{"$f":"VLOOKUP(($B12&\"_\"&AT$44&\"_\"&AT$43&\"_\"&AT$45&\"_\"&$AC12),'All Data'!$A$2:$L$1048576,8,FALSE)","v":331.5795},{"$f":"VLOOKUP(($B12&\"_\"&AU$44&\"_\"&AU$43&\"_\"&AU$45&\"_\"&$AC12),'All Data'!$A$2:$L$1048576,8,FALSE)","v":586.65440000000001},null,{"$f":"VLOOKUP(($B12&\"_\"&AV$44&\"_\"&AV$43&\"_\"&AV$45&\"_\"&$AC12),'All Data'!$A$2:$L$1048576,8,FALSE)","v":84.766584766584756},null,null,null,"LA",{"$f":"'Overview (controls)'!C12","v":0},{"$f":"'Overview (controls)'!D12","v":0},{"$f":"'Overview (controls)'!E12","v":0},{"$f":"'Overview (controls)'!F12","v":0},{"$f":"'Overview (controls)'!G12","v":5.5414770000000004},{"$f":"'Overview (controls)'!H12","v":12.81256},{"$f":"'Overview (controls)'!I12","v":0.97660049999999998},{"$f":"'Overview (controls)'!J12","v":15.336499999999999},{"$f":"'Overview (controls)'!K12","v":72.279319999999998},{"$f":"'Overview (controls)'!L12","v":77.497479999999996},{"$f":"'Overview (controls)'!M12","v":{"$error":"#N/A"}},{"$f":"'Overview (controls)'!N12","v":{"$error":"#N/A"}},{"$f":"'Overview (controls)'!O12","v":23.267699999999998},{"$f":"'Overview (controls)'!P12","v":29.052240000000001},{"$f":"'Overview (controls)'!Q12","v":2.2382460000000002},{"$f":"'Overview (controls)'!R12","v":2.4946139999999999},{"$f":"'Overview (controls)'!S12","v":28.832090000000001},{"$f":"'Overview (controls)'!T12","v":34.656779999999998},{"$f":"'Overview (controls)'!U12","v":51.403770000000002},{"$f":"'Overview (controls)'!V12","v":57.29533},{"$f":"'Overview (controls)'!W12","v":351.2045},{"$f":"'Overview (controls)'!X12","v":418.61322000000001},{"$f":"'Overview (controls)'!Y12","v":422.72622999999999},{"$f":"'Overview (controls)'!Z12","v":528.61239},{"$f":"'Overview (controls)'!AA12","v":256.36304000000001},{"$f":"'Overview (controls)'!AB12","v":341.25378000000001},{"$f":"'Overview (controls)'!AC12","v":34.756803455723542},{"$f":"'Overview (controls)'!AD12","v":52.064362850971918},{"$f":"'Overview (controls)'!AE12","v":406.99666000000002},{"$f":"'Overview (controls)'!AF12","v":574.48985000000005},{"$f":"'Overview (controls)'!AG12","v":231.16972999999999},{"$f":"'Overview (controls)'!AH12","v":460.38342},{"$f":"'Overview (controls)'!AI12","v":473.70765999999998},{"$f":"'Overview (controls)'!AJ12","v":717.06965000000002},{"$f":"'Overview (controls)'!AK12","v":82.9392945361557},{"$f":"'Overview (controls)'!AL12","v":86.430183481808797}]
[null,"Powys",null,null,null,{"$f":"VLOOKUP(($B13&\"_\"&AF$44&\"_\"&AF$43&\"_\"&AF$45&\"_\"&$AC13),'All Data'!$A$2:$L$1048576,8,FALSE)","v":5.4724659999999998},{"$f":"VLOOKUP(($B13&\"_\"&AG$44&\"_\"&AG$43&\"_\"&AG$45&\"_\"&$AC13),'All Data'!$A$2:$L$1048576,8,FALSE)","v":4.9087379999999996},null,{"$f":"VLOOKUP(($B13&\"_\"&AH$44&\"_\"&AH$43&\"_\"&AH$45&\"_\"&$AC13),'All Data'!$A$2:$L$1048576,8,FALSE)","v":79.822099999999992},{"$f":"VLOOKUP(($B13&\"_\"&AJ$44&\"_\"&AJ$43&\"_\"&AJ$45&\"_\"&$AC13),'All Data'!$A$2:$L$1048576,8,FALSE)","v":22.752301405820688},{"$f":"VLOOKUP(($B13&\"_\"&AL$44&\"_\"&AL$43&\"_\"&AL$45&\"_\"&$AC13),'All Data'!$A$2:$L$1048576,8,FALSE)","v":2.7589018098519684},{"$f":"VLOOKUP(($B13&\"_\"&AM$44&\"_\"&AM$43&\"_\"&AM$45&\"_\"&$AC13),'All Data'!$A$2:$L$1048576,8,FALSE)","v":37.069775138145552},{"$f":"VLOOKUP(($B13&\"_\"&AN$44&\"_\"&AN$43&\"_\"&AN$45&\"_\"&$AC13),'All Data'!$A$2:$L$1048576,8,FALSE)","v":55.973118219788418},null,{"$f":"VLOOKUP(($B13&\"_\"&AO$44&\"_\"&AO$43&\"_\"&AO$45&\"_\"&$AC13),'All Data'!$A$2:$L$1048576,8,FALSE)","v":219.90387999999999},{"$f":"VLOOKUP(($B13&\"_\"&AP$44&\"_\"&AP$43&\"_\"&AP$45&\"_\"&$AC13),'All Data'!$A$2:$L$1048576,8,FALSE)","v":305.18295000000001},{"$f":"VLOOKUP(($B13&\"_\"&AQ$44&\"_\"&AQ$43&\"_\"&AQ$45&\"_\"&$AC13),'All Data'!$A$2:$L$1048576,8,FALSE)","v":133.88287},null,{"$f":"VLOOKUP(($B13&\"_\"&AR$44&\"_\"&AR$43&\"_\"&AR$45&\"_\"&$AC13),'All Data'!$A$2:$L$1048576,8,FALSE)","v":23.726176584986387},null,{"$f":"VLOOKUP(($B13&\"_\"&AS$44&\"_\"&AS$43&\"_\"&AS$45&\"_\"&$AC13),'All Data'!$A$2:$L$1048576,8,FALSE)","v":614.60550000000001},{"$f":"VLOOKUP(($B13&\"_\"&AT$44&\"_\"&AT$43&\"_\"&AT$45&\"_\"&$AC13),'All Data'!$A$2:$L$1048576,8,FALSE)","v":362.3168},{"$f":"VLOOKUP(($B13&\"_\"&AU$44&\"_\"&AU$43&\"_\"&AU$45&\"_\"&$AC13),'All Data'!$A$2:$L$1048576,8,FALSE)","v":800.07650000000001},null,{"$f":"VLOOKUP(($B13&\"_\"&AV$44&\"_\"&AV$43&\"_\"&AV$45&\"_\"&$AC13),'All Data'!$A$2:$L$1048576,8,FALSE)","v":81.411764705882348},null,null,null,"LA",{"$f":"'Overview (controls)'!C13","v":0},{"$f":"'Overview (controls)'!D13","v":0},{"$f":"'Overview (controls)'!E13","v":0},{"$f":"'Overview (controls)'!F13","v":0},{"$f":"'Overview (controls)'!G13","v":-0.49527690000000002},{"$f":"'Overview (controls)'!H13","v":11.44021},{"$f":"'Overview (controls)'!I13","v":-4.0372440000000003},{"$f":"'Overview (controls)'!J13","v":13.85472},{"$f":"'Overview (controls)'!K13","v":77.070390000000003},{"$f":"'Overview (controls)'!L13","v":82.573810000000009},{"$f":"'Overview (controls)'!M13","v":{"$error":"#N/A"}},{"$f":"'Overview (controls)'!N13","v":{"$error":"#N/A"}},{"$f":"'Overview (controls)'!O13","v":19.8109},{"$f":"'Overview (controls)'!P13","v":25.693700000000003},{"$f":"'Overview (controls)'!Q13","v":2.6259760000000001},{"$f":"'Overview (controls)'!R13","v":2.8918270000000001},{"$f":"'Overview (controls)'!S13","v":33.775570000000002},{"$f":"'Overview (controls)'!T13","v":40.363979999999998},{"$f":"'Overview (controls)'!U13","v":52.762450000000008},{"$f":"'Overview (controls)'!V13","v":59.183779999999999},{"$f":"'Overview (controls)'!W13","v":193.4983},{"$f":"'Overview (controls)'!X13","v":248.70436000000001},{"$f":"'Overview (controls)'!Y13","v":261.83452},{"$f":"'Overview (controls)'!Z13","v":353.29257999999999},{"$f":"'Overview (controls)'!AA13","v":105.40588},{"$f":"'Overview (controls)'!AB13","v":167.22681},{"$f":"'Overview (controls)'!AC13","v":18.148580318942045},{"$f":"'Overview (controls)'!AD13","v":30.477246207701281},{"$f":"'Overview (controls)'!AE13","v":536.83633999999995},{"$f":"'Overview (controls)'!AF13","v":700.17668000000003},{"$f":"'Overview (controls)'!AG13","v":274.07488000000001},{"$f":"'Overview (controls)'!AH13","v":469.64096000000001},{"$f":"'Overview (controls)'!AI13","v":681.24068999999997},{"$f":"'Overview (controls)'!AJ13","v":932.70222000000001},{"$f":"'Overview (controls)'!AK13","v":79.183204060416742},{"$f":"'Overview (controls)'!AL13","v":83.451605442183137}]
[null,"Ceredigion",null,null,null,{"$f":"VLOOKUP(($B14&\"_\"&AF$44&\"_\"&AF$43&\"_\"&AF$45&\"_\"&$AC14),'All Data'!$A$2:$L$1048576,8,FALSE)","v":7.6682649999999999},{"$f":"VLOOKUP(($B14&\"_\"&AG$44&\"_\"&AG$43&\"_\"&AG$45&\"_\"&$AC14),'All Data'!$A$2:$L$1048576,8,FALSE)","v":1.2225760000000001},null,{"$f":"VLOOKUP(($B14&\"_\"&AH$44&\"_\"&AH$43&\"_\"&AH$45&\"_\"&$AC14),'All Data'!$A$2:$L$1048576,8,FALSE)","v":80.605840000000001},{"$f":"VLOOKUP(($B14&\"_\"&AJ$44&\"_\"&AJ$43&\"_\"&AJ$45&\"_\"&$AC14),'All Data'!$A$2:$L$1048576,8,FALSE)","v":22.883570709217395},{"$f":"VLOOKUP(($B14&\"_\"&AL$44&\"_\"&AL$43&\"_\"&AL$45&\"_\"&$AC14),'All Data'!$A$2:$L$1048576,8,FALSE)","v":2.6745058600585034},{"$f":"VLOOKUP(($B14&\"_\"&AM$44&\"_\"&AM$43&\"_\"&AM$45&\"_\"&$AC14),'All Data'!$A$2:$L$1048576,8,FALSE)","v":41.063956561656212},{"$f":"VLOOKUP(($B14&\"_\"&AN$44&\"_\"&AN$43&\"_\"&AN$45&\"_\"&$AC14),'All Data'!$A$2:$L$1048576,8,FALSE)","v":53.464115928285871},null,{"$f":"VLOOKUP(($B14&\"_\"&AO$44&\"_\"&AO$43&\"_\"&AO$45&\"_\"&$AC14),'All Data'!$A$2:$L$1048576,8,FALSE)","v":188.65411},{"$f":"VLOOKUP(($B14&\"_\"&AP$44&\"_\"&AP$43&\"_\"&AP$45&\"_\"&$AC14),'All Data'!$A$2:$L$1048576,8,FALSE)","v":264.98253999999997},{"$f":"VLOOKUP(($B14&\"_\"&AQ$44&\"_\"&AQ$43&\"_\"&AQ$45&\"_\"&$AC14),'All Data'!$A$2:$L$1048576,8,FALSE)","v":117.33358},null,{"$f":"VLOOKUP(($B14&\"_\"&AR$44&\"_\"&AR$43&\"_\"&AR$45&\"_\"&$AC14),'All Data'!$A$2:$L$1048576,8,FALSE)","v":22.727272727272727},null,{"$f":"VLOOKUP(($B14&\"_\"&AS$44&\"_\"&AS$43&\"_\"&AS$45&\"_\"&$AC14),'All Data'!$A$2:$L$1048576,8,FALSE)","v":499.64490000000001},{"$f":"VLOOKUP(($B14&\"_\"&AT$44&\"_\"&AT$43&\"_\"&AT$45&\"_\"&$AC14),'All Data'!$A$2:$L$1048576,8,FALSE)","v":347.44009999999997},{"$f":"VLOOKUP(($B14&\"_\"&AU$44&\"_\"&AU$43&\"_\"&AU$45&\"_\"&$AC14),'All Data'!$A$2:$L$1048576,8,FALSE)","v":635.19889999999998},null,{"$f":"VLOOKUP(($B14&\"_\"&AV$44&\"_\"&AV$43&\"_\"&AV$45&\"_\"&$AC14),'All Data'!$A$2:$L$1048576,8,FALSE)","v":83.796296296296291},null,null,null,"LA",{"$f":"'Overview (controls)'!C14","v":0},{"$f":"'Overview (controls)'!D14","v":0},{"$f":"'Overview (controls)'!E14","v":0},{"$f":"'Overview (controls)'!F14","v":0},{"$f":"'Overview (controls)'!G14","v":2.851477},{"$f":"'Overview (controls)'!H14","v":12.485049999999999},{"$f":"'Overview (controls)'!I14","v":-1.0924240000000001},{"$f":"'Overview (controls)'!J14","v":3.5375770000000002},{"$f":"'Overview (controls)'!K14","v":78.069599999999994},{"$f":"'Overview (controls)'!L14","v":83.142079999999993},{"$f":"'Overview (controls)'!M14","v":{"$error":"#N/A"}},{"$f":"'Overview (controls)'!N14","v":{"$error":"#N/A"}},{"$f":"'Overview (controls)'!O14","v":19.99239},{"$f":"'Overview (controls)'!P14","v":25.774760000000001},{"$f":"'Overview (controls)'!Q14","v":2.5431650000000001},{"$f":"'Overview (controls)'!R14","v":2.805847},{"$f":"'Overview (controls)'!S14","v":37.88317},{"$f":"'Overview (controls)'!T14","v":44.244749999999996},{"$f":"'Overview (controls)'!U14","v":50.311760000000007},{"$f":"'Overview (controls)'!V14","v":56.61647},{"$f":"'Overview (controls)'!W14","v":156.51338999999999},{"$f":"'Overview (controls)'!X14","v":225.04822999999999},{"$f":"'Overview (controls)'!Y14","v":210.13822999999999},{"$f":"'Overview (controls)'!Z14","v":328.82234},{"$f":"'Overview (controls)'!AA14","v":83.471940000000004},{"$f":"'Overview (controls)'!AB14","v":159.42984999999999},{"$f":"'Overview (controls)'!AC14","v":15.22100313479624},{"$f":"'Overview (controls)'!AD14","v":32.640282131661444},{"$f":"'Overview (controls)'!AE14","v":407.9042},{"$f":"'Overview (controls)'!AF14","v":605.29593},{"$f":"'Overview (controls)'!AG14","v":236.31156999999999},{"$f":"'Overview (controls)'!AH14","v":492.18630000000002},{"$f":"'Overview (controls)'!AI14","v":493.95632999999998},{"$f":"'Overview (controls)'!AJ14","v":802.20324000000005},{"$f":"'Overview (controls)'!AK14","v":80.761300633610162},{"$f":"'Overview (controls)'!AL14","v":86.432937966687845}]
[null,"Pembrokeshire",null,null,null,{"$f":"VLOOKUP(($B15&\"_\"&AF$44&\"_\"&AF$43&\"_\"&AF$45&\"_\"&$AC15),'All Data'!$A$2:$L$1048576,8,FALSE)","v":5.9476430000000002},{"$f":"VLOOKUP(($B15&\"_\"&AG$44&\"_\"&AG$43&\"_\"&AG$45&\"_\"&$AC15),'All Data'!$A$2:$L$1048576,8,FALSE)","v":4.1766319999999997},null,{"$f":"VLOOKUP(($B15&\"_\"&AH$44&\"_\"&AH$43&\"_\"&AH$45&\"_\"&$AC15),'All Data'!$A$2:$L$1048576,8,FALSE)","v":78.56701000000001},{"$f":"VLOOKUP(($B15&\"_\"&AJ$44&\"_\"&AJ$43&\"_\"&AJ$45&\"_\"&$AC15),'All Data'!$A$2:$L$1048576,8,FALSE)","v":22.825987566157369},{"$f":"VLOOKUP(($B15&\"_\"&AL$44&\"_\"&AL$43&\"_\"&AL$45&\"_\"&$AC15),'All Data'!$A$2:$L$1048576,8,FALSE)","v":2.612246653098516},{"$f":"VLOOKUP(($B15&\"_\"&AM$44&\"_\"&AM$43&\"_\"&AM$45&\"_\"&$AC15),'All Data'!$A$2:$L$1048576,8,FALSE)","v":38.264852859471283},{"$f":"VLOOKUP(($B15&\"_\"&AN$44&\"_\"&AN$43&\"_\"&AN$45&\"_\"&$AC15),'All Data'!$A$2:$L$1048576,8,FALSE)","v":59.220667443311484},null,{"$f":"VLOOKUP(($B15&\"_\"&AO$44&\"_\"&AO$43&\"_\"&AO$45&\"_\"&$AC15),'All Data'!$A$2:$L$1048576,8,FALSE)","v":294.91548},{"$f":"VLOOKUP(($B15&\"_\"&AP$44&\"_\"&AP$43&\"_\"&AP$45&\"_\"&$AC15),'All Data'!$A$2:$L$1048576,8,FALSE)","v":387.92563000000001},{"$f":"VLOOKUP(($B15&\"_\"&AQ$44&\"_\"&AQ$43&\"_\"&AQ$45&\"_\"&$AC15),'All Data'!$A$2:$L$1048576,8,FALSE)","v":208.28975},null,{"$f":"VLOOKUP(($B15&\"_\"&AR$44&\"_\"&AR$43&\"_\"&AR$45&\"_\"&$AC15),'All Data'!$A$2:$L$1048576,8,FALSE)","v":29.711375212224109},null,{"$f":"VLOOKUP(($B15&\"_\"&AS$44&\"_\"&AS$43&\"_\"&AS$45&\"_\"&$AC15),'All Data'!$A$2:$L$1048576,8,FALSE)","v":620.10770000000002},{"$f":"VLOOKUP(($B15&\"_\"&AT$44&\"_\"&AT$43&\"_\"&AT$45&\"_\"&$AC15),'All Data'!$A$2:$L$1048576,8,FALSE)","v":416.78179999999998},{"$f":"VLOOKUP(($B15&\"_\"&AU$44&\"_\"&AU$43&\"_\"&AU$45&\"_\"&$AC15),'All Data'!$A$2:$L$1048576,8,FALSE)","v":773.85500000000002},null,{"$f":"VLOOKUP(($B15&\"_\"&AV$44&\"_\"&AV$43&\"_\"&AV$45&\"_\"&$AC15),'All Data'!$A$2:$L$1048576,8,FALSE)","v":75.34142640364189},null,null,null,"LA",{"$f":"'Overview (controls)'!C15","v":0},{"$f":"'Overview (controls)'!D15","v":0},{"$f":"'Overview (controls)'!E15","v":0},{"$f":"'Overview (controls)'!F15","v":0},{"$f":"'Overview (controls)'!G15","v":-2.4788670000000002},{"$f":"'Overview (controls)'!H15","v":14.37415},{"$f":"'Overview (controls)'!I15","v":2.1196000000000002},{"$f":"'Overview (controls)'!J15","v":6.2336640000000001},{"$f":"'Overview (controls)'!K15","v":76.062909999999988},{"$f":"'Overview (controls)'!L15","v":81.071100000000001},{"$f":"'Overview (controls)'!M15","v":{"$error":"#N/A"}},{"$f":"'Overview (controls)'!N15","v":{"$error":"#N/A"}},{"$f":"'Overview (controls)'!O15","v":19.97523},{"$f":"'Overview (controls)'!P15","v":25.676739999999999},{"$f":"'Overview (controls)'!Q15","v":2.4700790000000001},{"$f":"'Overview (controls)'!R15","v":2.7544149999999998},{"$f":"'Overview (controls)'!S15","v":35.050409999999999},{"$f":"'Overview (controls)'!T15","v":41.479300000000002},{"$f":"'Overview (controls)'!U15","v":56.100680000000004},{"$f":"'Overview (controls)'!V15","v":62.34066},{"$f":"'Overview (controls)'!W15","v":263.51382000000001},{"$f":"'Overview (controls)'!X15","v":328.88472000000002},{"$f":"'Overview (controls)'!Y15","v":337.44841000000002},{"$f":"'Overview (controls)'!Z15","v":443.54613999999998},{"$f":"'Overview (controls)'!AA15","v":171.09990999999999},{"$f":"'Overview (controls)'!AB15","v":250.83873},{"$f":"'Overview (controls)'!AC15","v":23.161290322580644},{"$f":"'Overview (controls)'!AD15","v":37.538624787775895},{"$f":"'Overview (controls)'!AE15","v":535.00612000000001},{"$f":"'Overview (controls)'!AF15","v":714.65544},{"$f":"'Overview (controls)'!AG15","v":309.82317},{"$f":"'Overview (controls)'!AH15","v":548.31985999999995},{"$f":"'Overview (controls)'!AI15","v":647.54444000000001},{"$f":"'Overview (controls)'!AJ15","v":916.63633000000004},{"$f":"'Overview (controls)'!AK15","v":72.942979542770331},{"$f":"'Overview (controls)'!AL15","v":77.592576305978866}]
[null,"Carmarthenshire",null,null,null,{"$f":"VLOOKUP(($B16&\"_\"&AF$44&\"_\"&AF$43&\"_\"&AF$45&\"_\"&$AC16),'All Data'!$A$2:$L$1048576,8,FALSE)","v":5.7528119999999996},{"$f":"VLOOKUP(($B16&\"_\"&AG$44&\"_\"&AG$43&\"_\"&AG$45&\"_\"&$AC16),'All Data'!$A$2:$L$1048576,8,FALSE)","v":2.9389620000000001},null,{"$f":"VLOOKUP(($B16&\"_\"&AH$44&\"_\"&AH$43&\"_\"&AH$45&\"_\"&$AC16),'All Data'!$A$2:$L$1048576,8,FALSE)","v":71.817160000000001},{"$f":"VLOOKUP(($B16&\"_\"&AJ$44&\"_\"&AJ$43&\"_\"&AJ$45&\"_\"&$AC16),'All Data'!$A$2:$L$1048576,8,FALSE)","v":22.805451214278975},{"$f":"VLOOKUP(($B16&\"_\"&AL$44&\"_\"&AL$43&\"_\"&AL$45&\"_\"&$AC16),'All Data'!$A$2:$L$1048576,8,FALSE)","v":2.3607693002090158},{"$f":"VLOOKUP(($B16&\"_\"&AM$44&\"_\"&AM$43&\"_\"&AM$45&\"_\"&$AC16),'All Data'!$A$2:$L$1048576,8,FALSE)","v":40.027514488305229},{"$f":"VLOOKUP(($B16&\"_\"&AN$44&\"_\"&AN$43&\"_\"&AN$45&\"_\"&$AC16),'All Data'!$A$2:$L$1048576,8,FALSE)","v":59.448254086114758},null,{"$f":"VLOOKUP(($B16&\"_\"&AO$44&\"_\"&AO$43&\"_\"&AO$45&\"_\"&$AC16),'All Data'!$A$2:$L$1048576,8,FALSE)","v":286.39105999999998},{"$f":"VLOOKUP(($B16&\"_\"&AP$44&\"_\"&AP$43&\"_\"&AP$45&\"_\"&$AC16),'All Data'!$A$2:$L$1048576,8,FALSE)","v":349.31297999999998},{"$f":"VLOOKUP(($B16&\"_\"&AQ$44&\"_\"&AQ$43&\"_\"&AQ$45&\"_\"&$AC16),'All Data'!$A$2:$L$1048576,8,FALSE)","v":228.65536},null,{"$f":"VLOOKUP(($B16&\"_\"&AR$44&\"_\"&AR$43&\"_\"&AR$45&\"_\"&$AC16),'All Data'!$A$2:$L$1048576,8,FALSE)","v":32.515518770322203},null,{"$f":"VLOOKUP(($B16&\"_\"&AS$44&\"_\"&AS$43&\"_\"&AS$45&\"_\"&$AC16),'All Data'!$A$2:$L$1048576,8,FALSE)","v":654.55539999999996},{"$f":"VLOOKUP(($B16&\"_\"&AT$44&\"_\"&AT$43&\"_\"&AT$45&\"_\"&$AC16),'All Data'!$A$2:$L$1048576,8,FALSE)","v":513.25350000000003},{"$f":"VLOOKUP(($B16&\"_\"&AU$44&\"_\"&AU$43&\"_\"&AU$45&\"_\"&$AC16),'All Data'!$A$2:$L$1048576,8,FALSE)","v":760.17539999999997},null,{"$f":"VLOOKUP(($B16&\"_\"&AV$44&\"_\"&AV$43&\"_\"&AV$45&\"_\"&$AC16),'All Data'!$A$2:$L$1048576,8,FALSE)","v":78.62444334487877},null,null,null,"LA",{"$f":"'Overview (controls)'!C16","v":0},{"$f":"'Overview (controls)'!D16","v":0},{"$f":"'Overview (controls)'!E16","v":0},{"$f":"'Overview (controls)'!F16","v":0},{"$f":"'Overview (controls)'!G16","v":-0.47629850000000001},{"$f":"'Overview (controls)'!H16","v":11.981920000000001},{"$f":"'Overview (controls)'!I16","v":0.26154149999999998},{"$f":"'Overview (controls)'!J16","v":5.6163829999999999},{"$f":"'Overview (controls)'!K16","v":69.186849999999993},{"$f":"'Overview (controls)'!L16","v":74.44747000000001},{"$f":"'Overview (controls)'!M16","v":{"$error":"#N/A"}},{"$f":"'Overview (controls)'!N16","v":{"$error":"#N/A"}},{"$f":"'Overview (controls)'!O16","v":20.140689999999999},{"$f":"'Overview (controls)'!P16","v":25.470209999999998},{"$f":"'Overview (controls)'!Q16","v":2.2373270000000001},{"$f":"'Overview (controls)'!R16","v":2.4842110000000002},{"$f":"'Overview (controls)'!S16","v":37.09234},{"$f":"'Overview (controls)'!T16","v":42.962689999999995},{"$f":"'Overview (controls)'!U16","v":56.723970000000001},{"$f":"'Overview (controls)'!V16","v":62.172539999999998},{"$f":"'Overview (controls)'!W16","v":261.40352999999999},{"$f":"'Overview (controls)'!X16","v":313.06137999999999},{"$f":"'Overview (controls)'!Y16","v":309.93295999999998},{"$f":"'Overview (controls)'!Z16","v":392.17806000000002},{"$f":"'Overview (controls)'!AA16","v":197.84764999999999},{"$f":"'Overview (controls)'!AB16","v":262.77838000000003},{"$f":"'Overview (controls)'!AC16","v":26.722951988136273},{"$f":"'Overview (controls)'!AD16","v":39.199019023231259},{"$f":"'Overview (controls)'!AE16","v":582.83338000000003},{"$f":"'Overview (controls)'!AF16","v":732.46767},{"$f":"'Overview (controls)'!AG16","v":414.46634},{"$f":"'Overview (controls)'!AH16","v":628.24359000000004},{"$f":"'Overview (controls)'!AI16","v":657.87057000000004},{"$f":"'Overview (controls)'!AJ16","v":873.12228000000005},{"$f":"'Overview (controls)'!AK16","v":76.78365337075401},{"$f":"'Overview (controls)'!AL16","v":80.356618737444478}]
[null,"Swansea",null,null,null,{"$f":"VLOOKUP(($B17&\"_\"&AF$44&\"_\"&AF$43&\"_\"&AF$45&\"_\"&$AC17),'All Data'!$A$2:$L$1048576,8,FALSE)","v":12.17048},{"$f":"VLOOKUP(($B17&\"_\"&AG$44&\"_\"&AG$43&\"_\"&AG$45&\"_\"&$AC17),'All Data'!$A$2:$L$1048576,8,FALSE)","v":7.3782800000000002},null,{"$f":"VLOOKUP(($B17&\"_\"&AH$44&\"_\"&AH$43&\"_\"&AH$45&\"_\"&$AC17),'All Data'!$A$2:$L$1048576,8,FALSE)","v":74.877719999999997},{"$f":"VLOOKUP(($B17&\"_\"&AJ$44&\"_\"&AJ$43&\"_\"&AJ$45&\"_\"&$AC17),'All Data'!$A$2:$L$1048576,8,FALSE)","v":21.962349406675376},{"$f":"VLOOKUP(($B17&\"_\"&AL$44&\"_\"&AL$43&\"_\"&AL$45&\"_\"&$AC17),'All Data'!$A$2:$L$1048576,8,FALSE)","v":2.3252405127361238},{"$f":"VLOOKUP(($B17&\"_\"&AM$44&\"_\"&AM$43&\"_\"&AM$45&\"_\"&$AC17),'All Data'!$A$2:$L$1048576,8,FALSE)","v":37.968953732827941},{"$f":"VLOOKUP(($B17&\"_\"&AN$44&\"_\"&AN$43&\"_\"&AN$45&\"_\"&$AC17),'All Data'!$A$2:$L$1048576,8,FALSE)","v":56.612536587284012},null,{"$f":"VLOOKUP(($B17&\"_\"&AO$44&\"_\"&AO$43&\"_\"&AO$45&\"_\"&$AC17),'All Data'!$A$2:$L$1048576,8,FALSE)","v":313.64186000000001},{"$f":"VLOOKUP(($B17&\"_\"&AP$44&\"_\"&AP$43&\"_\"&AP$45&\"_\"&$AC17),'All Data'!$A$2:$L$1048576,8,FALSE)","v":441.11108000000002},{"$f":"VLOOKUP(($B17&\"_\"&AQ$44&\"_\"&AQ$43&\"_\"&AQ$45&\"_\"&$AC17),'All Data'!$A$2:$L$1048576,8,FALSE)","v":192.46559999999999},null,{"$f":"VLOOKUP(($B17&\"_\"&AR$44&\"_\"&AR$43&\"_\"&AR$45&\"_\"&$AC17),'All Data'!$A$2:$L$1048576,8,FALSE)","v":39.761969164187178},null,{"$f":"VLOOKUP(($B17&\"_\"&AS$44&\"_\"&AS$43&\"_\"&AS$45&\"_\"&$AC17),'All Data'!$A$2:$L$1048576,8,FALSE)","v":544.4982},{"$f":"VLOOKUP(($B17&\"_\"&AT$44&\"_\"&AT$43&\"_\"&AT$45&\"_\"&$AC17),'All Data'!$A$2:$L$1048576,8,FALSE)","v":388.87610000000001},{"$f":"VLOOKUP(($B17&\"_\"&AU$44&\"_\"&AU$43&\"_\"&AU$45&\"_\"&$AC17),'All Data'!$A$2:$L$1048576,8,FALSE)","v":636.67769999999996},null,{"$f":"VLOOKUP(($B17&\"_\"&AV$44&\"_\"&AV$43&\"_\"&AV$45&\"_\"&$AC17),'All Data'!$A$2:$L$1048576,8,FALSE)","v":80.081150866838797},null,null,null,"LA",{"$f":"'Overview (controls)'!C17","v":0},{"$f":"'Overview (controls)'!D17","v":0},{"$f":"'Overview (controls)'!E17","v":0},{"$f":"'Overview (controls)'!F17","v":0},{"$f":"'Overview (controls)'!G17","v":9.2075390000000006},{"$f":"'Overview (controls)'!H17","v":15.133419999999999},{"$f":"'Overview (controls)'!I17","v":5.3445780000000003},{"$f":"'Overview (controls)'!J17","v":9.4119829999999993},{"$f":"'Overview (controls)'!K17","v":72.635000000000005},{"$f":"'Overview (controls)'!L17","v":77.120440000000002},{"$f":"'Overview (controls)'!M17","v":{"$error":"#N/A"}},{"$f":"'Overview (controls)'!N17","v":{"$error":"#N/A"}},{"$f":"'Overview (controls)'!O17","v":19.714979999999997},{"$f":"'Overview (controls)'!P17","v":24.209720000000001},{"$f":"'Overview (controls)'!Q17","v":2.2200120000000001},{"$f":"'Overview (controls)'!R17","v":2.430469},{"$f":"'Overview (controls)'!S17","v":35.335450000000002},{"$f":"'Overview (controls)'!T17","v":40.602460000000001},{"$f":"'Overview (controls)'!U17","v":54.009640000000005},{"$f":"'Overview (controls)'!V17","v":59.215430000000005},{"$f":"'Overview (controls)'!W17","v":290.89451000000003},{"$f":"'Overview (controls)'!X17","v":337.66649999999998},{"$f":"'Overview (controls)'!Y17","v":402.99572999999998},{"$f":"'Overview (controls)'!Z17","v":481.80887999999999},{"$f":"'Overview (controls)'!AA17","v":167.50418999999999},{"$f":"'Overview (controls)'!AB17","v":220.02967000000001},{"$f":"'Overview (controls)'!AC17","v":33.593903954599675},{"$f":"'Overview (controls)'!AD17","v":46.741906713218562},{"$f":"'Overview (controls)'!AE17","v":481.60448000000002},{"$f":"'Overview (controls)'!AF17","v":613.06569999999999},{"$f":"'Overview (controls)'!AG17","v":306.02076},{"$f":"'Overview (controls)'!AH17","v":486.84374000000003},{"$f":"'Overview (controls)'!AI17","v":549.90408000000002},{"$f":"'Overview (controls)'!AJ17","v":732.67443000000003},{"$f":"'Overview (controls)'!AK17","v":78.5355975550099},{"$f":"'Overview (controls)'!AL17","v":81.541572324809209}]
[null,"Neath Port Talbot",null,null,null,{"$f":"VLOOKUP(($B18&\"_\"&AF$44&\"_\"&AF$43&\"_\"&AF$45&\"_\"&$AC18),'All Data'!$A$2:$L$1048576,8,FALSE)","v":10.415850000000001},{"$f":"VLOOKUP(($B18&\"_\"&AG$44&\"_\"&AG$43&\"_\"&AG$45&\"_\"&$AC18),'All Data'!$A$2:$L$1048576,8,FALSE)","v":6.7350070000000004},null,{"$f":"VLOOKUP(($B18&\"_\"&AH$44&\"_\"&AH$43&\"_\"&AH$45&\"_\"&$AC18),'All Data'!$A$2:$L$1048576,8,FALSE)","v":70.7864},{"$f":"VLOOKUP(($B18&\"_\"&AJ$44&\"_\"&AJ$43&\"_\"&AJ$45&\"_\"&$AC18),'All Data'!$A$2:$L$1048576,8,FALSE)","v":25.941954998516572},{"$f":"VLOOKUP(($B18&\"_\"&AL$44&\"_\"&AL$43&\"_\"&AL$45&\"_\"&$AC18),'All Data'!$A$2:$L$1048576,8,FALSE)","v":2.1304238468507921},{"$f":"VLOOKUP(($B18&\"_\"&AM$44&\"_\"&AM$43&\"_\"&AM$45&\"_\"&$AC18),'All Data'!$A$2:$L$1048576,8,FALSE)","v":32.601350409651758},{"$f":"VLOOKUP(($B18&\"_\"&AN$44&\"_\"&AN$43&\"_\"&AN$45&\"_\"&$AC18),'All Data'!$A$2:$L$1048576,8,FALSE)","v":60.631463157575695},null,{"$f":"VLOOKUP(($B18&\"_\"&AO$44&\"_\"&AO$43&\"_\"&AO$45&\"_\"&$AC18),'All Data'!$A$2:$L$1048576,8,FALSE)","v":351.38677999999999},{"$f":"VLOOKUP(($B18&\"_\"&AP$44&\"_\"&AP$43&\"_\"&AP$45&\"_\"&$AC18),'All Data'!$A$2:$L$1048576,8,FALSE)","v":472.66829999999999},{"$f":"VLOOKUP(($B18&\"_\"&AQ$44&\"_\"&AQ$43&\"_\"&AQ$45&\"_\"&$AC18),'All Data'!$A$2:$L$1048576,8,FALSE)","v":236.43279999999999},null,{"$f":"VLOOKUP(($B18&\"_\"&AR$44&\"_\"&AR$43&\"_\"&AR$45&\"_\"&$AC18),'All Data'!$A$2:$L$1048576,8,FALSE)","v":35.97413096200485},null,{"$f":"VLOOKUP(($B18&\"_\"&AS$44&\"_\"&AS$43&\"_\"&AS$45&\"_\"&$AC18),'All Data'!$A$2:$L$1048576,8,FALSE)","v":706.65899999999999},{"$f":"VLOOKUP(($B18&\"_\"&AT$44&\"_\"&AT$43&\"_\"&AT$45&\"_\"&$AC18),'All Data'!$A$2:$L$1048576,8,FALSE)","v":439.0127},{"$f":"VLOOKUP(($B18&\"_\"&AU$44&\"_\"&AU$43&\"_\"&AU$45&\"_\"&$AC18),'All Data'!$A$2:$L$1048576,8,FALSE)","v":891.91250000000002},null,{"$f":"VLOOKUP(($B18&\"_\"&AV$44&\"_\"&AV$43&\"_\"&AV$45&\"_\"&$AC18),'All Data'!$A$2:$L$1048576,8,FALSE)","v":81.50551589876703},null,null,null,"LA",{"$f":"'Overview (controls)'!C18","v":0},{"$f":"'Overview (controls)'!D18","v":0},{"$f":"'Overview (controls)'!E18","v":0},{"$f":"'Overview (controls)'!F18","v":0},{"$f":"'Overview (controls)'!G18","v":7.9771660000000004},{"$f":"'Overview (controls)'!H18","v":12.85454},{"$f":"'Overview (controls)'!I18","v":4.055021},{"$f":"'Overview (controls)'!J18","v":9.4149940000000001},{"$f":"'Overview (controls)'!K18","v":68.179460000000006},{"$f":"'Overview (controls)'!L18","v":73.393349999999998},{"$f":"'Overview (controls)'!M18","v":{"$error":"#N/A"}},{"$f":"'Overview (controls)'!N18","v":{"$error":"#N/A"}},{"$f":"'Overview (controls)'!O18","v":23.169039999999999},{"$f":"'Overview (controls)'!P18","v":28.714869999999998},{"$f":"'Overview (controls)'!Q18","v":2.0103930000000001},{"$f":"'Overview (controls)'!R18","v":2.2504550000000001},{"$f":"'Overview (controls)'!S18","v":29.817430000000002},{"$f":"'Overview (controls)'!T18","v":35.385280000000002},{"$f":"'Overview (controls)'!U18","v":57.810029999999998},{"$f":"'Overview (controls)'!V18","v":63.4529},{"$f":"'Overview (controls)'!W18","v":320.52539999999999},{"$f":"'Overview (controls)'!X18","v":384.36284999999998},{"$f":"'Overview (controls)'!Y18","v":422.14395000000002},{"$f":"'Overview (controls)'!Z18","v":527.47717999999998},{"$f":"'Overview (controls)'!AA18","v":201.07561000000001},{"$f":"'Overview (controls)'!AB18","v":276.08368000000002},{"$f":"'Overview (controls)'!AC18","v":28.890056588520615},{"$f":"'Overview (controls)'!AD18","v":44.269199676637029},{"$f":"'Overview (controls)'!AE18","v":614.90909999999997},{"$f":"'Overview (controls)'!AF18","v":807.82141000000001},{"$f":"'Overview (controls)'!AG18","v":329.62389000000002},{"$f":"'Overview (controls)'!AH18","v":572.76554999999996},{"$f":"'Overview (controls)'!AI18","v":754.70074999999997},{"$f":"'Overview (controls)'!AJ18","v":1045.37976},{"$f":"'Overview (controls)'!AK18","v":79.489481665165357},{"$f":"'Overview (controls)'!AL18","v":83.364858870459784}]
[null,"Bridgend",null,null,null,{"$f":"VLOOKUP(($B19&\"_\"&AF$44&\"_\"&AF$43&\"_\"&AF$45&\"_\"&$AC19),'All Data'!$A$2:$L$1048576,8,FALSE)","v":7.8449989999999996},{"$f":"VLOOKUP(($B19&\"_\"&AG$44&\"_\"&AG$43&\"_\"&AG$45&\"_\"&$AC19),'All Data'!$A$2:$L$1048576,8,FALSE)","v":8.0198889999999992},null,{"$f":"VLOOKUP(($B19&\"_\"&AH$44&\"_\"&AH$43&\"_\"&AH$45&\"_\"&$AC19),'All Data'!$A$2:$L$1048576,8,FALSE)","v":73.923630000000003},{"$f":"VLOOKUP(($B19&\"_\"&AJ$44&\"_\"&AJ$43&\"_\"&AJ$45&\"_\"&$AC19),'All Data'!$A$2:$L$1048576,8,FALSE)","v":21.733878179746046},{"$f":"VLOOKUP(($B19&\"_\"&AL$44&\"_\"&AL$43&\"_\"&AL$45&\"_\"&$AC19),'All Data'!$A$2:$L$1048576,8,FALSE)","v":2.3097411437163857},{"$f":"VLOOKUP(($B19&\"_\"&AM$44&\"_\"&AM$43&\"_\"&AM$45&\"_\"&$AC19),'All Data'!$A$2:$L$1048576,8,FALSE)","v":30.779379491762533},{"$f":"VLOOKUP(($B19&\"_\"&AN$44&\"_\"&AN$43&\"_\"&AN$45&\"_\"&$AC19),'All Data'!$A$2:$L$1048576,8,FALSE)","v":59.963117747903368},null,{"$f":"VLOOKUP(($B19&\"_\"&AO$44&\"_\"&AO$43&\"_\"&AO$45&\"_\"&$AC19),'All Data'!$A$2:$L$1048576,8,FALSE)","v":303.09645},{"$f":"VLOOKUP(($B19&\"_\"&AP$44&\"_\"&AP$43&\"_\"&AP$45&\"_\"&$AC19),'All Data'!$A$2:$L$1048576,8,FALSE)","v":425.28357999999997},{"$f":"VLOOKUP(($B19&\"_\"&AQ$44&\"_\"&AQ$43&\"_\"&AQ$45&\"_\"&$AC19),'All Data'!$A$2:$L$1048576,8,FALSE)","v":185.72235000000001},null,{"$f":"VLOOKUP(($B19&\"_\"&AR$44&\"_\"&AR$43&\"_\"&AR$45&\"_\"&$AC19),'All Data'!$A$2:$L$1048576,8,FALSE)","v":42.454812946616222},null,{"$f":"VLOOKUP(($B19&\"_\"&AS$44&\"_\"&AS$43&\"_\"&AS$45&\"_\"&$AC19),'All Data'!$A$2:$L$1048576,8,FALSE)","v":466.7971},{"$f":"VLOOKUP(($B19&\"_\"&AT$44&\"_\"&AT$43&\"_\"&AT$45&\"_\"&$AC19),'All Data'!$A$2:$L$1048576,8,FALSE)","v":292.61259999999999},{"$f":"VLOOKUP(($B19&\"_\"&AU$44&\"_\"&AU$43&\"_\"&AU$45&\"_\"&$AC19),'All Data'!$A$2:$L$1048576,8,FALSE)","v":581.4212},null,{"$f":"VLOOKUP(($B19&\"_\"&AV$44&\"_\"&AV$43&\"_\"&AV$45&\"_\"&$AC19),'All Data'!$A$2:$L$1048576,8,FALSE)","v":80.949326491340599},null,null,null,"LA",{"$f":"'Overview (controls)'!C19","v":0},{"$f":"'Overview (controls)'!D19","v":0},{"$f":"'Overview (controls)'!E19","v":0},{"$f":"'Overview (controls)'!F19","v":0},{"$f":"'Overview (controls)'!G19","v":4.0547209999999998},{"$f":"'Overview (controls)'!H19","v":11.63528},{"$f":"'Overview (controls)'!I19","v":5.1051190000000002},{"$f":"'Overview (controls)'!J19","v":10.934659999999999},{"$f":"'Overview (controls)'!K19","v":71.245620000000002},{"$f":"'Overview (controls)'!L19","v":76.60163},{"$f":"'Overview (controls)'!M19","v":{"$error":"#N/A"}},{"$f":"'Overview (controls)'!N19","v":{"$error":"#N/A"}},{"$f":"'Overview (controls)'!O19","v":19.098010000000002},{"$f":"'Overview (controls)'!P19","v":24.36975},{"$f":"'Overview (controls)'!Q19","v":2.1800259999999998},{"$f":"'Overview (controls)'!R19","v":2.4394559999999998},{"$f":"'Overview (controls)'!S19","v":27.920859999999998},{"$f":"'Overview (controls)'!T19","v":33.637900000000002},{"$f":"'Overview (controls)'!U19","v":57.015210000000003},{"$f":"'Overview (controls)'!V19","v":62.911019999999994},{"$f":"'Overview (controls)'!W19","v":274.17685999999998},{"$f":"'Overview (controls)'!X19","v":334.18281000000002},{"$f":"'Overview (controls)'!Y19","v":377.18804999999998},{"$f":"'Overview (controls)'!Z19","v":477.73340999999999},{"$f":"'Overview (controls)'!AA19","v":154.05044000000001},{"$f":"'Overview (controls)'!AB19","v":221.84200999999999},{"$f":"'Overview (controls)'!AC19","v":34.578664893906279},{"$f":"'Overview (controls)'!AD19","v":51.599592130806926},{"$f":"'Overview (controls)'!AE19","v":392.59124000000003},{"$f":"'Overview (controls)'!AF19","v":550.75044000000003},{"$f":"'Overview (controls)'!AG19","v":201.86581000000001},{"$f":"'Overview (controls)'!AH19","v":409.87304999999998},{"$f":"'Overview (controls)'!AI19","v":473.93279999999999},{"$f":"'Overview (controls)'!AJ19","v":705.20770000000005},{"$f":"'Overview (controls)'!AK19","v":78.924789625456356},{"$f":"'Overview (controls)'!AL19","v":82.821711107567424}]
[null,"The Vale of Glamorgan",null,null,null,{"$f":"VLOOKUP(($B20&\"_\"&AF$44&\"_\"&AF$43&\"_\"&AF$45&\"_\"&$AC20),'All Data'!$A$2:$L$1048576,8,FALSE)","v":7.5126790000000003},{"$f":"VLOOKUP(($B20&\"_\"&AG$44&\"_\"&AG$43&\"_\"&AG$45&\"_\"&$AC20),'All Data'!$A$2:$L$1048576,8,FALSE)","v":7.4437550000000003},null,{"$f":"VLOOKUP(($B20&\"_\"&AH$44&\"_\"&AH$43&\"_\"&AH$45&\"_\"&$AC20),'All Data'!$A$2:$L$1048576,8,FALSE)","v":76.712500000000006},{"$f":"VLOOKUP(($B20&\"_\"&AJ$44&\"_\"&AJ$43&\"_\"&AJ$45&\"_\"&$AC20),'All Data'!$A$2:$L$1048576,8,FALSE)","v":21.055351141014519},{"$f":"VLOOKUP(($B20&\"_\"&AL$44&\"_\"&AL$43&\"_\"&AL$45&\"_\"&$AC20),'All Data'!$A$2:$L$1048576,8,FALSE)","v":2.4284866979304489},{"$f":"VLOOKUP(($B20&\"_\"&AM$44&\"_\"&AM$43&\"_\"&AM$45&\"_\"&$AC20),'All Data'!$A$2:$L$1048576,8,FALSE)","v":33.641562744220963},{"$f":"VLOOKUP(($B20&\"_\"&AN$44&\"_\"&AN$43&\"_\"&AN$45&\"_\"&$AC20),'All Data'!$A$2:$L$1048576,8,FALSE)","v":54.658458129961495},null,{"$f":"VLOOKUP(($B20&\"_\"&AO$44&\"_\"&AO$43&\"_\"&AO$45&\"_\"&$AC20),'All Data'!$A$2:$L$1048576,8,FALSE)","v":335.96445},{"$f":"VLOOKUP(($B20&\"_\"&AP$44&\"_\"&AP$43&\"_\"&AP$45&\"_\"&$AC20),'All Data'!$A$2:$L$1048576,8,FALSE)","v":434.76342},{"$f":"VLOOKUP(($B20&\"_\"&AQ$44&\"_\"&AQ$43&\"_\"&AQ$45&\"_\"&$AC20),'All Data'!$A$2:$L$1048576,8,FALSE)","v":246.23600999999999},null,{"$f":"VLOOKUP(($B20&\"_\"&AR$44&\"_\"&AR$43&\"_\"&AR$45&\"_\"&$AC20),'All Data'!$A$2:$L$1048576,8,FALSE)","v":31.906300484652665},null,{"$f":"VLOOKUP(($B20&\"_\"&AS$44&\"_\"&AS$43&\"_\"&AS$45&\"_\"&$AC20),'All Data'!$A$2:$L$1048576,8,FALSE)","v":513.35609999999997},{"$f":"VLOOKUP(($B20&\"_\"&AT$44&\"_\"&AT$43&\"_\"&AT$45&\"_\"&$AC20),'All Data'!$A$2:$L$1048576,8,FALSE)","v":307.36989999999997},{"$f":"VLOOKUP(($B20&\"_\"&AU$44&\"_\"&AU$43&\"_\"&AU$45&\"_\"&$AC20),'All Data'!$A$2:$L$1048576,8,FALSE)","v":670.58270000000005},null,{"$f":"VLOOKUP(($B20&\"_\"&AV$44&\"_\"&AV$43&\"_\"&AV$45&\"_\"&$AC20),'All Data'!$A$2:$L$1048576,8,FALSE)","v":81.373844121532372},null,null,null,"LA",{"$f":"'Overview (controls)'!C20","v":0},{"$f":"'Overview (controls)'!D20","v":0},{"$f":"'Overview (controls)'!E20","v":0},{"$f":"'Overview (controls)'!F20","v":0},{"$f":"'Overview (controls)'!G20","v":3.1381389999999998},{"$f":"'Overview (controls)'!H20","v":11.887219999999999},{"$f":"'Overview (controls)'!I20","v":6.7376680000000002},{"$f":"'Overview (controls)'!J20","v":8.1498419999999996},{"$f":"'Overview (controls)'!K20","v":74.045659999999998},{"$f":"'Overview (controls)'!L20","v":79.379350000000002},{"$f":"'Overview (controls)'!M20","v":{"$error":"#N/A"}},{"$f":"'Overview (controls)'!N20","v":{"$error":"#N/A"}},{"$f":"'Overview (controls)'!O20","v":18.210930000000001},{"$f":"'Overview (controls)'!P20","v":23.89978},{"$f":"'Overview (controls)'!Q20","v":2.2985250000000002},{"$f":"'Overview (controls)'!R20","v":2.558449},{"$f":"'Overview (controls)'!S20","v":30.620969999999996},{"$f":"'Overview (controls)'!T20","v":36.662149999999997},{"$f":"'Overview (controls)'!U20","v":51.47766},{"$f":"'Overview (controls)'!V20","v":57.839260000000003},{"$f":"'Overview (controls)'!W20","v":304.10404},{"$f":"'Overview (controls)'!X20","v":370.19157999999999},{"$f":"'Overview (controls)'!Y20","v":383.36162999999999},{"$f":"'Overview (controls)'!Z20","v":491.02280999999999},{"$f":"'Overview (controls)'!AA20","v":208.17413999999999},{"$f":"'Overview (controls)'!AB20","v":289.07359000000002},{"$f":"'Overview (controls)'!AC20","v":25.260500807754443},{"$f":"'Overview (controls)'!AD20","v":39.764943457189013},{"$f":"'Overview (controls)'!AE20","v":430.81007},{"$f":"'Overview (controls)'!AF20","v":606.70537999999999},{"$f":"'Overview (controls)'!AG20","v":213.44672},{"$f":"'Overview (controls)'!AH20","v":428.28356000000002},{"$f":"'Overview (controls)'!AI20","v":544.29618000000005},{"$f":"'Overview (controls)'!AJ20","v":816.01760999999999},{"$f":"'Overview (controls)'!AK20","v":79.334224029815147},{"$f":"'Overview (controls)'!AL20","v":83.254652174394835}]
[null,"Cardiff",null,null,null,{"$f":"VLOOKUP(($B21&\"_\"&AF$44&\"_\"&AF$43&\"_\"&AF$45&\"_\"&$AC21),'All Data'!$A$2:$L$1048576,8,FALSE)","v":12.845470000000001},{"$f":"VLOOKUP(($B21&\"_\"&AG$44&\"_\"&AG$43&\"_\"&AG$45&\"_\"&$AC21),'All Data'!$A$2:$L$1048576,8,FALSE)","v":9.964594},null,{"$f":"VLOOKUP(($B21&\"_\"&AH$44&\"_\"&AH$43&\"_\"&AH$45&\"_\"&$AC21),'All Data'!$A$2:$L$1048576,8,FALSE)","v":73.717100000000002},{"$f":"VLOOKUP(($B21&\"_\"&AJ$44&\"_\"&AJ$43&\"_\"&AJ$45&\"_\"&$AC21),'All Data'!$A$2:$L$1048576,8,FALSE)","v":22.933263799472908},{"$f":"VLOOKUP(($B21&\"_\"&AL$44&\"_\"&AL$43&\"_\"&AL$45&\"_\"&$AC21),'All Data'!$A$2:$L$1048576,8,FALSE)","v":2.1683167892348227},{"$f":"VLOOKUP(($B21&\"_\"&AM$44&\"_\"&AM$43&\"_\"&AM$45&\"_\"&$AC21),'All Data'!$A$2:$L$1048576,8,FALSE)","v":37.676317572023144},{"$f":"VLOOKUP(($B21&\"_\"&AN$44&\"_\"&AN$43&\"_\"&AN$45&\"_\"&$AC21),'All Data'!$A$2:$L$1048576,8,FALSE)","v":54.555034810723988},null,{"$f":"VLOOKUP(($B21&\"_\"&AO$44&\"_\"&AO$43&\"_\"&AO$45&\"_\"&$AC21),'All Data'!$A$2:$L$1048576,8,FALSE)","v":315.28215999999998},{"$f":"VLOOKUP(($B21&\"_\"&AP$44&\"_\"&AP$43&\"_\"&AP$45&\"_\"&$AC21),'All Data'!$A$2:$L$1048576,8,FALSE)","v":415.88914999999997},{"$f":"VLOOKUP(($B21&\"_\"&AQ$44&\"_\"&AQ$43&\"_\"&AQ$45&\"_\"&$AC21),'All Data'!$A$2:$L$1048576,8,FALSE)","v":219.70339999999999},null,{"$f":"VLOOKUP(($B21&\"_\"&AR$44&\"_\"&AR$43&\"_\"&AR$45&\"_\"&$AC21),'All Data'!$A$2:$L$1048576,8,FALSE)","v":47.109207708779444},null,{"$f":"VLOOKUP(($B21&\"_\"&AS$44&\"_\"&AS$43&\"_\"&AS$45&\"_\"&$AC21),'All Data'!$A$2:$L$1048576,8,FALSE)","v":514.34720000000004},{"$f":"VLOOKUP(($B21&\"_\"&AT$44&\"_\"&AT$43&\"_\"&AT$45&\"_\"&$AC21),'All Data'!$A$2:$L$1048576,8,FALSE)","v":384.06950000000001},{"$f":"VLOOKUP(($B21&\"_\"&AU$44&\"_\"&AU$43&\"_\"&AU$45&\"_\"&$AC21),'All Data'!$A$2:$L$1048576,8,FALSE)","v":597.60879999999997},null,{"$f":"VLOOKUP(($B21&\"_\"&AV$44&\"_\"&AV$43&\"_\"&AV$45&\"_\"&$AC21),'All Data'!$A$2:$L$1048576,8,FALSE)","v":76.876130198915007},null,null,null,"LA",{"$f":"'Overview (controls)'!C21","v":0},{"$f":"'Overview (controls)'!D21","v":0},{"$f":"'Overview (controls)'!E21","v":0},{"$f":"'Overview (controls)'!F21","v":0},{"$f":"'Overview (controls)'!G21","v":10.99283},{"$f":"'Overview (controls)'!H21","v":14.69811},{"$f":"'Overview (controls)'!I21","v":8.2461579999999994},{"$f":"'Overview (controls)'!J21","v":11.68303},{"$f":"'Overview (controls)'!K21","v":71.658000000000001},{"$f":"'Overview (controls)'!L21","v":75.776200000000003},{"$f":"'Overview (controls)'!M21","v":{"$error":"#N/A"}},{"$f":"'Overview (controls)'!N21","v":{"$error":"#N/A"}},{"$f":"'Overview (controls)'!O21","v":20.939230000000002},{"$f":"'Overview (controls)'!P21","v":24.927299999999999},{"$f":"'Overview (controls)'!Q21","v":2.0746920000000002},{"$f":"'Overview (controls)'!R21","v":2.2619410000000002},{"$f":"'Overview (controls)'!S21","v":35.371069999999996},{"$f":"'Overview (controls)'!T21","v":39.981569999999998},{"$f":"'Overview (controls)'!U21","v":52.206180000000003},{"$f":"'Overview (controls)'!V21","v":56.903890000000004},{"$f":"'Overview (controls)'!W21","v":296.02695999999997},{"$f":"'Overview (controls)'!X21","v":335.43923999999998},{"$f":"'Overview (controls)'!Y21","v":384.34134999999998},{"$f":"'Overview (controls)'!Z21","v":449.30076000000003},{"$f":"'Overview (controls)'!AA21","v":197.50945999999999},{"$f":"'Overview (controls)'!AB21","v":243.65133},{"$f":"'Overview (controls)'!AC21","v":41.597817532802829},{"$f":"'Overview (controls)'!AD21","v":53.152549673154077},{"$f":"'Overview (controls)'!AE21","v":454.97892000000002},{"$f":"'Overview (controls)'!AF21","v":578.96947},{"$f":"'Overview (controls)'!AG21","v":305.64251999999999},{"$f":"'Overview (controls)'!AH21","v":475.98302999999999},{"$f":"'Overview (controls)'!AI21","v":514.13672999999994},{"$f":"'Overview (controls)'!AJ21","v":689.90997000000004},{"$f":"'Overview (controls)'!AK21","v":75.610695210149814},{"$f":"'Overview (controls)'!AL21","v":78.094929670378889}]
[null,"Rhondda Cynon Taf",null,null,null,{"$f":"VLOOKUP(($B22&\"_\"&AF$44&\"_\"&AF$43&\"_\"&AF$45&\"_\"&$AC22),'All Data'!$A$2:$L$1048576,8,FALSE)","v":7.9250939999999996},{"$f":"VLOOKUP(($B22&\"_\"&AG$44&\"_\"&AG$43&\"_\"&AG$45&\"_\"&$AC22),'All Data'!$A$2:$L$1048576,8,FALSE)","v":5.3946370000000003},null,{"$f":"VLOOKUP(($B22&\"_\"&AH$44&\"_\"&AH$43&\"_\"&AH$45&\"_\"&$AC22),'All Data'!$A$2:$L$1048576,8,FALSE)","v":70.815470000000005},{"$f":"VLOOKUP(($B22&\"_\"&AJ$44&\"_\"&AJ$43&\"_\"&AJ$45&\"_\"&$AC22),'All Data'!$A$2:$L$1048576,8,FALSE)","v":26.834278615030797},{"$f":"VLOOKUP(($B22&\"_\"&AL$44&\"_\"&AL$43&\"_\"&AL$45&\"_\"&$AC22),'All Data'!$A$2:$L$1048576,8,FALSE)","v":2.1949819989472266},{"$f":"VLOOKUP(($B22&\"_\"&AM$44&\"_\"&AM$43&\"_\"&AM$45&\"_\"&$AC22),'All Data'!$A$2:$L$1048576,8,FALSE)","v":29.888193822185986},{"$f":"VLOOKUP(($B22&\"_\"&AN$44&\"_\"&AN$43&\"_\"&AN$45&\"_\"&$AC22),'All Data'!$A$2:$L$1048576,8,FALSE)","v":61.551741863550106},null,{"$f":"VLOOKUP(($B22&\"_\"&AO$44&\"_\"&AO$43&\"_\"&AO$45&\"_\"&$AC22),'All Data'!$A$2:$L$1048576,8,FALSE)","v":349.89884999999998},{"$f":"VLOOKUP(($B22&\"_\"&AP$44&\"_\"&AP$43&\"_\"&AP$45&\"_\"&$AC22),'All Data'!$A$2:$L$1048576,8,FALSE)","v":467.06887},{"$f":"VLOOKUP(($B22&\"_\"&AQ$44&\"_\"&AQ$43&\"_\"&AQ$45&\"_\"&$AC22),'All Data'!$A$2:$L$1048576,8,FALSE)","v":238.47686999999999},null,{"$f":"VLOOKUP(($B22&\"_\"&AR$44&\"_\"&AR$43&\"_\"&AR$45&\"_\"&$AC22),'All Data'!$A$2:$L$1048576,8,FALSE)","v":48.251748251748253},null,{"$f":"VLOOKUP(($B22&\"_\"&AS$44&\"_\"&AS$43&\"_\"&AS$45&\"_\"&$AC22),'All Data'!$A$2:$L$1048576,8,FALSE)","v":725.45749999999998},{"$f":"VLOOKUP(($B22&\"_\"&AT$44&\"_\"&AT$43&\"_\"&AT$45&\"_\"&$AC22),'All Data'!$A$2:$L$1048576,8,FALSE)","v":465.13409999999999},{"$f":"VLOOKUP(($B22&\"_\"&AU$44&\"_\"&AU$43&\"_\"&AU$45&\"_\"&$AC22),'All Data'!$A$2:$L$1048576,8,FALSE)","v":873.36429999999996},null,{"$f":"VLOOKUP(($B22&\"_\"&AV$44&\"_\"&AV$43&\"_\"&AV$45&\"_\"&$AC22),'All Data'!$A$2:$L$1048576,8,FALSE)","v":82.608695652173907},null,null,null,"LA",{"$f":"'Overview (controls)'!C22","v":0},{"$f":"'Overview (controls)'!D22","v":0},{"$f":"'Overview (controls)'!E22","v":0},{"$f":"'Overview (controls)'!F22","v":0},{"$f":"'Overview (controls)'!G22","v":5.2450979999999996},{"$f":"'Overview (controls)'!H22","v":10.605090000000001},{"$f":"'Overview (controls)'!I22","v":3.5697589999999999},{"$f":"'Overview (controls)'!J22","v":7.2195150000000003},{"$f":"'Overview (controls)'!K22","v":68.317239999999998},{"$f":"'Overview (controls)'!L22","v":73.313699999999997},{"$f":"'Overview (controls)'!M22","v":{"$error":"#N/A"}},{"$f":"'Overview (controls)'!N22","v":{"$error":"#N/A"}},{"$f":"'Overview (controls)'!O22","v":24.324860000000001},{"$f":"'Overview (controls)'!P22","v":29.343700000000002},{"$f":"'Overview (controls)'!Q22","v":2.0808469999999999},{"$f":"'Overview (controls)'!R22","v":2.3091170000000001},{"$f":"'Overview (controls)'!S22","v":27.25534},{"$f":"'Overview (controls)'!T22","v":32.521050000000002},{"$f":"'Overview (controls)'!U22","v":59.056620000000002},{"$f":"'Overview (controls)'!V22","v":64.046860000000009},{"$f":"'Overview (controls)'!W22","v":326.13753000000003},{"$f":"'Overview (controls)'!X22","v":374.91577999999998},{"$f":"'Overview (controls)'!Y22","v":428.20328999999998},{"$f":"'Overview (controls)'!Z22","v":508.48372999999998},{"$f":"'Overview (controls)'!AA22","v":211.05869000000001},{"$f":"'Overview (controls)'!AB22","v":268.42295000000001},{"$f":"'Overview (controls)'!AC22","v":41.902310173175103},{"$f":"'Overview (controls)'!AD22","v":55.297883915999456},{"$f":"'Overview (controls)'!AE22","v":651.61521000000005},{"$f":"'Overview (controls)'!AF22","v":805.18415000000005},{"$f":"'Overview (controls)'!AG22","v":372.04255000000001},{"$f":"'Overview (controls)'!AH22","v":574.23396000000002},{"$f":"'Overview (controls)'!AI22","v":769.36742000000004},{"$f":"'Overview (controls)'!AJ22","v":986.89661000000001},{"$f":"'Overview (controls)'!AK22","v":81.143220169327947},{"$f":"'Overview (controls)'!AL22","v":83.9827615729223}]
[null,"Merthyr Tydfil",null,null,null,{"$f":"VLOOKUP(($B23&\"_\"&AF$44&\"_\"&AF$43&\"_\"&AF$45&\"_\"&$AC23),'All Data'!$A$2:$L$1048576,8,FALSE)","v":9.3745329999999996},{"$f":"VLOOKUP(($B23&\"_\"&AG$44&\"_\"&AG$43&\"_\"&AG$45&\"_\"&$AC23),'All Data'!$A$2:$L$1048576,8,FALSE)","v":7.7738649999999998},null,{"$f":"VLOOKUP(($B23&\"_\"&AH$44&\"_\"&AH$43&\"_\"&AH$45&\"_\"&$AC23),'All Data'!$A$2:$L$1048576,8,FALSE)","v":66.574569999999994},{"$f":"VLOOKUP(($B23&\"_\"&AJ$44&\"_\"&AJ$43&\"_\"&AJ$45&\"_\"&$AC23),'All Data'!$A$2:$L$1048576,8,FALSE)","v":26.26629676734699},{"$f":"VLOOKUP(($B23&\"_\"&AL$44&\"_\"&AL$43&\"_\"&AL$45&\"_\"&$AC23),'All Data'!$A$2:$L$1048576,8,FALSE)","v":2.1760763495731079},{"$f":"VLOOKUP(($B23&\"_\"&AM$44&\"_\"&AM$43&\"_\"&AM$45&\"_\"&$AC23),'All Data'!$A$2:$L$1048576,8,FALSE)","v":32.52667924298752},{"$f":"VLOOKUP(($B23&\"_\"&AN$44&\"_\"&AN$43&\"_\"&AN$45&\"_\"&$AC23),'All Data'!$A$2:$L$1048576,8,FALSE)","v":63.353268717564994},null,{"$f":"VLOOKUP(($B23&\"_\"&AO$44&\"_\"&AO$43&\"_\"&AO$45&\"_\"&$AC23),'All Data'!$A$2:$L$1048576,8,FALSE)","v":362.03359999999998},{"$f":"VLOOKUP(($B23&\"_\"&AP$44&\"_\"&AP$43&\"_\"&AP$45&\"_\"&$AC23),'All Data'!$A$2:$L$1048576,8,FALSE)","v":525.24170000000004},{"$f":"VLOOKUP(($B23&\"_\"&AQ$44&\"_\"&AQ$43&\"_\"&AQ$45&\"_\"&$AC23),'All Data'!$A$2:$L$1048576,8,FALSE)","v":207.54177000000001},null,{"$f":"VLOOKUP(($B23&\"_\"&AR$44&\"_\"&AR$43&\"_\"&AR$45&\"_\"&$AC23),'All Data'!$A$2:$L$1048576,8,FALSE)","v":44.545454545454547},null,{"$f":"VLOOKUP(($B23&\"_\"&AS$44&\"_\"&AS$43&\"_\"&AS$45&\"_\"&$AC23),'All Data'!$A$2:$L$1048576,8,FALSE)","v":649.64210000000003},{"$f":"VLOOKUP(($B23&\"_\"&AT$44&\"_\"&AT$43&\"_\"&AT$45&\"_\"&$AC23),'All Data'!$A$2:$L$1048576,8,FALSE)","v":424.37830000000002},{"$f":"VLOOKUP(($B23&\"_\"&AU$44&\"_\"&AU$43&\"_\"&AU$45&\"_\"&$AC23),'All Data'!$A$2:$L$1048576,8,FALSE)","v":809.72109999999998},null,{"$f":"VLOOKUP(($B23&\"_\"&AV$44&\"_\"&AV$43&\"_\"&AV$45&\"_\"&$AC23),'All Data'!$A$2:$L$1048576,8,FALSE)","v":85.094066570188133},null,null,null,"LA",{"$f":"'Overview (controls)'!C23","v":0},{"$f":"'Overview (controls)'!D23","v":0},{"$f":"'Overview (controls)'!E23","v":0},{"$f":"'Overview (controls)'!F23","v":0},{"$f":"'Overview (controls)'!G23","v":5.005026},{"$f":"'Overview (controls)'!H23","v":13.74404},{"$f":"'Overview (controls)'!I23","v":4.3828519999999997},{"$f":"'Overview (controls)'!J23","v":11.16488},{"$f":"'Overview (controls)'!K23","v":63.696669999999997},{"$f":"'Overview (controls)'!L23","v":69.452480000000008},{"$f":"'Overview (controls)'!M23","v":{"$error":"#N/A"}},{"$f":"'Overview (controls)'!N23","v":{"$error":"#N/A"}},{"$f":"'Overview (controls)'!O23","v":23.340600000000002},{"$f":"'Overview (controls)'!P23","v":29.191990000000001},{"$f":"'Overview (controls)'!Q23","v":2.0406010000000001},{"$f":"'Overview (controls)'!R23","v":2.3115519999999998},{"$f":"'Overview (controls)'!S23","v":29.567179999999997},{"$f":"'Overview (controls)'!T23","v":35.486179999999997},{"$f":"'Overview (controls)'!U23","v":60.370339999999999},{"$f":"'Overview (controls)'!V23","v":66.336200000000005},{"$f":"'Overview (controls)'!W23","v":313.01636999999999},{"$f":"'Overview (controls)'!X23","v":416.46296000000001},{"$f":"'Overview (controls)'!Y23","v":442.01150000000001},{"$f":"'Overview (controls)'!Z23","v":619.44530999999995},{"$f":"'Overview (controls)'!AA23","v":156.22108},{"$f":"'Overview (controls)'!AB23","v":270.06823000000003},{"$f":"'Overview (controls)'!AC23","v":32.954545454545453},{"$f":"'Overview (controls)'!AD23","v":58.891818181818181},{"$f":"'Overview (controls)'!AE23","v":512.97619999999995},{"$f":"'Overview (controls)'!AF23","v":811.06411000000003},{"$f":"'Overview (controls)'!AG23","v":252.85289},{"$f":"'Overview (controls)'!AH23","v":666.32568000000003},{"$f":"'Overview (controls)'!AI23","v":610.30380000000002},{"$f":"'Overview (controls)'!AJ23","v":1051.0731800000001},{"$f":"'Overview (controls)'!AK23","v":82.244793182272034},{"$f":"'Overview (controls)'!AL23","v":87.555287872172599}]
[null,"Caerphilly",null,null,null,{"$f":"VLOOKUP(($B24&\"_\"&AF$44&\"_\"&AF$43&\"_\"&AF$45&\"_\"&$AC24),'All Data'!$A$2:$L$1048576,8,FALSE)","v":8.4935559999999999},{"$f":"VLOOKUP(($B24&\"_\"&AG$44&\"_\"&AG$43&\"_\"&AG$45&\"_\"&$AC24),'All Data'!$A$2:$L$1048576,8,FALSE)","v":7.8294249999999996},null,{"$f":"VLOOKUP(($B24&\"_\"&AH$44&\"_\"&AH$43&\"_\"&AH$45&\"_\"&$AC24),'All Data'!$A$2:$L$1048576,8,FALSE)","v":68.719129999999993},{"$f":"VLOOKUP(($B24&\"_\"&AJ$44&\"_\"&AJ$43&\"_\"&AJ$45&\"_\"&$AC24),'All Data'!$A$2:$L$1048576,8,FALSE)","v":23.840137336435124},{"$f":"VLOOKUP(($B24&\"_\"&AL$44&\"_\"&AL$43&\"_\"&AL$45&\"_\"&$AC24),'All Data'!$A$2:$L$1048576,8,FALSE)","v":2.1986221583122125},{"$f":"VLOOKUP(($B24&\"_\"&AM$44&\"_\"&AM$43&\"_\"&AM$45&\"_\"&$AC24),'All Data'!$A$2:$L$1048576,8,FALSE)","v":29.68948800811911},{"$f":"VLOOKUP(($B24&\"_\"&AN$44&\"_\"&AN$43&\"_\"&AN$45&\"_\"&$AC24),'All Data'!$A$2:$L$1048576,8,FALSE)","v":60.172649833378479},null,{"$f":"VLOOKUP(($B24&\"_\"&AO$44&\"_\"&AO$43&\"_\"&AO$45&\"_\"&$AC24),'All Data'!$A$2:$L$1048576,8,FALSE)","v":324.39139999999998},{"$f":"VLOOKUP(($B24&\"_\"&AP$44&\"_\"&AP$43&\"_\"&AP$45&\"_\"&$AC24),'All Data'!$A$2:$L$1048576,8,FALSE)","v":439.60833000000002},{"$f":"VLOOKUP(($B24&\"_\"&AQ$44&\"_\"&AQ$43&\"_\"&AQ$45&\"_\"&$AC24),'All Data'!$A$2:$L$1048576,8,FALSE)","v":214.43716000000001},null,{"$f":"VLOOKUP(($B24&\"_\"&AR$44&\"_\"&AR$43&\"_\"&AR$45&\"_\"&$AC24),'All Data'!$A$2:$L$1048576,8,FALSE)","v":38.782816229116946},null,{"$f":"VLOOKUP(($B24&\"_\"&AS$44&\"_\"&AS$43&\"_\"&AS$45&\"_\"&$AC24),'All Data'!$A$2:$L$1048576,8,FALSE)","v":764.44},{"$f":"VLOOKUP(($B24&\"_\"&AT$44&\"_\"&AT$43&\"_\"&AT$45&\"_\"&$AC24),'All Data'!$A$2:$L$1048576,8,FALSE)","v":447.20170000000002},{"$f":"VLOOKUP(($B24&\"_\"&AU$44&\"_\"&AU$43&\"_\"&AU$45&\"_\"&$AC24),'All Data'!$A$2:$L$1048576,8,FALSE)","v":953.99260000000004},null,{"$f":"VLOOKUP(($B24&\"_\"&AV$44&\"_\"&AV$43&\"_\"&AV$45&\"_\"&$AC24),'All Data'!$A$2:$L$1048576,8,FALSE)","v":81.804878048780481},null,null,null,"LA",{"$f":"'Overview (controls)'!C24","v":0},{"$f":"'Overview (controls)'!D24","v":0},{"$f":"'Overview (controls)'!E24","v":0},{"$f":"'Overview (controls)'!F24","v":0},{"$f":"'Overview (controls)'!G24","v":5.9764549999999996},{"$f":"'Overview (controls)'!H24","v":11.01066},{"$f":"'Overview (controls)'!I24","v":5.821472},{"$f":"'Overview (controls)'!J24","v":9.8373790000000003},{"$f":"'Overview (controls)'!K24","v":65.996610000000004},{"$f":"'Overview (controls)'!L24","v":71.441649999999996},{"$f":"'Overview (controls)'!M24","v":{"$error":"#N/A"}},{"$f":"'Overview (controls)'!N24","v":{"$error":"#N/A"}},{"$f":"'Overview (controls)'!O24","v":21.26661},{"$f":"'Overview (controls)'!P24","v":26.41367},{"$f":"'Overview (controls)'!Q24","v":2.0753460000000001},{"$f":"'Overview (controls)'!R24","v":2.321898},{"$f":"'Overview (controls)'!S24","v":26.963140000000003},{"$f":"'Overview (controls)'!T24","v":32.415840000000003},{"$f":"'Overview (controls)'!U24","v":57.256339999999994},{"$f":"'Overview (controls)'!V24","v":63.088960000000007},{"$f":"'Overview (controls)'!W24","v":297.78613000000001},{"$f":"'Overview (controls)'!X24","v":352.71105},{"$f":"'Overview (controls)'!Y24","v":395.65877999999998},{"$f":"'Overview (controls)'!Z24","v":487.06013999999999},{"$f":"'Overview (controls)'!AA24","v":184.45939000000001},{"$f":"'Overview (controls)'!AB24","v":247.83457999999999},{"$f":"'Overview (controls)'!AC24","v":32.402434865172097},{"$f":"'Overview (controls)'!AD24","v":46.060150763373763},{"$f":"'Overview (controls)'!AE24","v":674.36541},{"$f":"'Overview (controls)'!AF24","v":863.04348000000005},{"$f":"'Overview (controls)'!AG24","v":340.39312999999999},{"$f":"'Overview (controls)'!AH24","v":576.67728},{"$f":"'Overview (controls)'!AI24","v":824.34853999999996},{"$f":"'Overview (controls)'!AJ24","v":1097.6584600000001},{"$f":"'Overview (controls)'!AK24","v":80.075776817749357},{"$f":"'Overview (controls)'!AL24","v":83.415000659929532}]
[null,"Blaenau Gwent",null,null,null,{"$f":"VLOOKUP(($B25&\"_\"&AF$44&\"_\"&AF$43&\"_\"&AF$45&\"_\"&$AC25),'All Data'!$A$2:$L$1048576,8,FALSE)","v":2.646846},{"$f":"VLOOKUP(($B25&\"_\"&AG$44&\"_\"&AG$43&\"_\"&AG$45&\"_\"&$AC25),'All Data'!$A$2:$L$1048576,8,FALSE)","v":1.9385570000000001},null,{"$f":"VLOOKUP(($B25&\"_\"&AH$44&\"_\"&AH$43&\"_\"&AH$45&\"_\"&$AC25),'All Data'!$A$2:$L$1048576,8,FALSE)","v":65.149950000000004},{"$f":"VLOOKUP(($B25&\"_\"&AJ$44&\"_\"&AJ$43&\"_\"&AJ$45&\"_\"&$AC25),'All Data'!$A$2:$L$1048576,8,FALSE)","v":27.653882963345282},{"$f":"VLOOKUP(($B25&\"_\"&AL$44&\"_\"&AL$43&\"_\"&AL$45&\"_\"&$AC25),'All Data'!$A$2:$L$1048576,8,FALSE)","v":2.1992657710392383},{"$f":"VLOOKUP(($B25&\"_\"&AM$44&\"_\"&AM$43&\"_\"&AM$45&\"_\"&$AC25),'All Data'!$A$2:$L$1048576,8,FALSE)","v":28.394923155753265},{"$f":"VLOOKUP(($B25&\"_\"&AN$44&\"_\"&AN$43&\"_\"&AN$45&\"_\"&$AC25),'All Data'!$A$2:$L$1048576,8,FALSE)","v":60.882741367852525},null,{"$f":"VLOOKUP(($B25&\"_\"&AO$44&\"_\"&AO$43&\"_\"&AO$45&\"_\"&$AC25),'All Data'!$A$2:$L$1048576,8,FALSE)","v":417.47223000000002},{"$f":"VLOOKUP(($B25&\"_\"&AP$44&\"_\"&AP$43&\"_\"&AP$45&\"_\"&$AC25),'All Data'!$A$2:$L$1048576,8,FALSE)","v":584.49523999999997},{"$f":"VLOOKUP(($B25&\"_\"&AQ$44&\"_\"&AQ$43&\"_\"&AQ$45&\"_\"&$AC25),'All Data'!$A$2:$L$1048576,8,FALSE)","v":260.08472999999998},null,{"$f":"VLOOKUP(($B25&\"_\"&AR$44&\"_\"&AR$43&\"_\"&AR$45&\"_\"&$AC25),'All Data'!$A$2:$L$1048576,8,FALSE)","v":37.526059763724803},null,{"$f":"VLOOKUP(($B25&\"_\"&AS$44&\"_\"&AS$43&\"_\"&AS$45&\"_\"&$AC25),'All Data'!$A$2:$L$1048576,8,FALSE)","v":942.5172},{"$f":"VLOOKUP(($B25&\"_\"&AT$44&\"_\"&AT$43&\"_\"&AT$45&\"_\"&$AC25),'All Data'!$A$2:$L$1048576,8,FALSE)","v":616.65769999999998},{"$f":"VLOOKUP(($B25&\"_\"&AU$44&\"_\"&AU$43&\"_\"&AU$45&\"_\"&$AC25),'All Data'!$A$2:$L$1048576,8,FALSE)","v":1136.6878999999999},null,{"$f":"VLOOKUP(($B25&\"_\"&AV$44&\"_\"&AV$43&\"_\"&AV$45&\"_\"&$AC25),'All Data'!$A$2:$L$1048576,8,FALSE)","v":83.94736842105263},null,null,null,"LA",{"$f":"'Overview (controls)'!C25","v":0},{"$f":"'Overview (controls)'!D25","v":0},{"$f":"'Overview (controls)'!E25","v":0},{"$f":"'Overview (controls)'!F25","v":0},{"$f":"'Overview (controls)'!G25","v":-3.1136550000000001},{"$f":"'Overview (controls)'!H25","v":8.4073469999999997},{"$f":"'Overview (controls)'!I25","v":-1.882884},{"$f":"'Overview (controls)'!J25","v":5.7599989999999996},{"$f":"'Overview (controls)'!K25","v":62.100639999999999},{"$f":"'Overview (controls)'!L25","v":68.199250000000006},{"$f":"'Overview (controls)'!M25","v":{"$error":"#N/A"}},{"$f":"'Overview (controls)'!N25","v":{"$error":"#N/A"}},{"$f":"'Overview (controls)'!O25","v":24.712419999999998},{"$f":"'Overview (controls)'!P25","v":30.59535},{"$f":"'Overview (controls)'!Q25","v":2.0699969999999999},{"$f":"'Overview (controls)'!R25","v":2.328535},{"$f":"'Overview (controls)'!S25","v":25.492720000000002},{"$f":"'Overview (controls)'!T25","v":31.29712},{"$f":"'Overview (controls)'!U25","v":57.885220000000004},{"$f":"'Overview (controls)'!V25","v":63.88026},{"$f":"'Overview (controls)'!W25","v":369.63902999999999},{"$f":"'Overview (controls)'!X25","v":469.67525000000001},{"$f":"'Overview (controls)'!Y25","v":503.92583999999999},{"$f":"'Overview (controls)'!Z25","v":674.0557},{"$f":"'Overview (controls)'!AA25","v":208.58721},{"$f":"'Overview (controls)'!AB25","v":320.27782999999999},{"$f":"'Overview (controls)'!AC25","v":28.190410006949275},{"$f":"'Overview (controls)'!AD25","v":48.963168867268941},{"$f":"'Overview (controls)'!AE25","v":796.27994000000001},{"$f":"'Overview (controls)'!AF25","v":1107.4205999999999},{"$f":"'Overview (controls)'!AG25","v":430.42426},{"$f":"'Overview (controls)'!AH25","v":855.55472999999995},{"$f":"'Overview (controls)'!AI25","v":930.71866},{"$f":"'Overview (controls)'!AJ25","v":1373.0137},{"$f":"'Overview (controls)'!AK25","v":81.16770282360369},{"$f":"'Overview (controls)'!AL25","v":86.385570001547492}]
[null,"Torfaen",null,null,null,{"$f":"VLOOKUP(($B26&\"_\"&AF$44&\"_\"&AF$43&\"_\"&AF$45&\"_\"&$AC26),'All Data'!$A$2:$L$1048576,8,FALSE)","v":7.3051440000000003},{"$f":"VLOOKUP(($B26&\"_\"&AG$44&\"_\"&AG$43&\"_\"&AG$45&\"_\"&$AC26),'All Data'!$A$2:$L$1048576,8,FALSE)","v":6.051895},null,{"$f":"VLOOKUP(($B26&\"_\"&AH$44&\"_\"&AH$43&\"_\"&AH$45&\"_\"&$AC26),'All Data'!$A$2:$L$1048576,8,FALSE)","v":70.760419999999996},{"$f":"VLOOKUP(($B26&\"_\"&AJ$44&\"_\"&AJ$43&\"_\"&AJ$45&\"_\"&$AC26),'All Data'!$A$2:$L$1048576,8,FALSE)","v":25.553244565993875},{"$f":"VLOOKUP(($B26&\"_\"&AL$44&\"_\"&AL$43&\"_\"&AL$45&\"_\"&$AC26),'All Data'!$A$2:$L$1048576,8,FALSE)","v":2.2478397060678055},{"$f":"VLOOKUP(($B26&\"_\"&AM$44&\"_\"&AM$43&\"_\"&AM$45&\"_\"&$AC26),'All Data'!$A$2:$L$1048576,8,FALSE)","v":29.558274697192914},{"$f":"VLOOKUP(($B26&\"_\"&AN$44&\"_\"&AN$43&\"_\"&AN$45&\"_\"&$AC26),'All Data'!$A$2:$L$1048576,8,FALSE)","v":62.587536280359345},null,{"$f":"VLOOKUP(($B26&\"_\"&AO$44&\"_\"&AO$43&\"_\"&AO$45&\"_\"&$AC26),'All Data'!$A$2:$L$1048576,8,FALSE)","v":408.11057},{"$f":"VLOOKUP(($B26&\"_\"&AP$44&\"_\"&AP$43&\"_\"&AP$45&\"_\"&$AC26),'All Data'!$A$2:$L$1048576,8,FALSE)","v":508.22280999999998},{"$f":"VLOOKUP(($B26&\"_\"&AQ$44&\"_\"&AQ$43&\"_\"&AQ$45&\"_\"&$AC26),'All Data'!$A$2:$L$1048576,8,FALSE)","v":314.15404999999998},null,{"$f":"VLOOKUP(($B26&\"_\"&AR$44&\"_\"&AR$43&\"_\"&AR$45&\"_\"&$AC26),'All Data'!$A$2:$L$1048576,8,FALSE)","v":38.10049696300387},null,{"$f":"VLOOKUP(($B26&\"_\"&AS$44&\"_\"&AS$43&\"_\"&AS$45&\"_\"&$AC26),'All Data'!$A$2:$L$1048576,8,FALSE)","v":694.45889999999997},{"$f":"VLOOKUP(($B26&\"_\"&AT$44&\"_\"&AT$43&\"_\"&AT$45&\"_\"&$AC26),'All Data'!$A$2:$L$1048576,8,FALSE)","v":469.07389999999998},{"$f":"VLOOKUP(($B26&\"_\"&AU$44&\"_\"&AU$43&\"_\"&AU$45&\"_\"&$AC26),'All Data'!$A$2:$L$1048576,8,FALSE)","v":823.52189999999996},null,{"$f":"VLOOKUP(($B26&\"_\"&AV$44&\"_\"&AV$43&\"_\"&AV$45&\"_\"&$AC26),'All Data'!$A$2:$L$1048576,8,FALSE)","v":82.926829268292678},null,null,null,"LA",{"$f":"'Overview (controls)'!C26","v":0},{"$f":"'Overview (controls)'!D26","v":0},{"$f":"'Overview (controls)'!E26","v":0},{"$f":"'Overview (controls)'!F26","v":0},{"$f":"'Overview (controls)'!G26","v":4.6733919999999998},{"$f":"'Overview (controls)'!H26","v":9.9368960000000008},{"$f":"'Overview (controls)'!I26","v":2.9951349999999999},{"$f":"'Overview (controls)'!J26","v":9.1086550000000006},{"$f":"'Overview (controls)'!K26","v":67.92607000000001},{"$f":"'Overview (controls)'!L26","v":73.594760000000008},{"$f":"'Overview (controls)'!M26","v":{"$error":"#N/A"}},{"$f":"'Overview (controls)'!N26","v":{"$error":"#N/A"}},{"$f":"'Overview (controls)'!O26","v":22.64048},{"$f":"'Overview (controls)'!P26","v":28.466010000000004},{"$f":"'Overview (controls)'!Q26","v":2.115748},{"$f":"'Overview (controls)'!R26","v":2.379931},{"$f":"'Overview (controls)'!S26","v":26.638400000000001},{"$f":"'Overview (controls)'!T26","v":32.478149999999999},{"$f":"'Overview (controls)'!U26","v":59.673670000000001},{"$f":"'Overview (controls)'!V26","v":65.501410000000007},{"$f":"'Overview (controls)'!W26","v":367.01082000000002},{"$f":"'Overview (controls)'!X26","v":452.48548},{"$f":"'Overview (controls)'!Y26","v":443.72446000000002},{"$f":"'Overview (controls)'!Z26","v":579.30795999999998},{"$f":"'Overview (controls)'!AA26","v":263.68432000000001},{"$f":"'Overview (controls)'!AB26","v":371.35329000000002},{"$f":"'Overview (controls)'!AC26","v":29.644395361678633},{"$f":"'Overview (controls)'!AD26","v":48.218663721700715},{"$f":"'Overview (controls)'!AE26","v":587.55557999999996},{"$f":"'Overview (controls)'!AF26","v":814.73058000000003},{"$f":"'Overview (controls)'!AG26","v":332.75513000000001},{"$f":"'Overview (controls)'!AH26","v":641.69996000000003},{"$f":"'Overview (controls)'!AI26","v":676.31075999999996},{"$f":"'Overview (controls)'!AJ26","v":992.23249999999996},{"$f":"'Overview (controls)'!AK26","v":80.550734122462316},{"$f":"'Overview (controls)'!AL26","v":85.066456310214818}]
[null,"Monmouthshire",null,null,null,{"$f":"VLOOKUP(($B27&\"_\"&AF$44&\"_\"&AF$43&\"_\"&AF$45&\"_\"&$AC27),'All Data'!$A$2:$L$1048576,8,FALSE)","v":5.8893380000000004},{"$f":"VLOOKUP(($B27&\"_\"&AG$44&\"_\"&AG$43&\"_\"&AG$45&\"_\"&$AC27),'All Data'!$A$2:$L$1048576,8,FALSE)","v":4.1130620000000002},null,{"$f":"VLOOKUP(($B27&\"_\"&AH$44&\"_\"&AH$43&\"_\"&AH$45&\"_\"&$AC27),'All Data'!$A$2:$L$1048576,8,FALSE)","v":80.489869999999996},{"$f":"VLOOKUP(($B27&\"_\"&AJ$44&\"_\"&AJ$43&\"_\"&AJ$45&\"_\"&$AC27),'All Data'!$A$2:$L$1048576,8,FALSE)","v":18.623433219316293},{"$f":"VLOOKUP(($B27&\"_\"&AL$44&\"_\"&AL$43&\"_\"&AL$45&\"_\"&$AC27),'All Data'!$A$2:$L$1048576,8,FALSE)","v":2.6820197783465134},{"$f":"VLOOKUP(($B27&\"_\"&AM$44&\"_\"&AM$43&\"_\"&AM$45&\"_\"&$AC27),'All Data'!$A$2:$L$1048576,8,FALSE)","v":37.631172225177387},{"$f":"VLOOKUP(($B27&\"_\"&AN$44&\"_\"&AN$43&\"_\"&AN$45&\"_\"&$AC27),'All Data'!$A$2:$L$1048576,8,FALSE)","v":53.684134010725792},null,{"$f":"VLOOKUP(($B27&\"_\"&AO$44&\"_\"&AO$43&\"_\"&AO$45&\"_\"&$AC27),'All Data'!$A$2:$L$1048576,8,FALSE)","v":268.96197999999998},{"$f":"VLOOKUP(($B27&\"_\"&AP$44&\"_\"&AP$43&\"_\"&AP$45&\"_\"&$AC27),'All Data'!$A$2:$L$1048576,8,FALSE)","v":345.68788999999998},{"$f":"VLOOKUP(($B27&\"_\"&AQ$44&\"_\"&AQ$43&\"_\"&AQ$45&\"_\"&$AC27),'All Data'!$A$2:$L$1048576,8,FALSE)","v":197.98847000000001},null,{"$f":"VLOOKUP(($B27&\"_\"&AR$44&\"_\"&AR$43&\"_\"&AR$45&\"_\"&$AC27),'All Data'!$A$2:$L$1048576,8,FALSE)","v":22.459292532285232},null,{"$f":"VLOOKUP(($B27&\"_\"&AS$44&\"_\"&AS$43&\"_\"&AS$45&\"_\"&$AC27),'All Data'!$A$2:$L$1048576,8,FALSE)","v":803.93370000000004},{"$f":"VLOOKUP(($B27&\"_\"&AT$44&\"_\"&AT$43&\"_\"&AT$45&\"_\"&$AC27),'All Data'!$A$2:$L$1048576,8,FALSE)","v":532.47749999999996},{"$f":"VLOOKUP(($B27&\"_\"&AU$44&\"_\"&AU$43&\"_\"&AU$45&\"_\"&$AC27),'All Data'!$A$2:$L$1048576,8,FALSE)","v":972.40719999999999},null,{"$f":"VLOOKUP(($B27&\"_\"&AV$44&\"_\"&AV$43&\"_\"&AV$45&\"_\"&$AC27),'All Data'!$A$2:$L$1048576,8,FALSE)","v":83.179723502304142},null,null,null,"LA",{"$f":"'Overview (controls)'!C27","v":0},{"$f":"'Overview (controls)'!D27","v":0},{"$f":"'Overview (controls)'!E27","v":0},{"$f":"'Overview (controls)'!F27","v":0},{"$f":"'Overview (controls)'!G27","v":4.4028770000000002},{"$f":"'Overview (controls)'!H27","v":7.3757989999999998},{"$f":"'Overview (controls)'!I27","v":5.0236299999999998E-2},{"$f":"'Overview (controls)'!J27","v":8.1758880000000005},{"$f":"'Overview (controls)'!K27","v":77.983599999999996},{"$f":"'Overview (controls)'!L27","v":82.996139999999997},{"$f":"'Overview (controls)'!M27","v":{"$error":"#N/A"}},{"$f":"'Overview (controls)'!N27","v":{"$error":"#N/A"}},{"$f":"'Overview (controls)'!O27","v":15.899319999999999},{"$f":"'Overview (controls)'!P27","v":21.347550000000002},{"$f":"'Overview (controls)'!Q27","v":2.549871},{"$f":"'Overview (controls)'!R27","v":2.814168},{"$f":"'Overview (controls)'!S27","v":34.475679999999997},{"$f":"'Overview (controls)'!T27","v":40.786660000000005},{"$f":"'Overview (controls)'!U27","v":50.579320000000003},{"$f":"'Overview (controls)'!V27","v":56.788939999999997},{"$f":"'Overview (controls)'!W27","v":234.27700999999999},{"$f":"'Overview (controls)'!X27","v":307.08186999999998},{"$f":"'Overview (controls)'!Y27","v":291.63342999999998},{"$f":"'Overview (controls)'!Z27","v":406.41302000000002},{"$f":"'Overview (controls)'!AA27","v":154.98956000000001},{"$f":"'Overview (controls)'!AB27","v":248.57150999999999},{"$f":"'Overview (controls)'!AC27","v":16.045480067377877},{"$f":"'Overview (controls)'!AD27","v":30.583380123526108},{"$f":"'Overview (controls)'!AE27","v":692.56087000000002},{"$f":"'Overview (controls)'!AF27","v":927.73505999999998},{"$f":"'Overview (controls)'!AG27","v":394.61507999999998},{"$f":"'Overview (controls)'!AH27","v":702.36666000000002},{"$f":"'Overview (controls)'!AI27","v":812.49189000000001},{"$f":"'Overview (controls)'!AJ27","v":1153.2515100000001},{"$f":"'Overview (controls)'!AK27","v":80.546303794244324},{"$f":"'Overview (controls)'!AL27","v":85.520743247328369}]
[null,"Newport",null,null,null,{"$f":"VLOOKUP(($B28&\"_\"&AF$44&\"_\"&AF$43&\"_\"&AF$45&\"_\"&$AC28),'All Data'!$A$2:$L$1048576,8,FALSE)","v":11.030279999999999},{"$f":"VLOOKUP(($B28&\"_\"&AG$44&\"_\"&AG$43&\"_\"&AG$45&\"_\"&$AC28),'All Data'!$A$2:$L$1048576,8,FALSE)","v":6.2613269999999996},null,{"$f":"VLOOKUP(($B28&\"_\"&AH$44&\"_\"&AH$43&\"_\"&AH$45&\"_\"&$AC28),'All Data'!$A$2:$L$1048576,8,FALSE)","v":72.098470000000006},{"$f":"VLOOKUP(($B28&\"_\"&AJ$44&\"_\"&AJ$43&\"_\"&AJ$45&\"_\"&$AC28),'All Data'!$A$2:$L$1048576,8,FALSE)","v":24.710212443068098},{"$f":"VLOOKUP(($B28&\"_\"&AL$44&\"_\"&AL$43&\"_\"&AL$45&\"_\"&$AC28),'All Data'!$A$2:$L$1048576,8,FALSE)","v":2.243658238230668},{"$f":"VLOOKUP(($B28&\"_\"&AM$44&\"_\"&AM$43&\"_\"&AM$45&\"_\"&$AC28),'All Data'!$A$2:$L$1048576,8,FALSE)","v":33.530688648127786},{"$f":"VLOOKUP(($B28&\"_\"&AN$44&\"_\"&AN$43&\"_\"&AN$45&\"_\"&$AC28),'All Data'!$A$2:$L$1048576,8,FALSE)","v":57.921598161506395},null,{"$f":"VLOOKUP(($B28&\"_\"&AO$44&\"_\"&AO$43&\"_\"&AO$45&\"_\"&$AC28),'All Data'!$A$2:$L$1048576,8,FALSE)","v":425.95152000000002},{"$f":"VLOOKUP(($B28&\"_\"&AP$44&\"_\"&AP$43&\"_\"&AP$45&\"_\"&$AC28),'All Data'!$A$2:$L$1048576,8,FALSE)","v":554.83759999999995},{"$f":"VLOOKUP(($B28&\"_\"&AQ$44&\"_\"&AQ$43&\"_\"&AQ$45&\"_\"&$AC28),'All Data'!$A$2:$L$1048576,8,FALSE)","v":303.87292000000002},null,{"$f":"VLOOKUP(($B28&\"_\"&AR$44&\"_\"&AR$43&\"_\"&AR$45&\"_\"&$AC28),'All Data'!$A$2:$L$1048576,8,FALSE)","v":42.288557213930353},null,{"$f":"VLOOKUP(($B28&\"_\"&AS$44&\"_\"&AS$43&\"_\"&AS$45&\"_\"&$AC28),'All Data'!$A$2:$L$1048576,8,FALSE)","v":632.75480000000005},{"$f":"VLOOKUP(($B28&\"_\"&AT$44&\"_\"&AT$43&\"_\"&AT$45&\"_\"&$AC28),'All Data'!$A$2:$L$1048576,8,FALSE)","v":474.60660000000001},{"$f":"VLOOKUP(($B28&\"_\"&AU$44&\"_\"&AU$43&\"_\"&AU$45&\"_\"&$AC28),'All Data'!$A$2:$L$1048576,8,FALSE)","v":747.64890000000003},null,{"$f":"VLOOKUP(($B28&\"_\"&AV$44&\"_\"&AV$43&\"_\"&AV$45&\"_\"&$AC28),'All Data'!$A$2:$L$1048576,8,FALSE)","v":76.535433070866148},null,null,null,"LA",{"$f":"'Overview (controls)'!C28","v":0},{"$f":"'Overview (controls)'!D28","v":0},{"$f":"'Overview (controls)'!E28","v":0},{"$f":"'Overview (controls)'!F28","v":0},{"$f":"'Overview (controls)'!G28","v":9.4929000000000006},{"$f":"'Overview (controls)'!H28","v":12.56765},{"$f":"'Overview (controls)'!I28","v":-0.1301842},{"$f":"'Overview (controls)'!J28","v":12.652839999999999},{"$f":"'Overview (controls)'!K28","v":69.498739999999998},{"$f":"'Overview (controls)'!L28","v":74.698210000000003},{"$f":"'Overview (controls)'!M28","v":{"$error":"#N/A"}},{"$f":"'Overview (controls)'!N28","v":{"$error":"#N/A"}},{"$f":"'Overview (controls)'!O28","v":21.837029999999999},{"$f":"'Overview (controls)'!P28","v":27.583400000000001},{"$f":"'Overview (controls)'!Q28","v":2.1234670000000002},{"$f":"'Overview (controls)'!R28","v":2.3638499999999998},{"$f":"'Overview (controls)'!S28","v":30.615189999999998},{"$f":"'Overview (controls)'!T28","v":36.446190000000001},{"$f":"'Overview (controls)'!U28","v":54.966999999999999},{"$f":"'Overview (controls)'!V28","v":60.876189999999994},{"$f":"'Overview (controls)'!W28","v":392.11441000000002},{"$f":"'Overview (controls)'!X28","v":461.89837999999997},{"$f":"'Overview (controls)'!Y28","v":499.96275000000003},{"$f":"'Overview (controls)'!Z28","v":614.04324999999994},{"$f":"'Overview (controls)'!AA28","v":264.36345},{"$f":"'Overview (controls)'!AB28","v":347.55135000000001},{"$f":"'Overview (controls)'!AC28","v":35.03174280572636},{"$f":"'Overview (controls)'!AD28","v":50.615182748472826},{"$f":"'Overview (controls)'!AE28","v":546.67102999999997},{"$f":"'Overview (controls)'!AF28","v":728.24469999999997},{"$f":"'Overview (controls)'!AG28","v":356.98421999999999},{"$f":"'Overview (controls)'!AH28","v":618.16553999999996},{"$f":"'Overview (controls)'!AI28","v":626.53036999999995},{"$f":"'Overview (controls)'!AJ28","v":884.44754999999998},{"$f":"'Overview (controls)'!AK28","v":74.580163584196271},{"$f":"'Overview (controls)'!AL28","v":78.383895874692314}]
[]
[null,"Betsi Cadwaladr UHB",null,null,null,{"$f":"VLOOKUP(($B30&\"_\"&AF$44&\"_\"&AF$43&\"_\"&AF$45&\"_\"&$AC30),'All Data'!$A$2:$L$1048576,8,FALSE)","v":7.1881979999999999},{"$f":"VLOOKUP(($B30&\"_\"&AG$44&\"_\"&AG$43&\"_\"&AG$45&\"_\"&$AC30),'All Data'!$A$2:$L$1048576,8,FALSE)","v":5.533474},null,{"$f":"VLOOKUP(($B30&\"_\"&AH$44&\"_\"&AH$43&\"_\"&AH$45&\"_\"&$AC30),'All Data'!$A$2:$L$1048576,8,FALSE)","v":77.777760000000001},{"$f":"VLOOKUP(($B30&\"_\"&AJ$44&\"_\"&AJ$43&\"_\"&AJ$45&\"_\"&$AC30),'All Data'!$A$2:$L$1048576,8,FALSE)","v":23.37625687165438},{"$f":"VLOOKUP(($B30&\"_\"&AL$44&\"_\"&AL$43&\"_\"&AL$45&\"_\"&$AC30),'All Data'!$A$2:$L$1048576,8,FALSE)","v":2.480558715434964},{"$f":"VLOOKUP(($B30&\"_\"&AM$44&\"_\"&AM$43&\"_\"&AM$45&\"_\"&$AC30),'All Data'!$A$2:$L$1048576,8,FALSE)","v":35.935311953178918},{"$f":"VLOOKUP(($B30&\"_\"&AN$44&\"_\"&AN$43&\"_\"&AN$45&\"_\"&$AC30),'All Data'!$A$2:$L$1048576,8,FALSE)","v":54.517605456588889},null,{"$f":"VLOOKUP(($B30&\"_\"&AO$44&\"_\"&AO$43&\"_\"&AO$45&\"_\"&$AC30),'All Data'!$A$2:$L$1048576,8,FALSE)","v":369.93353999999999},{"$f":"VLOOKUP(($B30&\"_\"&AP$44&\"_\"&AP$43&\"_\"&AP$45&\"_\"&$AC30),'All Data'!$A$2:$L$1048576,8,FALSE)","v":468.26287000000002},{"$f":"VLOOKUP(($B30&\"_\"&AQ$44&\"_\"&AQ$43&\"_\"&AQ$45&\"_\"&$AC30),'All Data'!$A$2:$L$1048576,8,FALSE)","v":274.71100999999999},null,{"$f":"VLOOKUP(($B30&\"_\"&AR$44&\"_\"&AR$43&\"_\"&AR$45&\"_\"&$AC30),'All Data'!$A$2:$L$1048576,8,FALSE)","v":37.362814719173656},null,{"$f":"VLOOKUP(($B30&\"_\"&AS$44&\"_\"&AS$43&\"_\"&AS$45&\"_\"&$AC30),'All Data'!$A$2:$L$1048576,8,FALSE)","v":661.8261},{"$f":"VLOOKUP(($B30&\"_\"&AT$44&\"_\"&AT$43&\"_\"&AT$45&\"_\"&$AC30),'All Data'!$A$2:$L$1048576,8,FALSE)","v":441.03660000000002},{"$f":"VLOOKUP(($B30&\"_\"&AU$44&\"_\"&AU$43&\"_\"&AU$45&\"_\"&$AC30),'All Data'!$A$2:$L$1048576,8,FALSE)","v":812.89089999999999},null,{"$f":"VLOOKUP(($B30&\"_\"&AV$44&\"_\"&AV$43&\"_\"&AV$45&\"_\"&$AC30),'All Data'!$A$2:$L$1048576,8,FALSE)","v":83.300356153541742},null,null,null,"HB",{"$f":"'Overview (controls)'!C29","v":0},{"$f":"'Overview (controls)'!D29","v":0},{"$f":"'Overview (controls)'!E29","v":0},{"$f":"'Overview (controls)'!F29","v":0},{"$f":"'Overview (controls)'!G29","v":2.8664239999999999},{"$f":"'Overview (controls)'!H29","v":11.509969999999999},{"$f":"'Overview (controls)'!I29","v":2.0153180000000002},{"$f":"'Overview (controls)'!J29","v":9.0516290000000001},{"$f":"'Overview (controls)'!K29","v":76.708629999999999},{"$f":"'Overview (controls)'!L29","v":78.846890000000002},{"$f":"'Overview (controls)'!M29","v":{"$error":"#N/A"}},{"$f":"'Overview (controls)'!N29","v":{"$error":"#N/A"}},{"$f":"'Overview (controls)'!O29","v":22.21743},{"$f":"'Overview (controls)'!P29","v":24.535080000000001},{"$f":"'Overview (controls)'!Q29","v":2.4267349999999999},{"$f":"'Overview (controls)'!R29","v":2.5343819999999999},{"$f":"'Overview (controls)'!S29","v":34.636620000000001},{"$f":"'Overview (controls)'!T29","v":37.234000000000002},{"$f":"'Overview (controls)'!U29","v":53.257580000000004},{"$f":"'Overview (controls)'!V29","v":55.777630000000002},{"$f":"'Overview (controls)'!W29","v":355.25817000000001},{"$f":"'Overview (controls)'!X29","v":385.04556000000002},{"$f":"'Overview (controls)'!Y29","v":445.01456999999999},{"$f":"'Overview (controls)'!Z29","v":492.38619},{"$f":"'Overview (controls)'!AA29","v":256.86076000000003},{"$f":"'Overview (controls)'!AB29","v":293.44396},{"$f":"'Overview (controls)'!AC29","v":34.036977712149287},{"$f":"'Overview (controls)'!AD29","v":40.928025507418859},{"$f":"'Overview (controls)'!AE29","v":622.87671},{"$f":"'Overview (controls)'!AF29","v":702.51561000000004},{"$f":"'Overview (controls)'!AG29","v":391.41392000000002},{"$f":"'Overview (controls)'!AH29","v":495.15989999999999},{"$f":"'Overview (controls)'!AI29","v":755.82510000000002},{"$f":"'Overview (controls)'!AJ29","v":872.92105000000004},{"$f":"'Overview (controls)'!AK29","v":82.44393825028159},{"$f":"'Overview (controls)'!AL29","v":84.12304186964603}]
[null,"Powys THB",null,null,null,{"$f":"VLOOKUP(($B31&\"_\"&AF$44&\"_\"&AF$43&\"_\"&AF$45&\"_\"&$AC31),'All Data'!$A$2:$L$1048576,8,FALSE)","v":5.4724659999999998},{"$f":"VLOOKUP(($B31&\"_\"&AG$44&\"_\"&AG$43&\"_\"&AG$45&\"_\"&$AC31),'All Data'!$A$2:$L$1048576,8,FALSE)","v":4.9087379999999996},null,{"$f":"VLOOKUP(($B31&\"_\"&AH$44&\"_\"&AH$43&\"_\"&AH$45&\"_\"&$AC31),'All Data'!$A$2:$L$1048576,8,FALSE)","v":79.822099999999992},{"$f":"VLOOKUP(($B31&\"_\"&AJ$44&\"_\"&AJ$43&\"_\"&AJ$45&\"_\"&$AC31),'All Data'!$A$2:$L$1048576,8,FALSE)","v":22.752301405820685},{"$f":"VLOOKUP(($B31&\"_\"&AL$44&\"_\"&AL$43&\"_\"&AL$45&\"_\"&$AC31),'All Data'!$A$2:$L$1048576,8,FALSE)","v":2.7589018098519684},{"$f":"VLOOKUP(($B31&\"_\"&AM$44&\"_\"&AM$43&\"_\"&AM$45&\"_\"&$AC31),'All Data'!$A$2:$L$1048576,8,FALSE)","v":37.069775138145552},{"$f":"VLOOKUP(($B31&\"_\"&AN$44&\"_\"&AN$43&\"_\"&AN$45&\"_\"&$AC31),'All Data'!$A$2:$L$1048576,8,FALSE)","v":55.973118219788439},null,{"$f":"VLOOKUP(($B31&\"_\"&AO$44&\"_\"&AO$43&\"_\"&AO$45&\"_\"&$AC31),'All Data'!$A$2:$L$1048576,8,FALSE)","v":219.90387999999999},{"$f":"VLOOKUP(($B31&\"_\"&AP$44&\"_\"&AP$43&\"_\"&AP$45&\"_\"&$AC31),'All Data'!$A$2:$L$1048576,8,FALSE)","v":305.18295000000001},{"$f":"VLOOKUP(($B31&\"_\"&AQ$44&\"_\"&AQ$43&\"_\"&AQ$45&\"_\"&$AC31),'All Data'!$A$2:$L$1048576,8,FALSE)","v":133.88287},null,{"$f":"VLOOKUP(($B31&\"_\"&AR$44&\"_\"&AR$43&\"_\"&AR$45&\"_\"&$AC31),'All Data'!$A$2:$L$1048576,8,FALSE)","v":23.726176584986387},null,{"$f":"VLOOKUP(($B31&\"_\"&AS$44&\"_\"&AS$43&\"_\"&AS$45&\"_\"&$AC31),'All Data'!$A$2:$L$1048576,8,FALSE)","v":614.60550000000001},{"$f":"VLOOKUP(($B31&\"_\"&AT$44&\"_\"&AT$43&\"_\"&AT$45&\"_\"&$AC31),'All Data'!$A$2:$L$1048576,8,FALSE)","v":362.3168},{"$f":"VLOOKUP(($B31&\"_\"&AU$44&\"_\"&AU$43&\"_\"&AU$45&\"_\"&$AC31),'All Data'!$A$2:$L$1048576,8,FALSE)","v":800.07650000000001},null,{"$f":"VLOOKUP(($B31&\"_\"&AV$44&\"_\"&AV$43&\"_\"&AV$45&\"_\"&$AC31),'All Data'!$A$2:$L$1048576,8,FALSE)","v":81.411764705882348},null,null,null,"HB",{"$f":"'Overview (controls)'!C30","v":0},{"$f":"'Overview (controls)'!D30","v":0},{"$f":"'Overview (controls)'!E30","v":0},{"$f":"'Overview (controls)'!F30","v":0},{"$f":"'Overview (controls)'!G30","v":-0.49527690000000002},{"$f":"'Overview (controls)'!H30","v":11.44021},{"$f":"'Overview (controls)'!I30","v":-4.0372440000000003},{"$f":"'Overview (controls)'!J30","v":13.85472},{"$f":"'Overview (controls)'!K30","v":77.070390000000003},{"$f":"'Overview (controls)'!L30","v":82.573810000000009},{"$f":"'Overview (controls)'!M30","v":{"$error":"#N/A"}},{"$f":"'Overview (controls)'!N30","v":{"$error":"#N/A"}},{"$f":"'Overview (controls)'!O30","v":19.8109},{"$f":"'Overview (controls)'!P30","v":25.693700000000003},{"$f":"'Overview (controls)'!Q30","v":2.6259760000000001},{"$f":"'Overview (controls)'!R30","v":2.8918270000000001},{"$f":"'Overview (controls)'!S30","v":33.775570000000002},{"$f":"'Overview (controls)'!T30","v":40.363979999999998},{"$f":"'Overview (controls)'!U30","v":52.762450000000008},{"$f":"'Overview (controls)'!V30","v":59.183779999999999},{"$f":"'Overview (controls)'!W30","v":193.4983},{"$f":"'Overview (controls)'!X30","v":248.70436000000001},{"$f":"'Overview (controls)'!Y30","v":261.83452},{"$f":"'Overview (controls)'!Z30","v":353.29257999999999},{"$f":"'Overview (controls)'!AA30","v":105.40588},{"$f":"'Overview (controls)'!AB30","v":167.22681},{"$f":"'Overview (controls)'!AC30","v":18.148580318942045},{"$f":"'Overview (controls)'!AD30","v":30.477246207701281},{"$f":"'Overview (controls)'!AE30","v":536.83633999999995},{"$f":"'Overview (controls)'!AF30","v":700.17668000000003},{"$f":"'Overview (controls)'!AG30","v":274.07488000000001},{"$f":"'Overview (controls)'!AH30","v":469.64096000000001},{"$f":"'Overview (controls)'!AI30","v":681.24068999999997},{"$f":"'Overview (controls)'!AJ30","v":932.70222000000001},{"$f":"'Overview (controls)'!AK30","v":79.183204060416742},{"$f":"'Overview (controls)'!AL30","v":83.451605442183137}]
[null,"Hywel Dda HB",null,null,null,{"$f":"VLOOKUP(($B32&\"_\"&AF$44&\"_\"&AF$43&\"_\"&AF$45&\"_\"&$AC32),'All Data'!$A$2:$L$1048576,8,FALSE)","v":6.83758},{"$f":"VLOOKUP(($B32&\"_\"&AG$44&\"_\"&AG$43&\"_\"&AG$45&\"_\"&$AC32),'All Data'!$A$2:$L$1048576,8,FALSE)","v":4.0529820000000001},null,{"$f":"VLOOKUP(($B32&\"_\"&AH$44&\"_\"&AH$43&\"_\"&AH$45&\"_\"&$AC32),'All Data'!$A$2:$L$1048576,8,FALSE)","v":75.751429999999999},{"$f":"VLOOKUP(($B32&\"_\"&AJ$44&\"_\"&AJ$43&\"_\"&AJ$45&\"_\"&$AC32),'All Data'!$A$2:$L$1048576,8,FALSE)","v":22.924998108411174},{"$f":"VLOOKUP(($B32&\"_\"&AL$44&\"_\"&AL$43&\"_\"&AL$45&\"_\"&$AC32),'All Data'!$A$2:$L$1048576,8,FALSE)","v":2.4993368056891017},{"$f":"VLOOKUP(($B32&\"_\"&AM$44&\"_\"&AM$43&\"_\"&AM$45&\"_\"&$AC32),'All Data'!$A$2:$L$1048576,8,FALSE)","v":39.717261177952039},{"$f":"VLOOKUP(($B32&\"_\"&AN$44&\"_\"&AN$43&\"_\"&AN$45&\"_\"&$AC32),'All Data'!$A$2:$L$1048576,8,FALSE)","v":58.024086280330067},null,{"$f":"VLOOKUP(($B32&\"_\"&AO$44&\"_\"&AO$43&\"_\"&AO$45&\"_\"&$AC32),'All Data'!$A$2:$L$1048576,8,FALSE)","v":268.32794999999999},{"$f":"VLOOKUP(($B32&\"_\"&AP$44&\"_\"&AP$43&\"_\"&AP$45&\"_\"&$AC32),'All Data'!$A$2:$L$1048576,8,FALSE)","v":342.72284999999999},{"$f":"VLOOKUP(($B32&\"_\"&AQ$44&\"_\"&AQ$43&\"_\"&AQ$45&\"_\"&$AC32),'All Data'!$A$2:$L$1048576,8,FALSE)","v":199.49186},null,{"$f":"VLOOKUP(($B32&\"_\"&AR$44&\"_\"&AR$43&\"_\"&AR$45&\"_\"&$AC32),'All Data'!$A$2:$L$1048576,8,FALSE)","v":29.793300071275837},null,{"$f":"VLOOKUP(($B32&\"_\"&AS$44&\"_\"&AS$43&\"_\"&AS$45&\"_\"&$AC32),'All Data'!$A$2:$L$1048576,8,FALSE)","v":610.81600000000003},{"$f":"VLOOKUP(($B32&\"_\"&AT$44&\"_\"&AT$43&\"_\"&AT$45&\"_\"&$AC32),'All Data'!$A$2:$L$1048576,8,FALSE)","v":446.4083},{"$f":"VLOOKUP(($B32&\"_\"&AU$44&\"_\"&AU$43&\"_\"&AU$45&\"_\"&$AC32),'All Data'!$A$2:$L$1048576,8,FALSE)","v":737.50530000000003},null,{"$f":"VLOOKUP(($B32&\"_\"&AV$44&\"_\"&AV$43&\"_\"&AV$45&\"_\"&$AC32),'All Data'!$A$2:$L$1048576,8,FALSE)","v":78.379734135941817},null,null,null,"HB",{"$f":"'Overview (controls)'!C31","v":0},{"$f":"'Overview (controls)'!D31","v":0},{"$f":"'Overview (controls)'!E31","v":0},{"$f":"'Overview (controls)'!F31","v":0},{"$f":"'Overview (controls)'!G31","v":2.2331889999999999},{"$f":"'Overview (controls)'!H31","v":11.44197},{"$f":"'Overview (controls)'!I31","v":1.274608},{"$f":"'Overview (controls)'!J31","v":6.8313560000000004},{"$f":"'Overview (controls)'!K31","v":74.187669999999997},{"$f":"'Overview (controls)'!L31","v":77.315190000000001},{"$f":"'Overview (controls)'!M31","v":{"$error":"#N/A"}},{"$f":"'Overview (controls)'!N31","v":{"$error":"#N/A"}},{"$f":"'Overview (controls)'!O31","v":21.258240000000001},{"$f":"'Overview (controls)'!P31","v":24.591750000000001},{"$f":"'Overview (controls)'!Q31","v":2.4213209999999998},{"$f":"'Overview (controls)'!R31","v":2.5773519999999999},{"$f":"'Overview (controls)'!S31","v":37.887450000000001},{"$f":"'Overview (controls)'!T31","v":41.547070000000005},{"$f":"'Overview (controls)'!U31","v":56.28181},{"$f":"'Overview (controls)'!V31","v":59.766359999999999},{"$f":"'Overview (controls)'!W31","v":251.38105999999999},{"$f":"'Overview (controls)'!X31","v":286.08051999999998},{"$f":"'Overview (controls)'!Y31","v":315.42232999999999},{"$f":"'Overview (controls)'!Z31","v":371.67507999999998},{"$f":"'Overview (controls)'!AA31","v":179.12868},{"$f":"'Overview (controls)'!AB31","v":221.46433999999999},{"$f":"'Overview (controls)'!AC31","v":25.89094920915041},{"$f":"'Overview (controls)'!AD31","v":34.121667629726488},{"$f":"'Overview (controls)'!AE31","v":562.75545},{"$f":"'Overview (controls)'!AF31","v":661.79616999999996},{"$f":"'Overview (controls)'!AG31","v":382.89184},{"$f":"'Overview (controls)'!AH31","v":517.36027999999999},{"$f":"'Overview (controls)'!AI31","v":666.97379999999998},{"$f":"'Overview (controls)'!AJ31","v":813.13553000000002},{"$f":"'Overview (controls)'!AK31","v":77.07493142993323},{"$f":"'Overview (controls)'!AL31","v":79.629899951998823}]
[null,"ABM UHB",null,null,null,{"$f":"VLOOKUP(($B33&\"_\"&AF$44&\"_\"&AF$43&\"_\"&AF$45&\"_\"&$AC33),'All Data'!$A$2:$L$1048576,8,FALSE)","v":10.376010000000001},{"$f":"VLOOKUP(($B33&\"_\"&AG$44&\"_\"&AG$43&\"_\"&AG$45&\"_\"&$AC33),'All Data'!$A$2:$L$1048576,8,FALSE)","v":7.3265979999999997},null,{"$f":"VLOOKUP(($B33&\"_\"&AH$44&\"_\"&AH$43&\"_\"&AH$45&\"_\"&$AC33),'All Data'!$A$2:$L$1048576,8,FALSE)","v":73.592159999999993},{"$f":"VLOOKUP(($B33&\"_\"&AJ$44&\"_\"&AJ$43&\"_\"&AJ$45&\"_\"&$AC33),'All Data'!$A$2:$L$1048576,8,FALSE)","v":22.922003786888677},{"$f":"VLOOKUP(($B33&\"_\"&AL$44&\"_\"&AL$43&\"_\"&AL$45&\"_\"&$AC33),'All Data'!$A$2:$L$1048576,8,FALSE)","v":2.2657118515624624},{"$f":"VLOOKUP(($B33&\"_\"&AM$44&\"_\"&AM$43&\"_\"&AM$45&\"_\"&$AC33),'All Data'!$A$2:$L$1048576,8,FALSE)","v":34.577197362059763},{"$f":"VLOOKUP(($B33&\"_\"&AN$44&\"_\"&AN$43&\"_\"&AN$45&\"_\"&$AC33),'All Data'!$A$2:$L$1048576,8,FALSE)","v":58.45314498097737},null,{"$f":"VLOOKUP(($B33&\"_\"&AO$44&\"_\"&AO$43&\"_\"&AO$45&\"_\"&$AC33),'All Data'!$A$2:$L$1048576,8,FALSE)","v":319.44371999999998},{"$f":"VLOOKUP(($B33&\"_\"&AP$44&\"_\"&AP$43&\"_\"&AP$45&\"_\"&$AC33),'All Data'!$A$2:$L$1048576,8,FALSE)","v":442.38315},{"$f":"VLOOKUP(($B33&\"_\"&AQ$44&\"_\"&AQ$43&\"_\"&AQ$45&\"_\"&$AC33),'All Data'!$A$2:$L$1048576,8,FALSE)","v":202.04006000000001},null,{"$f":"VLOOKUP(($B33&\"_\"&AR$44&\"_\"&AR$43&\"_\"&AR$45&\"_\"&$AC33),'All Data'!$A$2:$L$1048576,8,FALSE)","v":39.415204678362571},null,{"$f":"VLOOKUP(($B33&\"_\"&AS$44&\"_\"&AS$43&\"_\"&AS$45&\"_\"&$AC33),'All Data'!$A$2:$L$1048576,8,FALSE)","v":568.65520000000004},{"$f":"VLOOKUP(($B33&\"_\"&AT$44&\"_\"&AT$43&\"_\"&AT$45&\"_\"&$AC33),'All Data'!$A$2:$L$1048576,8,FALSE)","v":373.06169999999997},{"$f":"VLOOKUP(($B33&\"_\"&AU$44&\"_\"&AU$43&\"_\"&AU$45&\"_\"&$AC33),'All Data'!$A$2:$L$1048576,8,FALSE)","v":694.26400000000001},null,{"$f":"VLOOKUP(($B33&\"_\"&AV$44&\"_\"&AV$43&\"_\"&AV$45&\"_\"&$AC33),'All Data'!$A$2:$L$1048576,8,FALSE)","v":80.691791430046464},null,null,null,"HB",{"$f":"'Overview (controls)'!C32","v":0},{"$f":"'Overview (controls)'!D32","v":0},{"$f":"'Overview (controls)'!E32","v":0},{"$f":"'Overview (controls)'!F32","v":0},{"$f":"'Overview (controls)'!G32","v":8.9340499999999992},{"$f":"'Overview (controls)'!H32","v":11.817959999999999},{"$f":"'Overview (controls)'!I32","v":5.7114479999999999},{"$f":"'Overview (controls)'!J32","v":8.9417469999999994},{"$f":"'Overview (controls)'!K32","v":72.1541},{"$f":"'Overview (controls)'!L32","v":75.03022},{"$f":"'Overview (controls)'!M32","v":{"$error":"#N/A"}},{"$f":"'Overview (controls)'!N32","v":{"$error":"#N/A"}},{"$f":"'Overview (controls)'!O32","v":21.461919999999999},{"$f":"'Overview (controls)'!P32","v":24.382090000000002},{"$f":"'Overview (controls)'!Q32","v":2.1976689999999999},{"$f":"'Overview (controls)'!R32","v":2.333755},{"$f":"'Overview (controls)'!S32","v":32.957830000000001},{"$f":"'Overview (controls)'!T32","v":36.196559999999998},{"$f":"'Overview (controls)'!U32","v":56.820700000000002},{"$f":"'Overview (controls)'!V32","v":60.085589999999996},{"$f":"'Overview (controls)'!W32","v":303.93767000000003},{"$f":"'Overview (controls)'!X32","v":335.52395000000001},{"$f":"'Overview (controls)'!Y32","v":416.61968000000002},{"$f":"'Overview (controls)'!Z32","v":469.30333999999999},{"$f":"'Overview (controls)'!AA32","v":184.64718999999999},{"$f":"'Overview (controls)'!AB32","v":220.60075000000001},{"$f":"'Overview (controls)'!AC32","v":35.319249460661489},{"$f":"'Overview (controls)'!AD32","v":43.85901304903701},{"$f":"'Overview (controls)'!AE32","v":524.96154999999999},{"$f":"'Overview (controls)'!AF32","v":614.92029000000002},{"$f":"'Overview (controls)'!AG32","v":318.04360000000003},{"$f":"'Overview (controls)'!AH32","v":434.76105000000001},{"$f":"'Overview (controls)'!AI32","v":631.25886000000003},{"$f":"'Overview (controls)'!AJ32","v":761.57303000000002},{"$f":"'Overview (controls)'!AK32","v":79.656763702284323},{"$f":"'Overview (controls)'!AL32","v":81.686265830970711}]
[null,"Cardiff & Vale UHB",null,null,null,{"$f":"VLOOKUP(($B34&\"_\"&AF$44&\"_\"&AF$43&\"_\"&AF$45&\"_\"&$AC34),'All Data'!$A$2:$L$1048576,8,FALSE)","v":11.813980000000001},{"$f":"VLOOKUP(($B34&\"_\"&AG$44&\"_\"&AG$43&\"_\"&AG$45&\"_\"&$AC34),'All Data'!$A$2:$L$1048576,8,FALSE)","v":9.9309010000000004},null,{"$f":"VLOOKUP(($B34&\"_\"&AH$44&\"_\"&AH$43&\"_\"&AH$45&\"_\"&$AC34),'All Data'!$A$2:$L$1048576,8,FALSE)","v":74.618960000000001},{"$f":"VLOOKUP(($B34&\"_\"&AJ$44&\"_\"&AJ$43&\"_\"&AJ$45&\"_\"&$AC34),'All Data'!$A$2:$L$1048576,8,FALSE)","v":22.333643935056976},{"$f":"VLOOKUP(($B34&\"_\"&AL$44&\"_\"&AL$43&\"_\"&AL$45&\"_\"&$AC34),'All Data'!$A$2:$L$1048576,8,FALSE)","v":2.2461274938552633},{"$f":"VLOOKUP(($B34&\"_\"&AM$44&\"_\"&AM$43&\"_\"&AM$45&\"_\"&$AC34),'All Data'!$A$2:$L$1048576,8,FALSE)","v":36.589271004646683},{"$f":"VLOOKUP(($B34&\"_\"&AN$44&\"_\"&AN$43&\"_\"&AN$45&\"_\"&$AC34),'All Data'!$A$2:$L$1048576,8,FALSE)","v":54.454905206304275},null,{"$f":"VLOOKUP(($B34&\"_\"&AO$44&\"_\"&AO$43&\"_\"&AO$45&\"_\"&$AC34),'All Data'!$A$2:$L$1048576,8,FALSE)","v":314.9033},{"$f":"VLOOKUP(($B34&\"_\"&AP$44&\"_\"&AP$43&\"_\"&AP$45&\"_\"&$AC34),'All Data'!$A$2:$L$1048576,8,FALSE)","v":413.87923000000001},{"$f":"VLOOKUP(($B34&\"_\"&AQ$44&\"_\"&AQ$43&\"_\"&AQ$45&\"_\"&$AC34),'All Data'!$A$2:$L$1048576,8,FALSE)","v":221.98399000000001},null,{"$f":"VLOOKUP(($B34&\"_\"&AR$44&\"_\"&AR$43&\"_\"&AR$45&\"_\"&$AC34),'All Data'!$A$2:$L$1048576,8,FALSE)","v":42.450495049504951},null,{"$f":"VLOOKUP(($B34&\"_\"&AS$44&\"_\"&AS$43&\"_\"&AS$45&\"_\"&$AC34),'All Data'!$A$2:$L$1048576,8,FALSE)","v":512.53790000000004},{"$f":"VLOOKUP(($B34&\"_\"&AT$44&\"_\"&AT$43&\"_\"&AT$45&\"_\"&$AC34),'All Data'!$A$2:$L$1048576,8,FALSE)","v":356.99639999999999},{"$f":"VLOOKUP(($B34&\"_\"&AU$44&\"_\"&AU$43&\"_\"&AU$45&\"_\"&$AC34),'All Data'!$A$2:$L$1048576,8,FALSE)","v":620.50890000000004},null,{"$f":"VLOOKUP(($B34&\"_\"&AV$44&\"_\"&AV$43&\"_\"&AV$45&\"_\"&$AC34),'All Data'!$A$2:$L$1048576,8,FALSE)","v":78.022903334456046},null,null,null,"HB",{"$f":"'Overview (controls)'!C33","v":0},{"$f":"'Overview (controls)'!D33","v":0},{"$f":"'Overview (controls)'!E33","v":0},{"$f":"'Overview (controls)'!F33","v":0},{"$f":"'Overview (controls)'!G33","v":8.5326319999999996},{"$f":"'Overview (controls)'!H33","v":15.095319999999999},{"$f":"'Overview (controls)'!I33","v":8.0146320000000006},{"$f":"'Overview (controls)'!J33","v":11.84717},{"$f":"'Overview (controls)'!K33","v":72.969629999999995},{"$f":"'Overview (controls)'!L33","v":76.268290000000007},{"$f":"'Overview (controls)'!M33","v":{"$error":"#N/A"}},{"$f":"'Overview (controls)'!N33","v":{"$error":"#N/A"}},{"$f":"'Overview (controls)'!O33","v":20.704710000000002},{"$f":"'Overview (controls)'!P33","v":23.962569999999999},{"$f":"'Overview (controls)'!Q33","v":2.170051},{"$f":"'Overview (controls)'!R33","v":2.3222040000000002},{"$f":"'Overview (controls)'!S33","v":34.734140000000004},{"$f":"'Overview (controls)'!T33","v":38.444409999999998},{"$f":"'Overview (controls)'!U33","v":52.545459999999999},{"$f":"'Overview (controls)'!V33","v":56.364349999999995},{"$f":"'Overview (controls)'!W33","v":298.76713000000001},{"$f":"'Overview (controls)'!X33","v":331.67358000000002},{"$f":"'Overview (controls)'!Y33","v":387.45397000000003},{"$f":"'Overview (controls)'!Z33","v":441.6148},{"$f":"'Overview (controls)'!AA33","v":203.21733},{"$f":"'Overview (controls)'!AB33","v":241.98868999999999},{"$f":"'Overview (controls)'!AC33","v":38.076818318340827},{"$f":"'Overview (controls)'!AD33","v":47.192201052270192},{"$f":"'Overview (controls)'!AE33","v":464.10019999999997},{"$f":"'Overview (controls)'!AF33","v":564.47315000000003},{"$f":"'Overview (controls)'!AG33","v":295.39591000000001},{"$f":"'Overview (controls)'!AH33","v":427.43475999999998},{"$f":"'Overview (controls)'!AI33","v":550.15211999999997},{"$f":"'Overview (controls)'!AJ33","v":696.86042999999995},{"$f":"'Overview (controls)'!AK33","v":76.951718511054793},{"$f":"'Overview (controls)'!AL33","v":79.057852662973133}]
[null,"Cwm Taf HB",null,null,null,{"$f":"VLOOKUP(($B35&\"_\"&AF$44&\"_\"&AF$43&\"_\"&AF$45&\"_\"&$AC35),'All Data'!$A$2:$L$1048576,8,FALSE)","v":8.0229199999999992},{"$f":"VLOOKUP(($B35&\"_\"&AG$44&\"_\"&AG$43&\"_\"&AG$45&\"_\"&$AC35),'All Data'!$A$2:$L$1048576,8,FALSE)","v":6.0478820000000004},null,{"$f":"VLOOKUP(($B35&\"_\"&AH$44&\"_\"&AH$43&\"_\"&AH$45&\"_\"&$AC35),'All Data'!$A$2:$L$1048576,8,FALSE)","v":70.010239999999996},{"$f":"VLOOKUP(($B35&\"_\"&AJ$44&\"_\"&AJ$43&\"_\"&AJ$45&\"_\"&$AC35),'All Data'!$A$2:$L$1048576,8,FALSE)","v":26.730712024453695},{"$f":"VLOOKUP(($B35&\"_\"&AL$44&\"_\"&AL$43&\"_\"&AL$45&\"_\"&$AC35),'All Data'!$A$2:$L$1048576,8,FALSE)","v":2.1905973231834106},{"$f":"VLOOKUP(($B35&\"_\"&AM$44&\"_\"&AM$43&\"_\"&AM$45&\"_\"&$AC35),'All Data'!$A$2:$L$1048576,8,FALSE)","v":30.394354890746929},{"$f":"VLOOKUP(($B35&\"_\"&AN$44&\"_\"&AN$43&\"_\"&AN$45&\"_\"&$AC35),'All Data'!$A$2:$L$1048576,8,FALSE)","v":61.895740281829639},null,{"$f":"VLOOKUP(($B35&\"_\"&AO$44&\"_\"&AO$43&\"_\"&AO$45&\"_\"&$AC35),'All Data'!$A$2:$L$1048576,8,FALSE)","v":352.19722999999999},{"$f":"VLOOKUP(($B35&\"_\"&AP$44&\"_\"&AP$43&\"_\"&AP$45&\"_\"&$AC35),'All Data'!$A$2:$L$1048576,8,FALSE)","v":478.18162999999998},{"$f":"VLOOKUP(($B35&\"_\"&AQ$44&\"_\"&AQ$43&\"_\"&AQ$45&\"_\"&$AC35),'All Data'!$A$2:$L$1048576,8,FALSE)","v":232.26340999999999},null,{"$f":"VLOOKUP(($B35&\"_\"&AR$44&\"_\"&AR$43&\"_\"&AR$45&\"_\"&$AC35),'All Data'!$A$2:$L$1048576,8,FALSE)","v":47.495361781076063},null,{"$f":"VLOOKUP(($B35&\"_\"&AS$44&\"_\"&AS$43&\"_\"&AS$45&\"_\"&$AC35),'All Data'!$A$2:$L$1048576,8,FALSE)","v":710.33330000000001},{"$f":"VLOOKUP(($B35&\"_\"&AT$44&\"_\"&AT$43&\"_\"&AT$45&\"_\"&$AC35),'All Data'!$A$2:$L$1048576,8,FALSE)","v":454.15929999999997},{"$f":"VLOOKUP(($B35&\"_\"&AU$44&\"_\"&AU$43&\"_\"&AU$45&\"_\"&$AC35),'All Data'!$A$2:$L$1048576,8,FALSE)","v":861.38109999999995},null,{"$f":"VLOOKUP(($B35&\"_\"&AV$44&\"_\"&AV$43&\"_\"&AV$45&\"_\"&$AC35),'All Data'!$A$2:$L$1048576,8,FALSE)","v":83.109684947491246},null,null,null,"HB",{"$f":"'Overview (controls)'!C34","v":0},{"$f":"'Overview (controls)'!D34","v":0},{"$f":"'Overview (controls)'!E34","v":0},{"$f":"'Overview (controls)'!F34","v":0},{"$f":"'Overview (controls)'!G34","v":6.9267849999999997},{"$f":"'Overview (controls)'!H34","v":9.1190549999999995},{"$f":"'Overview (controls)'!I34","v":4.3392590000000002},{"$f":"'Overview (controls)'!J34","v":7.7565039999999996},{"$f":"'Overview (controls)'!K34","v":67.910709999999995},{"$f":"'Overview (controls)'!L34","v":72.109769999999997},{"$f":"'Overview (controls)'!M34","v":{"$error":"#N/A"}},{"$f":"'Overview (controls)'!N34","v":{"$error":"#N/A"}},{"$f":"'Overview (controls)'!O34","v":24.62538},{"$f":"'Overview (controls)'!P34","v":28.836040000000001},{"$f":"'Overview (controls)'!Q34","v":2.0946349999999998},{"$f":"'Overview (controls)'!R34","v":2.2865600000000001},{"$f":"'Overview (controls)'!S34","v":28.191090000000003},{"$f":"'Overview (controls)'!T34","v":32.597619999999999},{"$f":"'Overview (controls)'!U34","v":59.796059999999997},{"$f":"'Overview (controls)'!V34","v":63.995420000000003},{"$f":"'Overview (controls)'!W34","v":330.71086000000003},{"$f":"'Overview (controls)'!X34","v":374.69896},{"$f":"'Overview (controls)'!Y34","v":442.72309999999999},{"$f":"'Overview (controls)'!Z34","v":515.7002},{"$f":"'Overview (controls)'!AA34","v":207.83734000000001},{"$f":"'Overview (controls)'!AB34","v":258.73523999999998},{"$f":"'Overview (controls)'!AC34","v":41.855361781076063},{"$f":"'Overview (controls)'!AD34","v":53.688606735081187},{"$f":"'Overview (controls)'!AE34","v":644.73739999999998},{"$f":"'Overview (controls)'!AF34","v":780.65484000000004},{"$f":"'Overview (controls)'!AG34","v":371.32715999999999},{"$f":"'Overview (controls)'!AH34","v":549.80238999999995},{"$f":"'Overview (controls)'!AI34","v":768.18421000000001},{"$f":"'Overview (controls)'!AJ34","v":962.30083000000002},{"$f":"'Overview (controls)'!AK34","v":81.818537233646666},{"$f":"'Overview (controls)'!AL34","v":84.326706765959827}]
[null,"Aneurin Bevan HB",null,null,null,{"$f":"VLOOKUP(($B36&\"_\"&AF$44&\"_\"&AF$43&\"_\"&AF$45&\"_\"&$AC36),'All Data'!$A$2:$L$1048576,8,FALSE)","v":8.8347110000000004},{"$f":"VLOOKUP(($B36&\"_\"&AG$44&\"_\"&AG$43&\"_\"&AG$45&\"_\"&$AC36),'All Data'!$A$2:$L$1048576,8,FALSE)","v":7.4606649999999997},null,{"$f":"VLOOKUP(($B36&\"_\"&AH$44&\"_\"&AH$43&\"_\"&AH$45&\"_\"&$AC36),'All Data'!$A$2:$L$1048576,8,FALSE)","v":71.45165999999999},{"$f":"VLOOKUP(($B36&\"_\"&AJ$44&\"_\"&AJ$43&\"_\"&AJ$45&\"_\"&$AC36),'All Data'!$A$2:$L$1048576,8,FALSE)","v":23.947229775948692},{"$f":"VLOOKUP(($B36&\"_\"&AL$44&\"_\"&AL$43&\"_\"&AL$45&\"_\"&$AC36),'All Data'!$A$2:$L$1048576,8,FALSE)","v":2.2956527804222526},{"$f":"VLOOKUP(($B36&\"_\"&AM$44&\"_\"&AM$43&\"_\"&AM$45&\"_\"&$AC36),'All Data'!$A$2:$L$1048576,8,FALSE)","v":31.692057626839183},{"$f":"VLOOKUP(($B36&\"_\"&AN$44&\"_\"&AN$43&\"_\"&AN$45&\"_\"&$AC36),'All Data'!$A$2:$L$1048576,8,FALSE)","v":59.105476080435935},null,{"$f":"VLOOKUP(($B36&\"_\"&AO$44&\"_\"&AO$43&\"_\"&AO$45&\"_\"&$AC36),'All Data'!$A$2:$L$1048576,8,FALSE)","v":365.49355000000003},{"$f":"VLOOKUP(($B36&\"_\"&AP$44&\"_\"&AP$43&\"_\"&AP$45&\"_\"&$AC36),'All Data'!$A$2:$L$1048576,8,FALSE)","v":482.23716000000002},{"$f":"VLOOKUP(($B36&\"_\"&AQ$44&\"_\"&AQ$43&\"_\"&AQ$45&\"_\"&$AC36),'All Data'!$A$2:$L$1048576,8,FALSE)","v":254.49462},null,{"$f":"VLOOKUP(($B36&\"_\"&AR$44&\"_\"&AR$43&\"_\"&AR$45&\"_\"&$AC36),'All Data'!$A$2:$L$1048576,8,FALSE)","v":36.795570242029115},null,{"$f":"VLOOKUP(($B36&\"_\"&AS$44&\"_\"&AS$43&\"_\"&AS$45&\"_\"&$AC36),'All Data'!$A$2:$L$1048576,8,FALSE)","v":750.50599999999997},{"$f":"VLOOKUP(($B36&\"_\"&AT$44&\"_\"&AT$43&\"_\"&AT$45&\"_\"&$AC36),'All Data'!$A$2:$L$1048576,8,FALSE)","v":496.60879999999997},{"$f":"VLOOKUP(($B36&\"_\"&AU$44&\"_\"&AU$43&\"_\"&AU$45&\"_\"&$AC36),'All Data'!$A$2:$L$1048576,8,FALSE)","v":906.6499},null,{"$f":"VLOOKUP(($B36&\"_\"&AV$44&\"_\"&AV$43&\"_\"&AV$45&\"_\"&$AC36),'All Data'!$A$2:$L$1048576,8,FALSE)","v":80.899383365919689},null,null,null,"HB",{"$f":"'Overview (controls)'!C35","v":0},{"$f":"'Overview (controls)'!D35","v":0},{"$f":"'Overview (controls)'!E35","v":0},{"$f":"'Overview (controls)'!F35","v":0},{"$f":"'Overview (controls)'!G35","v":7.233314},{"$f":"'Overview (controls)'!H35","v":10.436109999999999},{"$f":"'Overview (controls)'!I35","v":5.0629840000000002},{"$f":"'Overview (controls)'!J35","v":9.8583459999999992},{"$f":"'Overview (controls)'!K35","v":70.18710999999999},{"$f":"'Overview (controls)'!L35","v":72.716219999999993},{"$f":"'Overview (controls)'!M35","v":{"$error":"#N/A"}},{"$f":"'Overview (controls)'!N35","v":{"$error":"#N/A"}},{"$f":"'Overview (controls)'!O35","v":22.654109999999999},{"$f":"'Overview (controls)'!P35","v":25.240349999999999},{"$f":"'Overview (controls)'!Q35","v":2.2369910000000002},{"$f":"'Overview (controls)'!R35","v":2.354314},{"$f":"'Overview (controls)'!S35","v":30.342269999999999},{"$f":"'Overview (controls)'!T35","v":33.041840000000001},{"$f":"'Overview (controls)'!U35","v":57.713930000000005},{"$f":"'Overview (controls)'!V35","v":60.497019999999999},{"$f":"'Overview (controls)'!W35","v":349.62097999999997},{"$f":"'Overview (controls)'!X35","v":381.89044999999999},{"$f":"'Overview (controls)'!Y35","v":456.38062000000002},{"$f":"'Overview (controls)'!Z35","v":509.15724999999998},{"$f":"'Overview (controls)'!AA35","v":235.94047},{"$f":"'Overview (controls)'!AB35","v":274.09872999999999},{"$f":"'Overview (controls)'!AC35","v":33.32827945564334},{"$f":"'Overview (controls)'!AD35","v":40.528025972000279},{"$f":"'Overview (controls)'!AE35","v":703.21073999999999},{"$f":"'Overview (controls)'!AF35","v":800.08817999999997},{"$f":"'Overview (controls)'!AG35","v":435.47719999999998},{"$f":"'Overview (controls)'!AH35","v":563.84666000000004},{"$f":"'Overview (controls)'!AI35","v":839.4914},{"$f":"'Overview (controls)'!AJ35","v":977.56627000000003},{"$f":"'Overview (controls)'!AK35","v":79.93677058434659},{"$f":"'Overview (controls)'!AL35","v":81.826311224184664}]
[]
[null,"Wales",{"$f":"VLOOKUP(($B38&\"_\"&AD$44&\"_\"&AD$43&\"_\"&AD$45&\"_\"&$AC38),'All Data'!$A$2:$L$1048576,8,FALSE)","v":18.937380000000001},{"$f":"VLOOKUP(($B38&\"_\"&AE$44&\"_\"&AE$43&\"_\"&AE$45&\"_\"&$AC38),'All Data'!$A$2:$L$1048576,8,FALSE)","v":17.792860000000001},null,{"$f":"VLOOKUP(($B38&\"_\"&AF$44&\"_\"&AF$43&\"_\"&AF$45&\"_\"&$AC38),'All Data'!$A$2:$L$1048576,8,FALSE)","v":9.2429989999999993},{"$f":"VLOOKUP(($B38&\"_\"&AG$44&\"_\"&AG$43&\"_\"&AG$45&\"_\"&$AC38),'All Data'!$A$2:$L$1048576,8,FALSE)","v":7.0557189999999999},null,{"$f":"VLOOKUP(($B38&\"_\"&AH$44&\"_\"&AH$43&\"_\"&AH$45&\"_\"&$AC38),'All Data'!$A$2:$L$1048576,8,FALSE)","v":74.51558},{"$f":"VLOOKUP(($B38&\"_\"&AJ$44&\"_\"&AJ$43&\"_\"&AJ$45&\"_\"&$AC38),'All Data'!$A$2:$L$1048576,8,FALSE)","v":23.514886860251185},{"$f":"VLOOKUP(($B38&\"_\"&AL$44&\"_\"&AL$43&\"_\"&AL$45&\"_\"&$AC38),'All Data'!$A$2:$L$1048576,8,FALSE)","v":2.3616713684915513},{"$f":"VLOOKUP(($B38&\"_\"&AM$44&\"_\"&AM$43&\"_\"&AM$45&\"_\"&$AC38),'All Data'!$A$2:$L$1048576,8,FALSE)","v":35.016292550863419},{"$f":"VLOOKUP(($B38&\"_\"&AN$44&\"_\"&AN$43&\"_\"&AN$45&\"_\"&$AC38),'All Data'!$A$2:$L$1048576,8,FALSE)","v":57.280596629438094},null,{"$f":"VLOOKUP(($B38&\"_\"&AO$44&\"_\"&AO$43&\"_\"&AO$45&\"_\"&$AC38),'All Data'!$A$2:$L$1048576,8,FALSE)","v":328.43511999999998},{"$f":"VLOOKUP(($B38&\"_\"&AP$44&\"_\"&AP$43&\"_\"&AP$45&\"_\"&$AC38),'All Data'!$A$2:$L$1048576,8,FALSE)","v":431.66547000000003},{"$f":"VLOOKUP(($B38&\"_\"&AQ$44&\"_\"&AQ$43&\"_\"&AQ$45&\"_\"&$AC38),'All Data'!$A$2:$L$1048576,8,FALSE)","v":230.16815},null,{"$f":"VLOOKUP(($B38&\"_\"&AR$44&\"_\"&AR$43&\"_\"&AR$45&\"_\"&$AC38),'All Data'!$A$2:$L$1048576,8,FALSE)","v":37.702690461092487},null,{"$f":"VLOOKUP(($B38&\"_\"&AS$44&\"_\"&AS$43&\"_\"&AS$45&\"_\"&$AC38),'All Data'!$A$2:$L$1048576,8,FALSE)","v":636.40340000000003},{"$f":"VLOOKUP(($B38&\"_\"&AT$44&\"_\"&AT$43&\"_\"&AT$45&\"_\"&$AC38),'All Data'!$A$2:$L$1048576,8,FALSE)","v":424.90069999999997},{"$f":"VLOOKUP(($B38&\"_\"&AU$44&\"_\"&AU$43&\"_\"&AU$45&\"_\"&$AC38),'All Data'!$A$2:$L$1048576,8,FALSE)","v":777.34780000000001},null,{"$f":"VLOOKUP(($B38&\"_\"&AV$44&\"_\"&AV$43&\"_\"&AV$45&\"_\"&$AC38),'All Data'!$A$2:$L$1048576,8,FALSE)","v":80.842395202708516},null,null,null,"Wales",{"$f":"'Overview (controls)'!C36","v":18.937380000000001},{"$f":"'Overview (controls)'!D36","v":18.937380000000001},{"$f":"'Overview (controls)'!E36","v":17.792860000000001},{"$f":"'Overview (controls)'!F36","v":17.792860000000001},{"$f":"'Overview (controls)'!G36","v":9.2429989999999993},{"$f":"'Overview (controls)'!H36","v":9.2429989999999993},{"$f":"'Overview (controls)'!I36","v":7.0557189999999999},{"$f":"'Overview (controls)'!J36","v":7.0557189999999999},{"$f":"'Overview (controls)'!K36","v":74.51558},{"$f":"'Overview (controls)'!L36","v":74.51558},{"$f":"'Overview (controls)'!M36","v":{"$error":"#N/A"}},{"$f":"'Overview (controls)'!N36","v":{"$error":"#N/A"}},{"$f":"'Overview (controls)'!O36","v":23.514886860251185},{"$f":"'Overview (controls)'!P36","v":23.514886860251185},{"$f":"'Overview (controls)'!Q36","v":2.3616713684915513},{"$f":"'Overview (controls)'!R36","v":2.3616713684915513},{"$f":"'Overview (controls)'!S36","v":35.016292550863419},{"$f":"'Overview (controls)'!T36","v":35.016292550863419},{"$f":"'Overview (controls)'!U36","v":57.280596629438094},{"$f":"'Overview (controls)'!V36","v":57.280596629438094},{"$f":"'Overview (controls)'!W36","v":328.43511999999998},{"$f":"'Overview (controls)'!X36","v":328.43511999999998},{"$f":"'Overview (controls)'!Y36","v":431.66547000000003},{"$f":"'Overview (controls)'!Z36","v":431.66547000000003},{"$f":"'Overview (controls)'!AA36","v":230.16815},{"$f":"'Overview (controls)'!AB36","v":230.16815},{"$f":"'Overview (controls)'!AC36","v":37.702690461092487},{"$f":"'Overview (controls)'!AD36","v":37.702690461092487},{"$f":"'Overview (controls)'!AE36","v":636.40340000000003},{"$f":"'Overview (controls)'!AF36","v":636.40340000000003},{"$f":"'Overview (controls)'!AG36","v":424.90069999999997},{"$f":"'Overview (controls)'!AH36","v":424.90069999999997},{"$f":"'Overview (controls)'!AI36","v":777.34780000000001},{"$f":"'Overview (controls)'!AJ36","v":777.34780000000001},{"$f":"'Overview (controls)'!AK36","v":80.842395202708516},{"$f":"'Overview (controls)'!AL36","v":80.842395202708516}]
[]
[]
[null,null,null,null,null,"Statistically significantly worse than Wales",null,null,null,null,null,null,"Statistical significance is determined using the confidence intervals (CIs) of the local value. If the national average falls outside the local CI, the difference is deemed to be statistically significant. "]
[null,null,null,null,null,"Not statistically significantly different"]
[null,"1 = Age standardised",null,null,null,"Statistically significantly better than Wales",null,null,null,null,null,null,null,null,null,null,null,null,null,null,null,null,null,null,null,null,null,null,null,"MALES","FEMALES","MALES","FEMALES","PERSONS","PERSONS","PERSONS","PERSONS","PERSONS","PERSONS","PERSONS","PERSONS","MALES","FEMALES","FEMALES","PERSONS","MALES","FEMALES","Children at age 4"]
[null,null,null,null,null,null,null,null,null,null,null,null,null,null,null,null,null,null,null,null,null,null,null,null,null,null,null,null,null,"HLE","HLE","LE","LE","MENT","EMP","SMO","FRU","ACT","FRU","OBE","ALC","ALC","ALC","CONCEP","HIP","HIP","HIP","VACC"]
[null,null,null,null,null,null,null,null,null,null,null,null,null,null,null,null,null,null,null,null,null,null,null,null,null,null,null,null,null,"2005-2009","2005-2009","2005-2009","2005-2009","2009-2010","2009-2010","2009-2010","2009-2010","2009-2010","2009-2010","2009-2010",2010,2010,2010,2010,2010,2010,2010,"2011-2012 (FY)"]

{"sheet":"Interactive","index":3,"n_rows":43,"n_cols":18,"rows_kept":43,"cut":false,"hidden":false,"merged":[[5,13,5,17],[7,15,7,16],[42,13,43,17]]}
[]
[]
[]
[]
[]
[null,null,null,null,null,null,null,null,null,null,null,null,null,{"$f":"'Interactive controls'!K48","v":"Inequality gap in life expectancy (SII in years), males, all ages, Wales health boards and local authorities, 2005-2009"}]
[]
[null,null,null,null,null,null,null,null,null,null,null,null,null,null,{"$f":"'Interactive controls'!K47","v":" "},{"$f":"'Interactive controls'!A18","v":"SII in LE (95% CI)"},null,{"$f":"'Interactive controls'!K49","v":"Compared to Wales*"}]
[null,null,null,null,null,null,null,null,null,null,null,null,null,"Isle of Anglesey",{"$f":"IFERROR('Interactive controls'!P10,\" \")","v":" "},{"$f":"IFERROR(FIXED(IFERROR('Interactive controls'!Q10,\" \"),'Interactive controls'!$A$21),\" \")","v":"6.8"},{"$f":"IFERROR(\"(\" & FIXED(('Interactive controls'!S10),'Interactive controls'!$A$21) & \" to \" & FIXED(('Interactive controls'!T10),'Interactive controls'!$A$21) & \")\",\" \")","v":"(-0.1 to 13.7)"},{"$f":"IFERROR('Interactive controls'!W10,\" \")","v":"No sig. difference"}]
[null,null,null,null,null,null,null,null,null,null,null,null,null,"Gwynedd",{"$f":"IFERROR('Interactive controls'!P11,\" \")","v":" "},{"$f":"IFERROR(FIXED(IFERROR('Interactive controls'!Q11,\" \"),'Interactive controls'!$A$21),\" \")","v":"3.4"},{"$f":"IFERROR(\"(\" & FIXED(('Interactive controls'!S11),'Interactive controls'!$A$21) & \" to \" & FIXED(('Interactive controls'!T11),'Interactive controls'!$A$21) & \")\",\" \")","v":"(0.2 to 6.7)"},{"$f":"IFERROR('Interactive controls'!W11,\" \")","v":"Sig. low"}]
[null,null,null,null,null,null,null,null,null,null,null,null,null,"Conwy",{"$f":"IFERROR('Interactive controls'!P12,\" \")","v":" "},{"$f":"IFERROR(FIXED(IFERROR('Interactive controls'!Q12,\" \"),'Interactive controls'!$A$21),\" \")","v":"8.1"},{"$f":"IFERROR(\"(\" & FIXED(('Interactive controls'!S12),'Interactive controls'!$A$21) & \" to \" & FIXED(('Interactive controls'!T12),'Interactive controls'!$A$21) & \")\",\" \")","v":"(5.8 to 10.3)"},{"$f":"IFERROR('Interactive controls'!W12,\" \")","v":"No sig. difference"}]
[null,null,null,null,null,null,null,null,null,null,null,null,null,"Denbighshire",{"$f":"IFERROR('Interactive controls'!P13,\" \")","v":" "},{"$f":"IFERROR(FIXED(IFERROR('Interactive controls'!Q13,\" \"),'Interactive controls'!$A$21),\" \")","v":"7.6"},{"$f":"IFERROR(\"(\" & FIXED(('Interactive controls'!S13),'Interactive controls'!$A$21) & \" to \" & FIXED(('Interactive controls'!T13),'Interactive controls'!$A$21) & \")\",\" \")","v":"(-3.1 to 18.4)"},{"$f":"IFERROR('Interactive controls'!W13,\" \")","v":"No sig. difference"}]
[null,null,null,null,null,null,null,null,null,null,null,null,null,"Flintshire",{"$f":"IFERROR('Interactive controls'!P14,\" \")","v":" "},{"$f":"IFERROR(FIXED(IFERROR('Interactive controls'!Q14,\" \"),'Interactive controls'!$A$21),\" \")","v":"7.5"},{"$f":"IFERROR(\"(\" & FIXED(('Interactive controls'!S14),'Interactive controls'!$A$21) & \" to \" & FIXED(('Interactive controls'!T14),'Interactive controls'!$A$21) & \")\",\" \")","v":"(1.5 to 13.4)"},{"$f":"IFERROR('Interactive controls'!W14,\" \")","v":"No sig. difference"}]
[null,null,null,null,null,null,null,null,null,null,null,null,null,"Wrexham",{"$f":"IFERROR('Interactive controls'!P15,\" \")","v":" "},{"$f":"IFERROR(FIXED(IFERROR('Interactive controls'!Q15,\" \"),'Interactive controls'!$A$21),\" \")","v":"9.2"},{"$f":"IFERROR(\"(\" & FIXED(('Interactive controls'!S15),'Interactive controls'!$A$21) & \" to \" & FIXED(('Interactive controls'!T15),'Interactive controls'!$A$21) & \")\",\" \")","v":"(5.5 to 12.8)"},{"$f":"IFERROR('Interactive controls'!W15,\" \")","v":"No sig. difference"}]
[null,null,null,null,null,null,null,null,null,null,null,null,null,"Powys",{"$f":"IFERROR('Interactive controls'!P16,\" \")","v":" "},{"$f":"IFERROR(FIXED(IFERROR('Interactive controls'!Q16,\" \"),'Interactive controls'!$A$21),\" \")","v":"5.5"},{"$f":"IFERROR(\"(\" & FIXED(('Interactive controls'!S16),'Interactive controls'!$A$21) & \" to \" & FIXED(('Interactive controls'!T16),'Interactive controls'!$A$21) & \")\",\" \")","v":"(-0.5 to 11.4)"},{"$f":"IFERROR('Interactive controls'!W16,\" \")","v":"No sig. difference"}]
[null,null,null,null,null,null,null,null,null,null,null,null,null,"Ceredigion",{"$f":"IFERROR('Interactive controls'!P17,\" \")","v":" "},{"$f":"IFERROR(FIXED(IFERROR('Interactive controls'!Q17,\" \"),'Interactive controls'!$A$21),\" \")","v":"7.7"},{"$f":"IFERROR(\"(\" & FIXED(('Interactive controls'!S17),'Interactive controls'!$A$21) & \" to \" & FIXED(('Interactive controls'!T17),'Interactive controls'!$A$21) & \")\",\" \")","v":"(2.9 to 12.5)"},{"$f":"IFERROR('Interactive controls'!W17,\" \")","v":"No sig. difference"}]
[null,null,null,null,null,null,null,null,null,null,null,null,null,"Pembrokeshire",{"$f":"IFERROR('Interactive controls'!P18,\" \")","v":" "},{"$f":"IFERROR(FIXED(IFERROR('Interactive controls'!Q18,\" \"),'Interactive controls'!$A$21),\" \")","v":"5.9"},{"$f":"IFERROR(\"(\" & FIXED(('Interactive controls'!S18),'Interactive controls'!$A$21) & \" to \" & FIXED(('Interactive controls'!T18),'Interactive controls'!$A$21) & \")\",\" \")","v":"(-2.5 to 14.4)"},{"$f":"IFERROR('Interactive controls'!W18,\" \")","v":"No sig. difference"}]
[null,null,null,null,null,null,null,null,null,null,null,null,null,"Carmarthenshire",{"$f":"IFERROR('Interactive controls'!P19,\" \")","v":" "},{"$f":"IFERROR(FIXED(IFERROR('Interactive controls'!Q19,\" \"),'Interactive controls'!$A$21),\" \")","v":"5.8"},{"$f":"IFERROR(\"(\" & FIXED(('Interactive controls'!S19),'Interactive controls'!$A$21) & \" to \" & FIXED(('Interactive controls'!T19),'Interactive controls'!$A$21) & \")\",\" \")","v":"(-0.5 to 12.0)"},{"$f":"IFERROR('Interactive controls'!W19,\" \")","v":"No sig. difference"}]
[null,null,null,null,null,null,null,null,null,null,null,null,null,"Swansea",{"$f":"IFERROR('Interactive controls'!P20,\" \")","v":" "},{"$f":"IFERROR(FIXED(IFERROR('Interactive controls'!Q20,\" \"),'Interactive controls'!$A$21),\" \")","v":"12.2"},{"$f":"IFERROR(\"(\" & FIXED(('Interactive controls'!S20),'Interactive controls'!$A$21) & \" to \" & FIXED(('Interactive controls'!T20),'Interactive controls'!$A$21) & \")\",\" \")","v":"(9.2 to 15.1)"},{"$f":"IFERROR('Interactive controls'!W20,\" \")","v":"No sig. difference"}]
[null,null,null,null,null,null,null,null,null,null,null,null,null,"Neath Port Talbot",{"$f":"IFERROR('Interactive controls'!P21,\" \")","v":" "},{"$f":"IFERROR(FIXED(IFERROR('Interactive controls'!Q21,\" \"),'Interactive controls'!$A$21),\" \")","v":"10.4"},{"$f":"IFERROR(\"(\" & FIXED(('Interactive controls'!S21),'Interactive controls'!$A$21) & \" to \" & FIXED(('Interactive controls'!T21),'Interactive controls'!$A$21) & \")\",\" \")","v":"(8.0 to 12.9)"},{"$f":"IFERROR('Interactive controls'!W21,\" \")","v":"No sig. difference"}]
[null,null,null,null,null,null,null,null,null,null,null,null,null,"Bridgend",{"$f":"IFERROR('Interactive controls'!P22,\" \")","v":" "},{"$f":"IFERROR(FIXED(IFERROR('Interactive controls'!Q22,\" \"),'Interactive controls'!$A$21),\" \")","v":"7.8"},{"$f":"IFERROR(\"(\" & FIXED(('Interactive controls'!S22),'Interactive controls'!$A$21) & \" to \" & FIXED(('Interactive controls'!T22),'Interactive controls'!$A$21) & \")\",\" \")","v":"(4.1 to 11.6)"},{"$f":"IFERROR('Interactive controls'!W22,\" \")","v":"No sig. difference"}]
[null,null,null,null,null,null,null,null,null,null,null,null,null,"The Vale of Glamorgan",{"$f":"IFERROR('Interactive controls'!P23,\" \")","v":" "},{"$f":"IFERROR(FIXED(IFERROR('Interactive controls'!Q23,\" \"),'Interactive controls'!$A$21),\" \")","v":"7.5"},{"$f":"IFERROR(\"(\" & FIXED(('Interactive controls'!S23),'Interactive controls'!$A$21) & \" to \" & FIXED(('Interactive controls'!T23),'Interactive controls'!$A$21) & \")\",\" \")","v":"(3.1 to 11.9)"},{"$f":"IFERROR('Interactive controls'!W23,\" \")","v":"No sig. difference"}]
[null,null,null,null,null,null,null,null,null,null,null,null,null,"Cardiff",{"$f":"IFERROR('Interactive controls'!P24,\" \")","v":" "},{"$f":"IFERROR(FIXED(IFERROR('Interactive controls'!Q24,\" \"),'Interactive controls'!$A$21),\" \")","v":"12.8"},{"$f":"IFERROR(\"(\" & FIXED(('Interactive controls'!S24),'Interactive controls'!$A$21) & \" to \" & FIXED(('Interactive controls'!T24),'Interactive controls'!$A$21) & \")\",\" \")","v":"(11.0 to 14.7)"},{"$f":"IFERROR('Interactive controls'!W24,\" \")","v":"Sig. high"}]
[null,null,null,null,null,null,null,null,null,null,null,null,null,"Rhondda Cynon Taf",{"$f":"IFERROR('Interactive controls'!P25,\" \")","v":" "},{"$f":"IFERROR(FIXED(IFERROR('Interactive controls'!Q25,\" \"),'Interactive controls'!$A$21),\" \")","v":"7.9"},{"$f":"IFERROR(\"(\" & FIXED(('Interactive controls'!S25),'Interactive controls'!$A$21) & \" to \" & FIXED(('Interactive controls'!T25),'Interactive controls'!$A$21) & \")\",\" \")","v":"(5.2 to 10.6)"},{"$f":"IFERROR('Interactive controls'!W25,\" \")","v":"No sig. difference"}]
[null,null,null,null,null,null,null,null,null,null,null,null,null,"Merthyr Tydfil",{"$f":"IFERROR('Interactive controls'!P26,\" \")","v":" "},{"$f":"IFERROR(FIXED(IFERROR('Interactive controls'!Q26,\" \"),'Interactive controls'!$A$21),\" \")","v":"9.4"},{"$f":"IFERROR(\"(\" & FIXED(('Interactive controls'!S26),'Interactive controls'!$A$21) & \" to \" & FIXED(('Interactive controls'!T26),'Interactive controls'!$A$21) & \")\",\" \")","v":"(5.0 to 13.7)"},{"$f":"IFERROR('Interactive controls'!W26,\" \")","v":"No sig. difference"}]
[null,null,null,null,null,null,null,null,null,null,null,null,null,"Caerphilly",{"$f":"IFERROR('Interactive controls'!P27,\" \")","v":" "},{"$f":"IFERROR(FIXED(IFERROR('Interactive controls'!Q27,\" \"),'Interactive controls'!$A$21),\" \")","v":"8.5"},{"$f":"IFERROR(\"(\" & FIXED(('Interactive controls'!S27),'Interactive controls'!$A$21) & \" to \" & FIXED(('Interactive controls'!T27),'Interactive controls'!$A$21) & \")\",\" \")","v":"(6.0 to 11.0)"},{"$f":"IFERROR('Interactive controls'!W27,\" \")","v":"No sig. difference"}]
[null,null,null,null,null,null,null,null,null,null,null,null,null,"Blaenau Gwent",{"$f":"IFERROR('Interactive controls'!P28,\" \")","v":" "},{"$f":"IFERROR(FIXED(IFERROR('Interactive controls'!Q28,\" \"),'Interactive controls'!$A$21),\" \")","v":"2.6"},{"$f":"IFERROR(\"(\" & FIXED(('Interactive controls'!S28),'Interactive controls'!$A$21) & \" to \" & FIXED(('Interactive controls'!T28),'Interactive controls'!$A$21) & \")\",\" \")","v":"(-3.1 to 8.4)"},{"$f":"IFERROR('Interactive controls'!W28,\" \")","v":"Sig. low"}]
[null,null,null,null,null,null,null,null,null,null,null,null,null,"Torfaen",{"$f":"IFERROR('Interactive controls'!P29,\" \")","v":" "},{"$f":"IFERROR(FIXED(IFERROR('Interactive controls'!Q29,\" \"),'Interactive controls'!$A$21),\" \")","v":"7.3"},{"$f":"IFERROR(\"(\" & FIXED(('Interactive controls'!S29),'Interactive controls'!$A$21) & \" to \" & FIXED(('Interactive controls'!T29),'Interactive controls'!$A$21) & \")\",\" \")","v":"(4.7 to 9.9)"},{"$f":"IFERROR('Interactive controls'!W29,\" \")","v":"No sig. difference"}]
[null,null,null,null,null,null,null,null,null,null,null,null,null,"Monmouthshire",{"$f":"IFERROR('Interactive controls'!P30,\" \")","v":" "},{"$f":"IFERROR(FIXED(IFERROR('Interactive controls'!Q30,\" \"),'Interactive controls'!$A$21),\" \")","v":"5.9"},{"$f":"IFERROR(\"(\" & FIXED(('Interactive controls'!S30),'Interactive controls'!$A$21) & \" to \" & FIXED(('Interactive controls'!T30),'Interactive controls'!$A$21) & \")\",\" \")","v":"(4.4 to 7.4)"},{"$f":"IFERROR('Interactive controls'!W30,\" \")","v":"Sig. low"}]
[null,null,null,null,null,null,null,null,null,null,null,null,null,"Newport",{"$f":"IFERROR('Interactive controls'!P31,\" \")","v":" "},{"$f":"IFERROR(FIXED(IFERROR('Interactive controls'!Q31,\" \"),'Interactive controls'!$A$21),\" \")","v":"11.0"},{"$f":"IFERROR(\"(\" & FIXED(('Interactive controls'!S31),'Interactive controls'!$A$21) & \" to \" & FIXED(('Interactive controls'!T31),'Interactive controls'!$A$21) & \")\",\" \")","v":"(9.5 to 12.6)"},{"$f":"IFERROR('Interactive controls'!W31,\" \")","v":"Sig. high"}]
[]
[]
[null,null,null,null,null,null,null,null,null,null,null,null,null,"Betsi Cadwaladr UHB",{"$f":"IFERROR('Interactive controls'!P34,\" \")","v":" "},{"$f":"IFERROR(FIXED(IFERROR('Interactive controls'!Q34,\" \"),'Interactive controls'!$A$21),\" \")","v":"7.2"},{"$f":"IFERROR(\"(\" & FIXED(('Interactive controls'!S34),'Interactive controls'!$A$21) & \" to \" & FIXED(('Interactive controls'!T34),'Interactive controls'!$A$21) & \")\",\" \")","v":"(2.9 to 11.5)"},{"$f":"IFERROR('Interactive controls'!W34, \" \")","v":"No sig. difference"}]
[null,null,null,null,null,null,null,null,null,null,null,null,null,"Powys THB",{"$f":"IFERROR('Interactive controls'!P35,\" \")","v":" "},{"$f":"IFERROR(FIXED(IFERROR('Interactive controls'!Q35,\" \"),'Interactive controls'!$A$21),\" \")","v":"5.5"},{"$f":"IFERROR(\"(\" & FIXED(('Interactive controls'!S35),'Interactive controls'!$A$21) & \" to \" & FIXED(('Interactive controls'!T35),'Interactive controls'!$A$21) & \")\",\" \")","v":"(-0.5 to 11.4)"},{"$f":"IFERROR('Interactive controls'!W35, \" \")","v":"No sig. difference"}]
[null,null,null,null,null,null,null,null,null,null,null,null,null,"Hywel Dda HB",{"$f":"IFERROR('Interactive controls'!P36,\" \")","v":" "},{"$f":"IFERROR(FIXED(IFERROR('Interactive controls'!Q36,\" \"),'Interactive controls'!$A$21),\" \")","v":"6.8"},{"$f":"IFERROR(\"(\" & FIXED(('Interactive controls'!S36),'Interactive controls'!$A$21) & \" to \" & FIXED(('Interactive controls'!T36),'Interactive controls'!$A$21) & \")\",\" \")","v":"(2.2 to 11.4)"},{"$f":"IFERROR('Interactive controls'!W36, \" \")","v":"No sig. difference"}]
[null,null,null,null,null,null,null,null,null,null,null,null,null,"ABM UHB",{"$f":"IFERROR('Interactive controls'!P37,\" \")","v":" "},{"$f":"IFERROR(FIXED(IFERROR('Interactive controls'!Q37,\" \"),'Interactive controls'!$A$21),\" \")","v":"10.4"},{"$f":"IFERROR(\"(\" & FIXED(('Interactive controls'!S37),'Interactive controls'!$A$21) & \" to \" & FIXED(('Interactive controls'!T37),'Interactive controls'!$A$21) & \")\",\" \")","v":"(8.9 to 11.8)"},{"$f":"IFERROR('Interactive controls'!W37, \" \")","v":"No sig. difference"}]
[null,null,null,null,null,null,null,null,null,null,null,null,null,"Cardiff & Vale UHB",{"$f":"IFERROR('Interactive controls'!P38,\" \")","v":" "},{"$f":"IFERROR(FIXED(IFERROR('Interactive controls'!Q38,\" \"),'Interactive controls'!$A$21),\" \")","v":"11.8"},{"$f":"IFERROR(\"(\" & FIXED(('Interactive controls'!S38),'Interactive controls'!$A$21) & \" to \" & FIXED(('Interactive controls'!T38),'Interactive controls'!$A$21) & \")\",\" \")","v":"(8.5 to 15.1)"},{"$f":"IFERROR('Interactive controls'!W38, \" \")","v":"No sig. difference"}]
[null,null,null,null,null,null,null,null,null,null,null,null,null,"Cwm Taf HB",{"$f":"IFERROR('Interactive controls'!P39,\" \")","v":" "},{"$f":"IFERROR(FIXED(IFERROR('Interactive controls'!Q39,\" \"),'Interactive controls'!$A$21),\" \")","v":"8.0"},{"$f":"IFERROR(\"(\" & FIXED(('Interactive controls'!S39),'Interactive controls'!$A$21) & \" to \" & FIXED(('Interactive controls'!T39),'Interactive controls'!$A$21) & \")\",\" \")","v":"(6.9 to 9.1)"},{"$f":"IFERROR('Interactive controls'!W39, \" \")","v":"Sig. low"}]
[null,null,null,null,null,null,null,null,null,null,null,null,null,"Aneurin Bevan HB",{"$f":"IFERROR('Interactive controls'!P40,\" \")","v":" "},{"$f":"IFERROR(FIXED(IFERROR('Interactive controls'!Q40,\" \"),'Interactive controls'!$A$21),\" \")","v":"8.8"},{"$f":"IFERROR(\"(\" & FIXED(('Interactive controls'!S40),'Interactive controls'!$A$21) & \" to \" & FIXED(('Interactive controls'!T40),'Interactive controls'!$A$21) & \")\",\" \")","v":"(7.2 to 10.4)"},{"$f":"IFERROR('Interactive controls'!W40, \" \")","v":"No sig. difference"}]
[null,null,null,null,null,null,null,null,null,null,null,null,null,"Wales",{"$f":"IFERROR('Interactive controls'!P41,\" \")","v":" "},{"$f":"IFERROR(FIXED(IFERROR('Interactive controls'!Q41,\" \"),'Interactive controls'!$A$21),\" \")","v":"9.2"},{"$f":"IFERROR(\"(\" & FIXED(('Interactive controls'!S41),'Interactive controls'!$A$21) & \" to \" & FIXED(('Interactive controls'!T41),'Interactive controls'!$A$21) & \")\",\" \")","v":"(6.8 to 11.6)"},{"$f":"IF(P40=\" \",\" \",\"-\")","v":"-"}]
[]
[null,null,null,null,null,null,null,null,null,null,null,null,null,{"$f":"'Interactive controls'!K46","v":"Produced by Public Health Wales Observatory, using ADDE & MYE (ONS), WIMD 2008 (WG)"}]
[null,null,null,null,null,null,null,null,null,null,null,null,null,"* Statistical significance is determined using the confidence intervals (CIs) of the local value. If the national average falls outside the local CI, the difference is deemed to be statistically significant. "]

{"sheet":"Interactive controls","index":4,"n_rows":75,"n_cols":27,"rows_kept":75,"cut":false,"hidden":true,"merged":[[63,7,71,7],[4,5,4,6],[4,23,4,25],[25,6,25,7],[63,8,67,8],[56,8,57,8],[18,5,18,6],[55,6,72,6],[56,7,62,7],[6,23,6,25],[7,17,8,17],[17,8,18,8]]}
[null,null,null,null,null,"LA/HB selection"]
[null,null,null,null,null,1,"Wales health boards"]
["Current selection (list number)",4,1,null,null,{"$f":"INDEX(G2:G3,F2)","v":"Wales health boards"},"Wales local authorities"]
["Current selection"]
[null,null,null,null,null,"For year selection ",null,null,null,null,null,null,null,null,null,null,null,null,null,null,null,null,null,"X,Y values for chart"]
[null,null,null,null,null,{"$f":"HLOOKUP(A15,$J$56:$V$72,14,FALSE)","v":0},1,null,null,"Data for tables"]
[null,null,null,null,null,{"$f":"HLOOKUP(A15,$J$56:$V$72,15,FALSE)","v":1},null,null,null,null,null,null,null,null,null,null,null,null,null,null,null,null,null,"Wales line"]
[null,null,null,null,null,{"$f":"HLOOKUP(A15,$J$56:$V$72,16,FALSE)","v":5},null,null,null,null,null,null,null,null,2,7,8,"For decimal places on chart",9,10,11,12,13,"Wales line","Wales line 1dp","XY","Significance"]
[null,null,null,null,null,{"$f":"HLOOKUP(A15,$J$56:$V$72,17,FALSE)","v":1},null,null,null,null,"ShortAreaName","Sex","Year","lookup","FullAreaName","annual average",{"$f":"A18","v":"SII in LE (95% CI)"},null,"LCL","UCL","error +","error -","Significance",{"$f":"$Q$41","v":9.2429989999999993},{"$f":"X9","v":9.2429989999999993},0]
[null,null,null,null,null,null,null,null,null,null,"Isle of Anglesey",{"$f":"$A$19","v":"Males"},{"$f":"$A$13","v":"2005-2009"},{"$f":"K10 & \"_\" & $A$14 &\"_\"&$A$19&\"_\"&$A$13&\"_\"&\"LA\"","v":"Isle of Anglesey_LE_Males_2005-2009_LA"},"Isle of Anglesey",{"$f":"VLOOKUP($N10,'All Data'!$A:$L,P$8,FALSE)","v":" "},{"$f":"R10","v":6.8199509999999997},{"$f":"VLOOKUP($N10,'All Data'!$A:$L,Q$8,FALSE)","v":6.8199509999999997},{"$f":"VLOOKUP($N10,'All Data'!$A:$L,S$8,FALSE)","v":-8.5565299999999997E-2},{"$f":"VLOOKUP($N10,'All Data'!$A:$L,T$8,FALSE)","v":13.72547},{"$f":"VLOOKUP($N10,'All Data'!$A:$L,U$8,FALSE)","v":6.905519},{"$f":"VLOOKUP($N10,'All Data'!$A:$L,V$8,FALSE)","v":6.9055162999999995},{"$f":"AA10","v":"No sig. difference"},9.2429989999999993,{"$f":"X10","v":9.2429989999999993},0.5,{"$f":"IF($T$41=0,\"-\",IF($Q$41<S10,\"Sig. high\",IF($Q$41>T10,\"Sig. low\",\"No sig. difference\")))","v":"No sig. difference"}]
["Current selection variables","Type",null,null,null,"For HB/LA selection",null,null,"Wales line",null,"Gwynedd",{"$f":"$A$19","v":"Males"},{"$f":"$A$13","v":"2005-2009"},{"$f":"K11 & \"_\" & $A$14 &\"_\"&$A$19&\"_\"&$A$13&\"_\"&\"LA\"","v":"Gwynedd_LE_Males_2005-2009_LA"},"Gwynedd",{"$f":"VLOOKUP($N11,'All Data'!$A:$L,P$8,FALSE)","v":" "},{"$f":"R11","v":3.4251330000000002},{"$f":"VLOOKUP($N11,'All Data'!$A:$L,Q$8,FALSE)","v":3.4251330000000002},{"$f":"VLOOKUP($N11,'All Data'!$A:$L,S$8,FALSE)","v":0.18031449999999999},{"$f":"VLOOKUP($N11,'All Data'!$A:$L,T$8,FALSE)","v":6.6699520000000003},{"$f":"VLOOKUP($N11,'All Data'!$A:$L,U$8,FALSE)","v":3.2448190000000001},{"$f":"VLOOKUP($N11,'All Data'!$A:$L,V$8,FALSE)","v":3.2448185},{"$f":"AA11","v":"Sig. low"},9.2429989999999993,9.2429989999999993,1.5,{"$f":"IF($T$41=0,\"-\",IF($Q$41<S11,\"Sig. high\",IF($Q$41>T11,\"Sig. low\",\"No sig. difference\")))","v":"Sig. low"}]
[null,null,null,null,null,"Current selection","No of rows","Start at row","No of rows","start at row","Conwy","Males","2005-2009","Conwy_LE_Males_2005-2009_LA","Conwy",{"$f":"VLOOKUP($N12,'All Data'!$A:$L,P$8,FALSE)","v":" "},8.0631459999999997,{"$f":"VLOOKUP($N12,'All Data'!$A:$L,Q$8,FALSE)","v":8.0631459999999997},{"$f":"VLOOKUP($N12,'All Data'!$A:$L,S$8,FALSE)","v":5.7928949999999997},{"$f":"VLOOKUP($N12,'All Data'!$A:$L,T$8,FALSE)","v":10.333399999999999},{"$f":"VLOOKUP($N12,'All Data'!$A:$L,U$8,FALSE)","v":2.2702539999999996},{"$f":"VLOOKUP($N12,'All Data'!$A:$L,V$8,FALSE)","v":2.270251},"No sig. difference",9.2429989999999993,9.2429989999999993,2.5,"No sig. difference"]
[{"$f":"OFFSET(J64,G6-1,F7,1,1)","v":"2005-2009"},"Year",null,null,null,{"$f":"F3","v":"Wales health boards"},{"$f":"VLOOKUP(F13,F16:H17,2,FALSE)","v":7},{"$f":"VLOOKUP(F13,F16:H17,3,FALSE)","v":24},33,{"$f":"H13+1","v":25},"Denbighshire","Males","2005-2009","Denbighshire_LE_Males_2005-2009_LA","Denbighshire",{"$f":"VLOOKUP($N13,'All Data'!$A:$L,P$8,FALSE)","v":" "},7.6459210000000004,{"$f":"VLOOKUP($N13,'All Data'!$A:$L,Q$8,FALSE)","v":7.6459210000000004},{"$f":"VLOOKUP($N13,'All Data'!$A:$L,S$8,FALSE)","v":-3.09605},{"$f":"VLOOKUP($N13,'All Data'!$A:$L,T$8,FALSE)","v":18.387889999999999},{"$f":"VLOOKUP($N13,'All Data'!$A:$L,U$8,FALSE)","v":10.741968999999997},{"$f":"VLOOKUP($N13,'All Data'!$A:$L,V$8,FALSE)","v":10.741970999999999},"No sig. difference",9.2429989999999993,9.2429989999999993,3.5,"No sig. difference"]
[{"$f":"INDEX(A28:B37,C3,2)","v":"LE"},"Short name",null,null,null,null,null,null,null,null,"Flintshire","Males","2005-2009","Flintshire_LE_Males_2005-2009_LA","Flintshire",{"$f":"VLOOKUP($N14,'All Data'!$A:$L,P$8,FALSE)","v":" "},7.4599970000000004,{"$f":"VLOOKUP($N14,'All Data'!$A:$L,Q$8,FALSE)","v":7.4599970000000004},{"$f":"VLOOKUP($N14,'All Data'!$A:$L,S$8,FALSE)","v":1.470987},{"$f":"VLOOKUP($N14,'All Data'!$A:$L,T$8,FALSE)","v":13.449009999999999},{"$f":"VLOOKUP($N14,'All Data'!$A:$L,U$8,FALSE)","v":5.989012999999999},{"$f":"VLOOKUP($N14,'All Data'!$A:$L,V$8,FALSE)","v":5.9890100000000004},"No sig. difference",9.2429989999999993,9.2429989999999993,4.5,"No sig. difference"]
[{"$f":"INDEX(A28:B37,C3,1)","v":"Inequality gap in life expectancy (SII in years)"},"Full name",null,null,null,null,"No of rows","start at row",null,null,"Wrexham","Males","2005-2009",{"$f":"K15 & \"_\" & $A$14 &\"_\"&$A$19&\"_\"&$A$13&\"_\"&\"LA\"","v":"Wrexham_LE_Males_2005-2009_LA"},"Wrexham",{"$f":"VLOOKUP($N15,'All Data'!$A:$L,P$8,FALSE)","v":" "},9.1770169999999993,{"$f":"VLOOKUP($N15,'All Data'!$A:$L,Q$8,FALSE)","v":9.1770169999999993},{"$f":"VLOOKUP($N15,'All Data'!$A:$L,S$8,FALSE)","v":5.5414770000000004},{"$f":"VLOOKUP($N15,'All Data'!$A:$L,T$8,FALSE)","v":12.81256},{"$f":"VLOOKUP($N15,'All Data'!$A:$L,U$8,FALSE)","v":3.6355430000000002},{"$f":"VLOOKUP($N15,'All Data'!$A:$L,V$8,FALSE)","v":3.6355399999999989},"No sig. difference",9.2429989999999993,9.2429989999999993,5.5,"No sig. difference"]
[{"$f":"INDEX(A28:F37,C3,6)","v":"all ages"},"Age range",null,null,null,"Wales health boards",7,24,null,null,"Powys","Males","2005-2009","Powys_LE_Males_2005-2009_LA","Powys",{"$f":"VLOOKUP($N16,'All Data'!$A:$L,P$8,FALSE)","v":" "},5.4724659999999998,{"$f":"VLOOKUP($N16,'All Data'!$A:$L,Q$8,FALSE)","v":5.4724659999999998},{"$f":"VLOOKUP($N16,'All Data'!$A:$L,S$8,FALSE)","v":-0.49527690000000002},{"$f":"VLOOKUP($N16,'All Data'!$A:$L,T$8,FALSE)","v":11.44021},{"$f":"VLOOKUP($N16,'All Data'!$A:$L,U$8,FALSE)","v":5.9677440000000006},{"$f":"VLOOKUP($N16,'All Data'!$A:$L,V$8,FALSE)","v":5.9677429000000002},"No sig. difference",9.2429989999999993,9.2429989999999993,6.5,"No sig. difference"]
[{"$f":"INDEX(A28:H37,C3,7)","v":0},"Stat",null,null,null,"Wales local authorities",22,0,null,null,"Ceredigion","Males","2005-2009","Ceredigion_LE_Males_2005-2009_LA","Ceredigion",{"$f":"VLOOKUP($N17,'All Data'!$A:$L,P$8,FALSE)","v":" "},7.6682649999999999,{"$f":"VLOOKUP($N17,'All Data'!$A:$L,Q$8,FALSE)","v":7.6682649999999999},{"$f":"VLOOKUP($N17,'All Data'!$A:$L,S$8,FALSE)","v":2.851477},{"$f":"VLOOKUP($N17,'All Data'!$A:$L,T$8,FALSE)","v":12.485049999999999},{"$f":"VLOOKUP($N17,'All Data'!$A:$L,U$8,FALSE)","v":4.8167849999999994},{"$f":"VLOOKUP($N17,'All Data'!$A:$L,V$8,FALSE)","v":4.8167879999999998},"No sig. difference",9.2429989999999993,9.2429989999999993,7.5,"No sig. difference"]
[{"$f":"IF(K54=\"TRUE\",\" \",INDEX(A28:H37,C3,8))","v":"SII in LE (95% CI)"},"Stat",null,null,null,null,null,null,"For decimal (chart ref to column Q or R)",null,"Pembrokeshire","Males","2005-2009","Pembrokeshire_LE_Males_2005-2009_LA","Pembrokeshire",{"$f":"VLOOKUP($N18,'All Data'!$A:$L,P$8,FALSE)","v":" "},5.9476430000000002,{"$f":"VLOOKUP($N18,'All Data'!$A:$L,Q$8,FALSE)","v":5.9476430000000002},{"$f":"VLOOKUP($N18,'All Data'!$A:$L,S$8,FALSE)","v":-2.4788670000000002},{"$f":"VLOOKUP($N18,'All Data'!$A:$L,T$8,FALSE)","v":14.37415},{"$f":"VLOOKUP($N18,'All Data'!$A:$L,U$8,FALSE)","v":8.4265070000000009},{"$f":"VLOOKUP($N18,'All Data'!$A:$L,V$8,FALSE)","v":8.4265100000000004},"No sig. difference",9.2429989999999993,9.2429989999999993,8.5,"No sig. difference"]
[{"$f":"OFFSET(J57,G20-1,F21,1,1)","v":"Males"},"Sex",null,null,null,"Sex selection",null,null,null,null,"Carmarthenshire","Males","2005-2009","Carmarthenshire_LE_Males_2005-2009_LA","Carmarthenshire",{"$f":"VLOOKUP($N19,'All Data'!$A:$L,P$8,FALSE)","v":" "},5.7528119999999996,{"$f":"VLOOKUP($N19,'All Data'!$A:$L,Q$8,FALSE)","v":5.7528119999999996},{"$f":"VLOOKUP($N19,'All Data'!$A:$L,S$8,FALSE)","v":-0.47629850000000001},{"$f":"VLOOKUP($N19,'All Data'!$A:$L,T$8,FALSE)","v":11.981920000000001},{"$f":"VLOOKUP($N19,'All Data'!$A:$L,U$8,FALSE)","v":6.229108000000001},{"$f":"VLOOKUP($N19,'All Data'!$A:$L,V$8,FALSE)","v":6.2291105},"No sig. difference",9.2429989999999993,9.2429989999999993,9.5,"No sig. difference"]
[{"$f":"IF(A14=\"CONCEP\",0,LOWER(A19))","v":"males"},"Sex",null,null,null,{"$f":"HLOOKUP(A15,$J$56:$V$72,5,FALSE)","v":0},1,null,{"$f":"VLOOKUP(A15,A28:I37,9,FALSE)","v":1},null,"Swansea","Males","2005-2009","Swansea_LE_Males_2005-2009_LA","Swansea",{"$f":"VLOOKUP($N20,'All Data'!$A:$L,P$8,FALSE)","v":" "},12.17048,{"$f":"VLOOKUP($N20,'All Data'!$A:$L,Q$8,FALSE)","v":12.17048},{"$f":"VLOOKUP($N20,'All Data'!$A:$L,S$8,FALSE)","v":9.2075390000000006},{"$f":"VLOOKUP($N20,'All Data'!$A:$L,T$8,FALSE)","v":15.133419999999999},{"$f":"VLOOKUP($N20,'All Data'!$A:$L,U$8,FALSE)","v":2.9629399999999997},{"$f":"VLOOKUP($N20,'All Data'!$A:$L,V$8,FALSE)","v":2.9629409999999989},"No sig. difference",9.2429989999999993,9.2429989999999993,10.5,"No sig. difference"]
[{"$f":"VLOOKUP(A15,A28:J37,9,FALSE)","v":1},"Decimal places",null,null,null,{"$f":"HLOOKUP(A15,$J$56:$V$72,6,FALSE)","v":1},{"$f":"INDEX(Option3sex,G20)","v":"Males"},null,null,null,"Neath Port Talbot","Males","2005-2009","Neath Port Talbot_LE_Males_2005-2009_LA","Neath Port Talbot",{"$f":"VLOOKUP($N21,'All Data'!$A:$L,P$8,FALSE)","v":" "},10.415850000000001,{"$f":"VLOOKUP($N21,'All Data'!$A:$L,Q$8,FALSE)","v":10.415850000000001},{"$f":"VLOOKUP($N21,'All Data'!$A:$L,S$8,FALSE)","v":7.9771660000000004},{"$f":"VLOOKUP($N21,'All Data'!$A:$L,T$8,FALSE)","v":12.85454},{"$f":"VLOOKUP($N21,'All Data'!$A:$L,U$8,FALSE)","v":2.4386899999999994},{"$f":"VLOOKUP($N21,'All Data'!$A:$L,V$8,FALSE)","v":2.4386840000000003},"No sig. difference",9.2429989999999993,9.2429989999999993,11.5,"No sig. difference"]
[{"$f":"VLOOKUP(A15,A28:J37,10,FALSE)","v":"Not colouring"},null,null,null,null,{"$f":"HLOOKUP(A15,$J$56:$V$72,7,FALSE)","v":3},null,null,null,null,"Bridgend","Males","2005-2009","Bridgend_LE_Males_2005-2009_LA","Bridgend",{"$f":"VLOOKUP($N22,'All Data'!$A:$L,P$8,FALSE)","v":" "},7.8449989999999996,{"$f":"VLOOKUP($N22,'All Data'!$A:$L,Q$8,FALSE)","v":7.8449989999999996},{"$f":"VLOOKUP($N22,'All Data'!$A:$L,S$8,FALSE)","v":4.0547209999999998},{"$f":"VLOOKUP($N22,'All Data'!$A:$L,T$8,FALSE)","v":11.63528},{"$f":"VLOOKUP($N22,'All Data'!$A:$L,U$8,FALSE)","v":3.7902810000000002},{"$f":"VLOOKUP($N22,'All Data'!$A:$L,V$8,FALSE)","v":3.7902779999999998},"No sig. difference",9.2429989999999993,9.2429989999999993,12.5,"No sig. difference"]
[{"$f":"VLOOKUP(A15,$A$57:$C$67,2,FALSE)","v":{"$error":"#N/A"}},"Min",null,null,null,{"$f":"HLOOKUP(A15,$J$56:$V$72,8,FALSE)","v":1},null,null,null,null,"The Vale of Glamorgan","Males","2005-2009","The Vale of Glamorgan_LE_Males_2005-2009_LA","The Vale of Glamorgan",{"$f":"VLOOKUP($N23,'All Data'!$A:$L,P$8,FALSE)","v":" "},7.5126790000000003,{"$f":"VLOOKUP($N23,'All Data'!$A:$L,Q$8,FALSE)","v":7.5126790000000003},{"$f":"VLOOKUP($N23,'All Data'!$A:$L,S$8,FALSE)","v":3.1381389999999998},{"$f":"VLOOKUP($N23,'All Data'!$A:$L,T$8,FALSE)","v":11.887219999999999},{"$f":"VLOOKUP($N23,'All Data'!$A:$L,U$8,FALSE)","v":4.3745409999999989},{"$f":"VLOOKUP($N23,'All Data'!$A:$L,V$8,FALSE)","v":4.3745400000000005},"No sig. difference",9.2429989999999993,9.2429989999999993,13.5,"No sig. difference"]
[{"$f":"VLOOKUP(A15,$A$57:$C$67,3,FALSE)","v":{"$error":"#N/A"}},"Max",null,null,null,null,null,null,null,null,"Cardiff","Males","2005-2009","Cardiff_LE_Males_2005-2009_LA","Cardiff",{"$f":"VLOOKUP($N24,'All Data'!$A:$L,P$8,FALSE)","v":" "},12.845470000000001,{"$f":"VLOOKUP($N24,'All Data'!$A:$L,Q$8,FALSE)","v":12.845470000000001},{"$f":"VLOOKUP($N24,'All Data'!$A:$L,S$8,FALSE)","v":10.99283},{"$f":"VLOOKUP($N24,'All Data'!$A:$L,T$8,FALSE)","v":14.69811},{"$f":"VLOOKUP($N24,'All Data'!$A:$L,U$8,FALSE)","v":1.8526399999999992},{"$f":"VLOOKUP($N24,'All Data'!$A:$L,V$8,FALSE)","v":1.852640000000001},"Sig. high",9.2429989999999993,9.2429989999999993,14.5,"Sig. high"]
[null,null,null,null,null,null,null,null,null,null,"Rhondda Cynon Taf","Males","2005-2009","Rhondda Cynon Taf_LE_Males_2005-2009_LA","Rhondda Cynon Taf",{"$f":"VLOOKUP($N25,'All Data'!$A:$L,P$8,FALSE)","v":" "},7.9250939999999996,{"$f":"VLOOKUP($N25,'All Data'!$A:$L,Q$8,FALSE)","v":7.9250939999999996},{"$f":"VLOOKUP($N25,'All Data'!$A:$L,S$8,FALSE)","v":5.2450979999999996},{"$f":"VLOOKUP($N25,'All Data'!$A:$L,T$8,FALSE)","v":10.605090000000001},{"$f":"VLOOKUP($N25,'All Data'!$A:$L,U$8,FALSE)","v":2.6799960000000009},{"$f":"VLOOKUP($N25,'All Data'!$A:$L,V$8,FALSE)","v":2.679996},"No sig. difference",9.2429989999999993,9.2429989999999993,15.5,"No sig. difference"]
[null,null,null,null,null,null,"Statistic",null,null,null,"Merthyr Tydfil","Males","2005-2009","Merthyr Tydfil_LE_Males_2005-2009_LA","Merthyr Tydfil",{"$f":"VLOOKUP($N26,'All Data'!$A:$L,P$8,FALSE)","v":" "},9.3745329999999996,{"$f":"VLOOKUP($N26,'All Data'!$A:$L,Q$8,FALSE)","v":9.3745329999999996},{"$f":"VLOOKUP($N26,'All Data'!$A:$L,S$8,FALSE)","v":5.005026},{"$f":"VLOOKUP($N26,'All Data'!$A:$L,T$8,FALSE)","v":13.74404},{"$f":"VLOOKUP($N26,'All Data'!$A:$L,U$8,FALSE)","v":4.3695070000000005},{"$f":"VLOOKUP($N26,'All Data'!$A:$L,V$8,FALSE)","v":4.3695069999999996},"No sig. difference",9.2429989999999993,9.2429989999999993,16.5,"No sig. difference"]
["Values for list ","Abbrev.","Source","Produced by statement","Type","Age","For title text","column header","Decimals to display","Colour coding","Caerphilly","Males","2005-2009","Caerphilly_LE_Males_2005-2009_LA","Caerphilly",{"$f":"VLOOKUP($N27,'All Data'!$A:$L,P$8,FALSE)","v":" "},8.4935559999999999,{"$f":"VLOOKUP($N27,'All Data'!$A:$L,Q$8,FALSE)","v":8.4935559999999999},{"$f":"VLOOKUP($N27,'All Data'!$A:$L,S$8,FALSE)","v":5.9764549999999996},{"$f":"VLOOKUP($N27,'All Data'!$A:$L,T$8,FALSE)","v":11.01066},{"$f":"VLOOKUP($N27,'All Data'!$A:$L,U$8,FALSE)","v":2.5171039999999998},{"$f":"VLOOKUP($N27,'All Data'!$A:$L,V$8,FALSE)","v":2.5171010000000003},"No sig. difference",9.2429989999999993,9.2429989999999993,17.5,"No sig. difference"]
["Inequality gap in life expectancy (SII in years)","LE","Source: ADDE & MYE (ONS), WIMD 2008 (WG)","Produced by Public Health Wales Observatory, using ADDE & MYE (ONS), WIMD 2008 (WG)",{"$f":"\" \"","v":" "},"all ages",null,"SII in LE (95% CI)",1,"Not colouring","Blaenau Gwent","Males","2005-2009","Blaenau Gwent_LE_Males_2005-2009_LA","Blaenau Gwent",{"$f":"VLOOKUP($N28,'All Data'!$A:$L,P$8,FALSE)","v":" "},2.646846,{"$f":"VLOOKUP($N28,'All Data'!$A:$L,Q$8,FALSE)","v":2.646846},{"$f":"VLOOKUP($N28,'All Data'!$A:$L,S$8,FALSE)","v":-3.1136550000000001},{"$f":"VLOOKUP($N28,'All Data'!$A:$L,T$8,FALSE)","v":8.4073469999999997},{"$f":"VLOOKUP($N28,'All Data'!$A:$L,U$8,FALSE)","v":5.7605009999999996},{"$f":"VLOOKUP($N28,'All Data'!$A:$L,V$8,FALSE)","v":5.7605009999999996},"Sig. low",9.2429989999999993,9.2429989999999993,18.5,"Sig. low"]
["Proportion of population free from a common mental disorder (as measured by a Mental Health Inventory 5 score > 60) ","MENT","Source: Welsh Health Survey","Produced by Public Health Wales Observatory, using Welsh Health Survey (WG)",{"$f":"\" \"","v":" "},"aged 16+",null,"Mental health score (95% CI)",0,"Reverse","Torfaen","Males","2005-2009","Torfaen_LE_Males_2005-2009_LA","Torfaen",{"$f":"VLOOKUP($N29,'All Data'!$A:$L,P$8,FALSE)","v":" "},7.3051440000000003,{"$f":"VLOOKUP($N29,'All Data'!$A:$L,Q$8,FALSE)","v":7.3051440000000003},{"$f":"VLOOKUP($N29,'All Data'!$A:$L,S$8,FALSE)","v":4.6733919999999998},{"$f":"VLOOKUP($N29,'All Data'!$A:$L,T$8,FALSE)","v":9.9368960000000008},{"$f":"VLOOKUP($N29,'All Data'!$A:$L,U$8,FALSE)","v":2.6317520000000005},{"$f":"VLOOKUP($N29,'All Data'!$A:$L,V$8,FALSE)","v":2.6317520000000005},"No sig. difference",9.2429989999999993,9.2429989999999993,19.5,"No sig. difference"]
["Proportion of adults who reported being a current smoker","Smo","Source: WHS (WG)","Produced by Public Health Wales Observatory, using Welsh Health Survey (WG)"," ","aged 16+","age-standardised percentage","Age-standardised percentage (95% CI)",0,"Sig high = worse","Monmouthshire","Males","2005-2009","Monmouthshire_LE_Males_2005-2009_LA","Monmouthshire",{"$f":"VLOOKUP($N30,'All Data'!$A:$L,P$8,FALSE)","v":" "},5.8893380000000004,{"$f":"VLOOKUP($N30,'All Data'!$A:$L,Q$8,FALSE)","v":5.8893380000000004},{"$f":"VLOOKUP($N30,'All Data'!$A:$L,S$8,FALSE)","v":4.4028770000000002},{"$f":"VLOOKUP($N30,'All Data'!$A:$L,T$8,FALSE)","v":7.3757989999999998},{"$f":"VLOOKUP($N30,'All Data'!$A:$L,U$8,FALSE)","v":1.4864609999999994},{"$f":"VLOOKUP($N30,'All Data'!$A:$L,V$8,FALSE)","v":1.4864610000000003},"Sig. low",9.2429989999999993,9.2429989999999993,20.5,"Sig. low"]
["Average days with 30 minutes moderate or vigorous physical activity (capped)","ACT","Source: Welsh Health Survey","Produced by Public Health Wales Observatory, using Welsh Health Survey (WG)"," ","aged 16+","age-standardised","Age-standardised days (95% CI)",1,"Reverse","Newport",{"$f":"$A$19","v":"Males"},"2005-2009","Newport_LE_Males_2005-2009_LA","Newport",{"$f":"VLOOKUP($N31,'All Data'!$A:$L,P$8,FALSE)","v":" "},11.030279999999999,{"$f":"VLOOKUP($N31,'All Data'!$A:$L,Q$8,FALSE)","v":11.030279999999999},{"$f":"VLOOKUP($N31,'All Data'!$A:$L,S$8,FALSE)","v":9.4929000000000006},{"$f":"VLOOKUP($N31,'All Data'!$A:$L,T$8,FALSE)","v":12.56765},{"$f":"VLOOKUP($N31,'All Data'!$A:$L,U$8,FALSE)","v":1.537370000000001},{"$f":"VLOOKUP($N31,'All Data'!$A:$L,V$8,FALSE)","v":1.5373799999999989},"Sig. high",9.2429989999999993,9.2429989999999993,21.5,"Sig. high"]
["Proportion of adults who reported eating five portions of fruit and vegetables the previous day","FRU","Source: Welsh Health Survey","Produced by Public Health Wales Observatory, using Welsh Health Survey (WG)"," ","aged 16+","age-standardised","Age-standardised percentage (95% CI)",0,"Reverse",null,null,null,null,null,null,null,null,null,null,null,null,null,9.2429989999999993,9.2429989999999993,22.5]
["Proportion of adults who reported being obese or overweight (Body Mass Index >= 25)","OBE","Source: Welsh Health Survey","Produced by Public Health Wales Observatory, using Welsh Health Survey (WG)"," ","aged 16+","age-standardised","Age-standardised percentage (95% CI)",0,"Sig high = worse",null,null,null,null,null,null,null,null,null,null,null,null,null,9.2429989999999993,9.2429989999999993,23.5]
["Alcohol-specific hospital admissions (person-based)","ALC","Source: PEDW (NWIS) & MYE (ONS)","Produced by Public Health Wales Observatory, using PEDW (NWIS) & MYE (ONS)","Number of admissions","all ages","European age-standardised rate per 100,000","EASR per 100,000 (95% CI)",0,"Sig high = worse","Betsi Cadwaladr UHB",{"$f":"$A$19","v":"Males"},{"$f":"$A$13","v":"2005-2009"},{"$f":"K34 & \"_\" & $A$14&\"_\"&$A$19&\"_\"&$A$13&\"_\"&\"HB\"","v":"Betsi Cadwaladr UHB_LE_Males_2005-2009_HB"},"Betsi Cadwaladr UHB",{"$f":"VLOOKUP($N34,'All Data'!$A:$L,P$8,FALSE)","v":" "},7.1881979999999999,{"$f":"VLOOKUP($N34,'All Data'!$A:$L,Q$8,FALSE)","v":7.1881979999999999},{"$f":"VLOOKUP($N34,'All Data'!$A:$L,S$8,FALSE)","v":2.8664239999999999},{"$f":"VLOOKUP($N34,'All Data'!$A:$L,T$8,FALSE)","v":11.509969999999999},{"$f":"VLOOKUP($N34,'All Data'!$A:$L,U$8,FALSE)","v":4.3217719999999993},{"$f":"VLOOKUP($N34,'All Data'!$A:$L,V$8,FALSE)","v":4.3217739999999996},"No sig. difference",9.2429989999999993,9.2429989999999993,24.5,"No sig. difference"]
["Rate of conceptions among females aged under 18 per 1,000 females aged 15-17","CONCEP","Source: Conceptions data & MYE (ONS)","Produced by Public Health Wales Observatory, using Conceptions data & MYE (ONS)","Number of conceptions",null,null,"Conception rate (95% CI)",0,"Sig high = worse","Powys THB",{"$f":"$A$19","v":"Males"},{"$f":"$A$13","v":"2005-2009"},{"$f":"K35 & \"_\" & $A$14&\"_\"&$A$19&\"_\"&$A$13&\"_\"&\"HB\"","v":"Powys THB_LE_Males_2005-2009_HB"},"Powys THB",{"$f":"VLOOKUP($N35,'All Data'!$A:$L,P$8,FALSE)","v":" "},5.4724659999999998,{"$f":"VLOOKUP($N35,'All Data'!$A:$L,Q$8,FALSE)","v":5.4724659999999998},{"$f":"VLOOKUP($N35,'All Data'!$A:$L,S$8,FALSE)","v":-0.49527690000000002},{"$f":"VLOOKUP($N35,'All Data'!$A:$L,T$8,FALSE)","v":11.44021},{"$f":"VLOOKUP($N35,'All Data'!$A:$L,U$8,FALSE)","v":5.9677440000000006},{"$f":"VLOOKUP($N35,'All Data'!$A:$L,V$8,FALSE)","v":5.9677429000000002},"No sig. difference",9.2429989999999993,9.2429989999999993,25.5,"No sig. difference"]
["Admissions for hip fractures","HIP","Source: PEDW (NWIS) & MYE (ONS)","Produced by Public Health Wales Observatory, using PEDW (NWIS) & MYE (ONS)","Number of admissions","aged 65+","European age-standardised rate per 100,000","EASR per 100,000 (95% CI)",0,"Sig high = worse","Hywel Dda HB","Males","2005-2009","Hywel Dda HB_LE_Males_2005-2009_HB","Hywel Dda HB",{"$f":"VLOOKUP($N36,'All Data'!$A:$L,P$8,FALSE)","v":" "},6.83758,{"$f":"VLOOKUP($N36,'All Data'!$A:$L,Q$8,FALSE)","v":6.83758},{"$f":"VLOOKUP($N36,'All Data'!$A:$L,S$8,FALSE)","v":2.2331889999999999},{"$f":"VLOOKUP($N36,'All Data'!$A:$L,T$8,FALSE)","v":11.44197},{"$f":"VLOOKUP($N36,'All Data'!$A:$L,U$8,FALSE)","v":4.6043899999999995},{"$f":"VLOOKUP($N36,'All Data'!$A:$L,V$8,FALSE)","v":4.6043909999999997},"No sig. difference",9.2429989999999993,9.2429989999999993,26.5,"No sig. difference"]
["Uptake of scheduled childhood vaccinations","VACC","Source: NCCHD","Produced by Public Health Wales Observatory, using NCCHD",{"$f":"\" \"","v":" "},null,"percentage","Percentage (95% CI)",0,"Reverse","ABM UHB","Males","2005-2009","ABM UHB_LE_Males_2005-2009_HB","ABM UHB",{"$f":"VLOOKUP($N37,'All Data'!$A:$L,P$8,FALSE)","v":" "},10.376010000000001,{"$f":"VLOOKUP($N37,'All Data'!$A:$L,Q$8,FALSE)","v":10.376010000000001},{"$f":"VLOOKUP($N37,'All Data'!$A:$L,S$8,FALSE)","v":8.9340499999999992},{"$f":"VLOOKUP($N37,'All Data'!$A:$L,T$8,FALSE)","v":11.817959999999999},{"$f":"VLOOKUP($N37,'All Data'!$A:$L,U$8,FALSE)","v":1.4419499999999985},{"$f":"VLOOKUP($N37,'All Data'!$A:$L,V$8,FALSE)","v":1.4419600000000017},"No sig. difference",9.2429989999999993,9.2429989999999993,27.5,"No sig. difference"]
[null,null,null,null,null,null,null,null,null,null,"Cardiff & Vale UHB","Males","2005-2009","Cardiff & Vale UHB_LE_Males_2005-2009_HB","Cardiff & Vale UHB",{"$f":"VLOOKUP($N38,'All Data'!$A:$L,P$8,FALSE)","v":" "},11.813980000000001,{"$f":"VLOOKUP($N38,'All Data'!$A:$L,Q$8,FALSE)","v":11.813980000000001},{"$f":"VLOOKUP($N38,'All Data'!$A:$L,S$8,FALSE)","v":8.5326319999999996},{"$f":"VLOOKUP($N38,'All Data'!$A:$L,T$8,FALSE)","v":15.095319999999999},{"$f":"VLOOKUP($N38,'All Data'!$A:$L,U$8,FALSE)","v":3.2813399999999984},{"$f":"VLOOKUP($N38,'All Data'!$A:$L,V$8,FALSE)","v":3.2813480000000013},"No sig. difference",9.2429989999999993,9.2429989999999993,28.5,"No sig. difference"]
[null,null,null,null,null,null,null,null,null,null,"Cwm Taf HB","Males","2005-2009","Cwm Taf HB_LE_Males_2005-2009_HB","Cwm Taf HB",{"$f":"VLOOKUP($N39,'All Data'!$A:$L,P$8,FALSE)","v":" "},8.0229199999999992,{"$f":"VLOOKUP($N39,'All Data'!$A:$L,Q$8,FALSE)","v":8.0229199999999992},{"$f":"VLOOKUP($N39,'All Data'!$A:$L,S$8,FALSE)","v":6.9267849999999997},{"$f":"VLOOKUP($N39,'All Data'!$A:$L,T$8,FALSE)","v":9.1190549999999995},{"$f":"VLOOKUP($N39,'All Data'!$A:$L,U$8,FALSE)","v":1.0961350000000003},{"$f":"VLOOKUP($N39,'All Data'!$A:$L,V$8,FALSE)","v":1.0961349999999994},"Sig. low",9.2429989999999993,9.2429989999999993,29.5,"Sig. low"]
[null,null,null,null,null,null,null,null,null,null,"Aneurin Bevan HB","Males","2005-2009","Aneurin Bevan HB_LE_Males_2005-2009_HB","Aneurin Bevan HB",{"$f":"VLOOKUP($N40,'All Data'!$A:$L,P$8,FALSE)","v":" "},8.8347110000000004,{"$f":"VLOOKUP($N40,'All Data'!$A:$L,Q$8,FALSE)","v":8.8347110000000004},{"$f":"VLOOKUP($N40,'All Data'!$A:$L,S$8,FALSE)","v":7.233314},{"$f":"VLOOKUP($N40,'All Data'!$A:$L,T$8,FALSE)","v":10.436109999999999},{"$f":"VLOOKUP($N40,'All Data'!$A:$L,U$8,FALSE)","v":1.6013989999999989},{"$f":"VLOOKUP($N40,'All Data'!$A:$L,V$8,FALSE)","v":1.6013970000000004},"No sig. difference",9.2429989999999993,9.2429989999999993,30.5,"No sig. difference"]
[null,null,null,{"$f":"OFFSET('Interactive controls'!$X$9,'Interactive controls'!$H$13,'Interactive controls'!$I$20,'Interactive controls'!$G$13,1)","v":{"$error":"#VALUE!"}},null,null,null,null,null,null,"Wales","Males","2005-2009",{"$f":"K41 & \"_\"& $A$14 &\"_\"&$A$19&\"_\"&$A$13&\"_\"&\"Wales\"","v":"Wales_LE_Males_2005-2009_Wales"},"Wales",{"$f":"VLOOKUP($N41,'All Data'!$A:$L,P$8,FALSE)","v":" "},9.2429989999999993,{"$f":"VLOOKUP($N41,'All Data'!$A:$L,Q$8,FALSE)","v":9.2429989999999993},{"$f":"VLOOKUP($N41,'All Data'!$A:$L,S$8,FALSE)","v":6.8385160000000003},{"$f":"VLOOKUP($N41,'All Data'!$A:$L,T$8,FALSE)","v":11.64748},{"$f":"VLOOKUP($N41,'All Data'!$A:$L,U$8,FALSE)","v":2.4044810000000005},{"$f":"VLOOKUP($N41,'All Data'!$A:$L,V$8,FALSE)","v":2.404482999999999},0,9.2429989999999993,{"$f":"X41","v":9.2429989999999993},31]
["For selection box title:"]
["Inequality gap in life expectancy (SII)",null,null,null,null,null,null,null,null,"Chart title",{"$f":"IF(K54=\"TRUE\",\"Selection criteria invalid, please select other period or sex\",A15&\", \"&IF(A17=0, \"\",A17&\", \")&IF(A20=0,\"\",A20&\", \")&IF(A16=0,\"\",A16&\", \")&IF(F13=0,\"\",F13&\", \")&IF(A13=0,\"\",A13))","v":"Inequality gap in life expectancy (SII in years), males, all ages, Wales health boards, 2005-2009"}]
["Free from a common mental disorder (%)",null,null,"Data source: National Community Child Health Database (May 2012 refresh)",null,null,null,null,null,"Wales label",{"$f":"IFERROR(IF(ROUND(X10,A21)>0,\"\"),\"Unavailable\")","v":""},null,null,null,{"$f":"OFFSET('Interactive controls'!$X$9,'Interactive controls'!$J$13,'Interactive controls'!$I$20,'Interactive controls'!$I$13,1)","v":0},null,null,{"$f":"OFFSET('Interactive controls'!$X$9,0,'Interactive controls'!$I$20,'Interactive controls'!$I$13,1)","v":{"$error":"#VALUE!"}}]
["Currently smoking (%)",null,null,null,null,null,null,null,null,"Source",{"$f":"IF(K54=\"TRUE\",\" \",IF(INDEX(A28:C37,C3,3)=0,\"Unavailable\",INDEX(A28:C37,C3,3)))","v":"Source: ADDE & MYE (ONS), WIMD 2008 (WG)"}]
["Average days with 30 min physical activity",null,null,null,null,null,null,null,null,"Chart source",{"$f":"IF(K54=\"TRUE\",\" \",IF(INDEX(A28:D37,C3,4)=0,\"Unavailable\",INDEX(A28:D37,C3,4)))","v":"Produced by Public Health Wales Observatory, using ADDE & MYE (ONS), WIMD 2008 (WG)"}]
["Eating five fruit/veg per day (%)",null,null,null,null,null,null,null,null,"Table column",{"$f":"IF(K54=\"TRUE\",\" \",VLOOKUP(A15,A28:H37,5,FALSE))","v":" "}]
["Overweight or obese (%)",null,null,null,null,null,null,null,null,"Table title",{"$f":"IF(K54=\"TRUE\",\"Selection criteria invalid, please select other period or sex\",A15&\", \"&IF(A17=0, \"\",A17&\", \")&IF(A20=0,\"\",A20&\", \")&IF(A16=0,\"\",A16&\", \")&\"Wales health boards and local authorities\"&\", \"&IF(A13=0,\"\",A13))","v":"Inequality gap in life expectancy (SII in years), males, all ages, Wales health boards and local authorities, 2005-2009"}]
["Alcohol-specific hospital admissions",null,null,null,null,null,null,null,null,"Table column 3 title",{"$f":"IF(K54=\"TRUE\",\" \",\"Compared to Wales*\")","v":"Compared to Wales*"}]
["Conceptions aged under 18",null,null,null,null,null,null,null,null,"Option 2 title 1",{"$f":"IF(K54=\"TRUE\",\"Selection criteria invalid, please select other period or sex\",A15&\", \"&IF(A17=0, \"\",A17&\", \")&IF(A20=0,\"\",A20&\", \")&IF(A16=0,\"\",A16&\", \")&\"Wales local authorities\"&\", \"&IF(A13=0,\"\",A13))","v":"Inequality gap in life expectancy (SII in years), males, all ages, Wales local authorities, 2005-2009"}]
["Hospital admissions for hip fracture 65+",null,null,null,null,null,null,null,null,"Option 2 title 2",{"$f":"IF(K54=\"TRUE\",\"Selection criteria invalid, please select other period or sex\",A15&\", \"&IF(A17=0, \"\",A17&\", \")&IF(A20=0,\"\",A20&\", \")&IF(A16=0,\"\",A16&\", \")&\"Wales health boards\"&\", \"&IF(A13=0,\"\",A13))","v":"Inequality gap in life expectancy (SII in years), males, all ages, Wales health boards, 2005-2009"}]
["Childhood vaccinations uptake (%)",null,null,null,null,null,null,null,null,"legend",{"$f":"IF(OR(C3=1),\"\",\"95% confidence interval\")","v":""}]
[]
[null,null,null,null,null,null,null,null,null,"Test if selection is valid",{"$f":"IFERROR(Q10,\"TRUE\")","v":6.8199509999999997}]
[]
["X-AXIS","Min","Max",null,null,null,"This section is for use with 'Define Name' section on the 'Formulas' tab",null,null,"Sloping index of inequality (SII) in healthy life expectancy (HLE)","Inequality gap in life expectancy (SII in years)","Proportion of adults who reported being a current smoker","Average days with 30 minutes moderate or vigorous physical activity (capped)","Proportion of adults who reported eating five portions of fruit and vegetables the previous day","Proportion of adults who reported being obese or overweight (Body Mass Index >= 25)","Alcohol-specific hospital admissions (person-based)","Rate of conceptions among females aged under 18 per 1,000 females aged 15-17","Gap between the employment rate for those with a limiting long-term health condition and the overall employment rate","Uptake of scheduled childhood vaccinations","Proportion of population free from a common mental disorder (as measured by a Mental Health Inventory 5 score > 60) ","Admissions for hip fractures","Proportion free from a mental health disorder"]
["Slope index of inequality (SII) in healthy life expectancy (HLE)",-10,30,null,null,null,null,"Sex                   (formula name: Option3sex)","Variables","Males","Males","Persons","Persons","Persons","Persons","Males","Females","Persons","Children at age 4","Persons","Males","Persons"]
["Percentage of adults who reported being a current smoker",0,100,null,null,null,null,null,null,"Females","Females",null,null,null,null,"Females",null,null,null,null,"Females"]
["Inequality gap in life expectancy (SII)",-10,30,null,null,null,null,null,null,null,null,null,null,null,null,"Persons",null,null,null,null,"Persons"]
["Average days with 30 minutes physical activity",0,10,null,null,null,null,null,"Rows offset",0,0,0,0,0,0,0,0,0,0,0,0,0]
["Proportion of adults eating five portions of fruit and vegetables per day",0,100,null,null,null,null,null,"Columns offset",0,1,2,3,4,5,6,7,8,9,10,11,12]
["Proportion of adults obese or overweight (body mass index > 25)",0,100,null,null,null,null,null,"No rows",3,3,3,3,3,3,3,3,3,3,3,3,3]
["Alcohol-specific admissions to hospital",0,1000,null,null,null,null,null,"No columns",1,1,1,1,1,1,1,1,1,1,1,1,1]
["Rate of conceptions among females aged under 18",0,100,null,null,null,null,"Year            (formula name: Option3Year)","Variables","2005-2009","2005-2009","2009-2010","2009-2010","2009-2010","2009-2010",2010,2010,2005,"2011-2012 (FY)","2009-2010",2010,"2009-2010"]
["Uptake of scheduled childhood vaccinations",0,100,null,null,null,null,null,null,null,null,null,null,null,null,null,null,2006]
["Proportion free from a mental health disorder",0,100,null,null,null,null,null,null,null,null,null,null,null,null,null,null,2007]
["Admissions due to hip fractures",0,1000,null,null,null,null,null,null,null,null,null,null,null,null,null,null,2008]
[null,null,null,null,null,null,null,null,null,null,null,null,null,null,null,null,null,2009]
[null,null,null,null,null,null,null,null,"Rows offset",0,0,0,0,0,0,0,0,0,0,0,0,0]
[null,null,null,null,null,null,null,null,"Columns offset",0,1,2,3,4,5,6,7,8,9,10,11,12]
[null,null,null,null,null,null,null,null,"No rows",5,5,5,5,5,5,5,5,5,5,5,5,5]
[null,null,null,null,null,null,null,null,"No columns",1,1,1,1,1,1,1,1,1,1,1,1,1]
[]
[]
["Uptake of scheduled childhood vaccinations"]

{"sheet":"Copy tables and charts","index":5,"n_rows":35,"n_cols":13,"rows_kept":35,"cut":false,"hidden":false,"merged":[]}
[]
[null,null,null,null,null,null,null,null,null,null,null,null,"Figure 1"]
[]
[]
[]
[]
["Copying and pasting charts and tables to use in documents, reports or presentations"]
[]
["Why use this method to copy and paste charts "]
["If the standard {Copy} and {Paste} option is used for inserting Excel charts into documents, reports"]
["or presentations then frequently the chart will lose some of its formatting and/or the axes labels may be"]
["truncated. Similarly, table column sizes are often distorted using the standard {Copy} and {Paste}"]
["method if a table is too wide. The technique descibed below overcomes these issues."]
[]
["Copying and pasting a chart"]
[1,"Select the chart you want to copy by left clicking on it once i.e. so that the surronding points are "]
[null,"displayed "]
[2,"On the 'Home' tab click the paste icon"]
[3,"Click 'As picture' option and 'Copy as picture' (see figure 1)"]
[4,"Choose 'As shown on screen' and 'picture'"]
[5,"Using your mouse click on the point where you want to insert a copy of the chart e.g. in a Word "]
[null,"document / presentation"]
[6,"On the 'Home' tab click 'paste' then 'paste special' and choose to insert as 'Picture (enhanced metafile)' "]
[]
[null,null,null,null,null,null,null,null,null,null,null,null,"Figure 2"]
[]
["Copying and pasting a table as a picture"]
[1,"Highlight the table you want to copy by left clicking on the top left hand corner "]
[null,"and dragging the mouse to the bottom right corner. "]
[2,"On the 'Home' tab click the paste icon"]
[3,"Click 'As picture' option and 'Copy as picture' (see figure 2)"]
[4,"Choose 'As shown on screen' and 'picture'"]
[5,"Using your mouse click on the point where you want to insert a copy of the chart e.g. in a Word "]
[null,"document / presentation"]
[6,"On the 'Home' tab click 'paste' then 'paste special' and choose to insert as 'Picture (enhanced metafile)' "]

{"sheet":"Overview (controls)","index":6,"n_rows":36,"n_cols":38,"rows_kept":36,"cut":false,"hidden":true,"merged":[[2,1,3,1]]}
[null,null,9,10,9,10,9,10,9,10,9,10,9,10,9,10,9,10,9,10,9,10,9,10,9,10,9,10,9,10,9,10,9,10,9,10,9,10]
[null,null,"HLE","HLE","HLE","HLE","LE","LE","LE","LE","MENT","MENT","EMP","EMP","SMO","SMO","ACT","ACT","FRU","FRU","OBE","OBE","ALC","ALC","ALC","ALC","ALC","ALC","CONCEP","CONCEP","HIP","HIP","HIP","HIP","HIP","HIP","VACC","VACC"]
[null,"Complete green sections","Males","Males","Females","Females","Males","Males","Females","Females","Persons","Persons","Persons","Persons","Persons","Persons","Persons","Persons","Persons","Persons","Persons","Persons","Persons","Persons","Males","Males","Females","Females","Females","Females","Persons","Persons","Males","Males","Females","Females","Children at age 4","Children at age 4"]
[null,null,"2005-2009","2005-2009","2005-2009","2005-2009","2005-2009","2005-2009","2005-2009","2005-2009","2009-2010","2009-2010","2009-2010","2009-2010","2009-2010","2009-2010","2009-2010","2009-2010","2009-2010","2009-2010","2009-2010","2009-2010",2010,2010,2010,2010,2010,2010,2010,2010,2010,2010,2010,2010,2010,2010,"2011-2012 (FY)","2011-2012 (FY)"]
[null,null,"LCL","UCL","LCL","UCL","LCL","UCL","LCL","UCL","LCL","UCL","LCL","UCL","LCL","UCL","LCL","UCL","LCL","UCL","LCL","UCL","LCL","UCL","LCL","UCL","LCL","UCL","LCL","UCL","LCL","UCL","LCL","UCL","LCL","UCL","LCL","UCL"]
[null,"LOCAL"]
["LA","Isle of Anglesey",{"$f":"VLOOKUP(($B7&\"_\"&C$2&\"_\"&C$3&\"_\"&C$4&\"_\"&$A7),'All Data'!$A$2:$L$1048576,C$1,FALSE)","v":0},{"$f":"VLOOKUP(($B7&\"_\"&D$2&\"_\"&D$3&\"_\"&D$4&\"_\"&$A7),'All Data'!$A$2:$L$1048576,D$1,FALSE)","v":0},{"$f":"VLOOKUP(($B7&\"_\"&E$2&\"_\"&E$3&\"_\"&E$4&\"_\"&$A7),'All Data'!$A$2:$L$1048576,E$1,FALSE)","v":0},{"$f":"VLOOKUP(($B7&\"_\"&F$2&\"_\"&F$3&\"_\"&F$4&\"_\"&$A7),'All Data'!$A$2:$L$1048576,F$1,FALSE)","v":0},{"$f":"VLOOKUP(($B7&\"_\"&G$2&\"_\"&G$3&\"_\"&G$4&\"_\"&$A7),'All Data'!$A$2:$L$1048576,G$1,FALSE)","v":-8.5565299999999997E-2},{"$f":"VLOOKUP(($B7&\"_\"&H$2&\"_\"&H$3&\"_\"&H$4&\"_\"&$A7),'All Data'!$A$2:$L$1048576,H$1,FALSE)","v":13.72547},{"$f":"VLOOKUP(($B7&\"_\"&I$2&\"_\"&I$3&\"_\"&I$4&\"_\"&$A7),'All Data'!$A$2:$L$1048576,I$1,FALSE)","v":1.7588820000000001},{"$f":"VLOOKUP(($B7&\"_\"&J$2&\"_\"&J$3&\"_\"&J$4&\"_\"&$A7),'All Data'!$A$2:$L$1048576,J$1,FALSE)","v":7.35703},{"$f":"VLOOKUP(($B7&\"_\"&K$2&\"_\"&K$3&\"_\"&K$4&\"_\"&$A7),'All Data'!$A$2:$L$1048576,K$1,FALSE)","v":74.259509999999992},{"$f":"VLOOKUP(($B7&\"_\"&L$2&\"_\"&L$3&\"_\"&L$4&\"_\"&$A7),'All Data'!$A$2:$L$1048576,L$1,FALSE)","v":79.903739999999999},{"$f":"VLOOKUP(($B7&\"_\"&M$2&\"_\"&M$3&\"_\"&M$4&\"_\"&$A7),'All Data'!$A$2:$L$1048576,M$1,FALSE)","v":{"$error":"#N/A"}},{"$f":"VLOOKUP(($B7&\"_\"&N$2&\"_\"&N$3&\"_\"&N$4&\"_\"&$A7),'All Data'!$A$2:$L$1048576,N$1,FALSE)","v":{"$error":"#N/A"}},{"$f":"VLOOKUP(($B7&\"_\"&O$2&\"_\"&O$3&\"_\"&O$4&\"_\"&$A7),'All Data'!$A$2:$L$1048576,O$1,FALSE)","v":21.015519999999999},{"$f":"VLOOKUP(($B7&\"_\"&P$2&\"_\"&P$3&\"_\"&P$4&\"_\"&$A7),'All Data'!$A$2:$L$1048576,P$1,FALSE)","v":26.760169999999999},{"$f":"VLOOKUP(($B7&\"_\"&Q$2&\"_\"&Q$3&\"_\"&Q$4&\"_\"&$A7),'All Data'!$A$2:$L$1048576,Q$1,FALSE)","v":2.3789169999999999},{"$f":"VLOOKUP(($B7&\"_\"&R$2&\"_\"&R$3&\"_\"&R$4&\"_\"&$A7),'All Data'!$A$2:$L$1048576,R$1,FALSE)","v":2.6411539999999998},{"$f":"VLOOKUP(($B7&\"_\"&S$2&\"_\"&S$3&\"_\"&S$4&\"_\"&$A7),'All Data'!$A$2:$L$1048576,S$1,FALSE)","v":34.49156},{"$f":"VLOOKUP(($B7&\"_\"&T$2&\"_\"&T$3&\"_\"&T$4&\"_\"&$A7),'All Data'!$A$2:$L$1048576,T$1,FALSE)","v":40.917569999999998},{"$f":"VLOOKUP(($B7&\"_\"&U$2&\"_\"&U$3&\"_\"&U$4&\"_\"&$A7),'All Data'!$A$2:$L$1048576,U$1,FALSE)","v":51.028300000000002},{"$f":"VLOOKUP(($B7&\"_\"&V$2&\"_\"&V$3&\"_\"&V$4&\"_\"&$A7),'All Data'!$A$2:$L$1048576,V$1,FALSE)","v":57.302790000000002},{"$f":"VLOOKUP(($B7&\"_\"&W$2&\"_\"&W$3&\"_\"&W$4&\"_\"&$A7),'All Data'!$A$2:$L$1048576,W$1,FALSE)","v":355.90109000000001},{"$f":"VLOOKUP(($B7&\"_\"&X$2&\"_\"&X$3&\"_\"&X$4&\"_\"&$A7),'All Data'!$A$2:$L$1048576,X$1,FALSE)","v":456.84264999999999},{"$f":"VLOOKUP(($B7&\"_\"&Y$2&\"_\"&Y$3&\"_\"&Y$4&\"_\"&$A7),'All Data'!$A$2:$L$1048576,Y$1,FALSE)","v":498.51384000000002},{"$f":"VLOOKUP(($B7&\"_\"&Z$2&\"_\"&Z$3&\"_\"&Z$4&\"_\"&$A7),'All Data'!$A$2:$L$1048576,Z$1,FALSE)","v":671.28650000000005},{"$f":"VLOOKUP(($B7&\"_\"&AA$2&\"_\"&AA$3&\"_\"&AA$4&\"_\"&$A7),'All Data'!$A$2:$L$1048576,AA$1,FALSE)","v":182.43272999999999},{"$f":"VLOOKUP(($B7&\"_\"&AB$2&\"_\"&AB$3&\"_\"&AB$4&\"_\"&$A7),'All Data'!$A$2:$L$1048576,AB$1,FALSE)","v":290.67597999999998},{"$f":"VLOOKUP(($B7&\"_\"&AC$2&\"_\"&AC$3&\"_\"&AC$4&\"_\"&$A7),'All Data'!$A$2:$L$1048576,AC$1,FALSE)","v":24.510121457489877},{"$f":"VLOOKUP(($B7&\"_\"&AD$2&\"_\"&AD$3&\"_\"&AD$4&\"_\"&$A7),'All Data'!$A$2:$L$1048576,AD$1,FALSE)","v":45.969230769230769},{"$f":"VLOOKUP(($B7&\"_\"&AE$2&\"_\"&AE$3&\"_\"&AE$4&\"_\"&$A7),'All Data'!$A$2:$L$1048576,AE$1,FALSE)","v":663.76607000000001},{"$f":"VLOOKUP(($B7&\"_\"&AF$2&\"_\"&AF$3&\"_\"&AF$4&\"_\"&$A7),'All Data'!$A$2:$L$1048576,AF$1,FALSE)","v":932.65922999999998},{"$f":"VLOOKUP(($B7&\"_\"&AG$2&\"_\"&AG$3&\"_\"&AG$4&\"_\"&$A7),'All Data'!$A$2:$L$1048576,AG$1,FALSE)","v":398.36189999999999},{"$f":"VLOOKUP(($B7&\"_\"&AH$2&\"_\"&AH$3&\"_\"&AH$4&\"_\"&$A7),'All Data'!$A$2:$L$1048576,AH$1,FALSE)","v":764.63932999999997},{"$f":"VLOOKUP(($B7&\"_\"&AI$2&\"_\"&AI$3&\"_\"&AI$4&\"_\"&$A7),'All Data'!$A$2:$L$1048576,AI$1,FALSE)","v":732.39571999999998},{"$f":"VLOOKUP(($B7&\"_\"&AJ$2&\"_\"&AJ$3&\"_\"&AJ$4&\"_\"&$A7),'All Data'!$A$2:$L$1048576,AJ$1,FALSE)","v":1103.61754},{"$f":"VLOOKUP(($B7&\"_\"&AK$2&\"_\"&AK$3&\"_\"&AK$4&\"_\"&$A7),'All Data'!$A$2:$L$1048576,AK$1,FALSE)","v":79.353896049810942},{"$f":"VLOOKUP(($B7&\"_\"&AL$2&\"_\"&AL$3&\"_\"&AL$4&\"_\"&$A7),'All Data'!$A$2:$L$1048576,AL$1,FALSE)","v":84.768544775451389}]
["LA","Gwynedd",{"$f":"VLOOKUP(($B8&\"_\"&C$2&\"_\"&C$3&\"_\"&C$4&\"_\"&$A8),'All Data'!$A$2:$L$1048576,C$1,FALSE)","v":0},{"$f":"VLOOKUP(($B8&\"_\"&D$2&\"_\"&D$3&\"_\"&D$4&\"_\"&$A8),'All Data'!$A$2:$L$1048576,D$1,FALSE)","v":0},{"$f":"VLOOKUP(($B8&\"_\"&E$2&\"_\"&E$3&\"_\"&E$4&\"_\"&$A8),'All Data'!$A$2:$L$1048576,E$1,FALSE)","v":0},{"$f":"VLOOKUP(($B8&\"_\"&F$2&\"_\"&F$3&\"_\"&F$4&\"_\"&$A8),'All Data'!$A$2:$L$1048576,F$1,FALSE)","v":0},{"$f":"VLOOKUP(($B8&\"_\"&G$2&\"_\"&G$3&\"_\"&G$4&\"_\"&$A8),'All Data'!$A$2:$L$1048576,G$1,FALSE)","v":0.18031449999999999},{"$f":"VLOOKUP(($B8&\"_\"&H$2&\"_\"&H$3&\"_\"&H$4&\"_\"&$A8),'All Data'!$A$2:$L$1048576,H$1,FALSE)","v":6.6699520000000003},{"$f":"VLOOKUP(($B8&\"_\"&I$2&\"_\"&I$3&\"_\"&I$4&\"_\"&$A8),'All Data'!$A$2:$L$1048576,I$1,FALSE)","v":-3.2088549999999998},{"$f":"VLOOKUP(($B8&\"_\"&J$2&\"_\"&J$3&\"_\"&J$4&\"_\"&$A8),'All Data'!$A$2:$L$1048576,J$1,FALSE)","v":8.0655599999999996},{"$f":"VLOOKUP(($B8&\"_\"&K$2&\"_\"&K$3&\"_\"&K$4&\"_\"&$A8),'All Data'!$A$2:$L$1048576,K$1,FALSE)","v":75.214410000000001},{"$f":"VLOOKUP(($B8&\"_\"&L$2&\"_\"&L$3&\"_\"&L$4&\"_\"&$A8),'All Data'!$A$2:$L$1048576,L$1,FALSE)","v":80.741990000000001},{"$f":"VLOOKUP(($B8&\"_\"&M$2&\"_\"&M$3&\"_\"&M$4&\"_\"&$A8),'All Data'!$A$2:$L$1048576,M$1,FALSE)","v":{"$error":"#N/A"}},{"$f":"VLOOKUP(($B8&\"_\"&N$2&\"_\"&N$3&\"_\"&N$4&\"_\"&$A8),'All Data'!$A$2:$L$1048576,N$1,FALSE)","v":{"$error":"#N/A"}},{"$f":"VLOOKUP(($B8&\"_\"&O$2&\"_\"&O$3&\"_\"&O$4&\"_\"&$A8),'All Data'!$A$2:$L$1048576,O$1,FALSE)","v":21.190719999999999},{"$f":"VLOOKUP(($B8&\"_\"&P$2&\"_\"&P$3&\"_\"&P$4&\"_\"&$A8),'All Data'!$A$2:$L$1048576,P$1,FALSE)","v":27.04186},{"$f":"VLOOKUP(($B8&\"_\"&Q$2&\"_\"&Q$3&\"_\"&Q$4&\"_\"&$A8),'All Data'!$A$2:$L$1048576,Q$1,FALSE)","v":2.3645700000000001},{"$f":"VLOOKUP(($B8&\"_\"&R$2&\"_\"&R$3&\"_\"&R$4&\"_\"&$A8),'All Data'!$A$2:$L$1048576,R$1,FALSE)","v":2.636746},{"$f":"VLOOKUP(($B8&\"_\"&S$2&\"_\"&S$3&\"_\"&S$4&\"_\"&$A8),'All Data'!$A$2:$L$1048576,S$1,FALSE)","v":37.3797},{"$f":"VLOOKUP(($B8&\"_\"&T$2&\"_\"&T$3&\"_\"&T$4&\"_\"&$A8),'All Data'!$A$2:$L$1048576,T$1,FALSE)","v":44.041449999999998},{"$f":"VLOOKUP(($B8&\"_\"&U$2&\"_\"&U$3&\"_\"&U$4&\"_\"&$A8),'All Data'!$A$2:$L$1048576,U$1,FALSE)","v":52.863050000000001},{"$f":"VLOOKUP(($B8&\"_\"&V$2&\"_\"&V$3&\"_\"&V$4&\"_\"&$A8),'All Data'!$A$2:$L$1048576,V$1,FALSE)","v":59.339450000000006},{"$f":"VLOOKUP(($B8&\"_\"&W$2&\"_\"&W$3&\"_\"&W$4&\"_\"&$A8),'All Data'!$A$2:$L$1048576,W$1,FALSE)","v":330.94650999999999},{"$f":"VLOOKUP(($B8&\"_\"&X$2&\"_\"&X$3&\"_\"&X$4&\"_\"&$A8),'All Data'!$A$2:$L$1048576,X$1,FALSE)","v":403.39877000000001},{"$f":"VLOOKUP(($B8&\"_\"&Y$2&\"_\"&Y$3&\"_\"&Y$4&\"_\"&$A8),'All Data'!$A$2:$L$1048576,Y$1,FALSE)","v":427.42394999999999},{"$f":"VLOOKUP(($B8&\"_\"&Z$2&\"_\"&Z$3&\"_\"&Z$4&\"_\"&$A8),'All Data'!$A$2:$L$1048576,Z$1,FALSE)","v":546.27972999999997},{"$f":"VLOOKUP(($B8&\"_\"&AA$2&\"_\"&AA$3&\"_\"&AA$4&\"_\"&$A8),'All Data'!$A$2:$L$1048576,AA$1,FALSE)","v":210.11350999999999},{"$f":"VLOOKUP(($B8&\"_\"&AB$2&\"_\"&AB$3&\"_\"&AB$4&\"_\"&$A8),'All Data'!$A$2:$L$1048576,AB$1,FALSE)","v":294.86779000000001},{"$f":"VLOOKUP(($B8&\"_\"&AC$2&\"_\"&AC$3&\"_\"&AC$4&\"_\"&$A8),'All Data'!$A$2:$L$1048576,AC$1,FALSE)","v":26.471981776765375},{"$f":"VLOOKUP(($B8&\"_\"&AD$2&\"_\"&AD$3&\"_\"&AD$4&\"_\"&$A8),'All Data'!$A$2:$L$1048576,AD$1,FALSE)","v":42.323462414578593},{"$f":"VLOOKUP(($B8&\"_\"&AE$2&\"_\"&AE$3&\"_\"&AE$4&\"_\"&$A8),'All Data'!$A$2:$L$1048576,AE$1,FALSE)","v":696.38687000000004},{"$f":"VLOOKUP(($B8&\"_\"&AF$2&\"_\"&AF$3&\"_\"&AF$4&\"_\"&$A8),'All Data'!$A$2:$L$1048576,AF$1,FALSE)","v":911.86860999999999},{"$f":"VLOOKUP(($B8&\"_\"&AG$2&\"_\"&AG$3&\"_\"&AG$4&\"_\"&$A8),'All Data'!$A$2:$L$1048576,AG$1,FALSE)","v":383.79665},{"$f":"VLOOKUP(($B8&\"_\"&AH$2&\"_\"&AH$3&\"_\"&AH$4&\"_\"&$A8),'All Data'!$A$2:$L$1048576,AH$1,FALSE)","v":659.95825000000002},{"$f":"VLOOKUP(($B8&\"_\"&AI$2&\"_\"&AI$3&\"_\"&AI$4&\"_\"&$A8),'All Data'!$A$2:$L$1048576,AI$1,FALSE)","v":850.11874999999998},{"$f":"VLOOKUP(($B8&\"_\"&AJ$2&\"_\"&AJ$3&\"_\"&AJ$4&\"_\"&$A8),'All Data'!$A$2:$L$1048576,AJ$1,FALSE)","v":1171.85617},{"$f":"VLOOKUP(($B8&\"_\"&AK$2&\"_\"&AK$3&\"_\"&AK$4&\"_\"&$A8),'All Data'!$A$2:$L$1048576,AK$1,FALSE)","v":82.965694500450965},{"$f":"VLOOKUP(($B8&\"_\"&AL$2&\"_\"&AL$3&\"_\"&AL$4&\"_\"&$A8),'All Data'!$A$2:$L$1048576,AL$1,FALSE)","v":86.946177700646672}]
["LA","Conwy",{"$f":"VLOOKUP(($B9&\"_\"&C$2&\"_\"&C$3&\"_\"&C$4&\"_\"&$A9),'All Data'!$A$2:$L$1048576,C$1,FALSE)","v":0},{"$f":"VLOOKUP(($B9&\"_\"&D$2&\"_\"&D$3&\"_\"&D$4&\"_\"&$A9),'All Data'!$A$2:$L$1048576,D$1,FALSE)","v":0},{"$f":"VLOOKUP(($B9&\"_\"&E$2&\"_\"&E$3&\"_\"&E$4&\"_\"&$A9),'All Data'!$A$2:$L$1048576,E$1,FALSE)","v":0},{"$f":"VLOOKUP(($B9&\"_\"&F$2&\"_\"&F$3&\"_\"&F$4&\"_\"&$A9),'All Data'!$A$2:$L$1048576,F$1,FALSE)","v":0},{"$f":"VLOOKUP(($B9&\"_\"&G$2&\"_\"&G$3&\"_\"&G$4&\"_\"&$A9),'All Data'!$A$2:$L$1048576,G$1,FALSE)","v":5.7928949999999997},{"$f":"VLOOKUP(($B9&\"_\"&H$2&\"_\"&H$3&\"_\"&H$4&\"_\"&$A9),'All Data'!$A$2:$L$1048576,H$1,FALSE)","v":10.333399999999999},{"$f":"VLOOKUP(($B9&\"_\"&I$2&\"_\"&I$3&\"_\"&I$4&\"_\"&$A9),'All Data'!$A$2:$L$1048576,I$1,FALSE)","v":4.1375900000000003},{"$f":"VLOOKUP(($B9&\"_\"&J$2&\"_\"&J$3&\"_\"&J$4&\"_\"&$A9),'All Data'!$A$2:$L$1048576,J$1,FALSE)","v":9.4327699999999997},{"$f":"VLOOKUP(($B9&\"_\"&K$2&\"_\"&K$3&\"_\"&K$4&\"_\"&$A9),'All Data'!$A$2:$L$1048576,K$1,FALSE)","v":77.47878},{"$f":"VLOOKUP(($B9&\"_\"&L$2&\"_\"&L$3&\"_\"&L$4&\"_\"&$A9),'All Data'!$A$2:$L$1048576,L$1,FALSE)","v":82.45317},{"$f":"VLOOKUP(($B9&\"_\"&M$2&\"_\"&M$3&\"_\"&M$4&\"_\"&$A9),'All Data'!$A$2:$L$1048576,M$1,FALSE)","v":{"$error":"#N/A"}},{"$f":"VLOOKUP(($B9&\"_\"&N$2&\"_\"&N$3&\"_\"&N$4&\"_\"&$A9),'All Data'!$A$2:$L$1048576,N$1,FALSE)","v":{"$error":"#N/A"}},{"$f":"VLOOKUP(($B9&\"_\"&O$2&\"_\"&O$3&\"_\"&O$4&\"_\"&$A9),'All Data'!$A$2:$L$1048576,O$1,FALSE)","v":19.44904},{"$f":"VLOOKUP(($B9&\"_\"&P$2&\"_\"&P$3&\"_\"&P$4&\"_\"&$A9),'All Data'!$A$2:$L$1048576,P$1,FALSE)","v":24.844110000000001},{"$f":"VLOOKUP(($B9&\"_\"&Q$2&\"_\"&Q$3&\"_\"&Q$4&\"_\"&$A9),'All Data'!$A$2:$L$1048576,Q$1,FALSE)","v":2.43085},{"$f":"VLOOKUP(($B9&\"_\"&R$2&\"_\"&R$3&\"_\"&R$4&\"_\"&$A9),'All Data'!$A$2:$L$1048576,R$1,FALSE)","v":2.69435},{"$f":"VLOOKUP(($B9&\"_\"&S$2&\"_\"&S$3&\"_\"&S$4&\"_\"&$A9),'All Data'!$A$2:$L$1048576,S$1,FALSE)","v":31.545840000000002},{"$f":"VLOOKUP(($B9&\"_\"&T$2&\"_\"&T$3&\"_\"&T$4&\"_\"&$A9),'All Data'!$A$2:$L$1048576,T$1,FALSE)","v":37.726330000000004},{"$f":"VLOOKUP(($B9&\"_\"&U$2&\"_\"&U$3&\"_\"&U$4&\"_\"&$A9),'All Data'!$A$2:$L$1048576,U$1,FALSE)","v":48.064019999999999},{"$f":"VLOOKUP(($B9&\"_\"&V$2&\"_\"&V$3&\"_\"&V$4&\"_\"&$A9),'All Data'!$A$2:$L$1048576,V$1,FALSE)","v":54.203539999999997},{"$f":"VLOOKUP(($B9&\"_\"&W$2&\"_\"&W$3&\"_\"&W$4&\"_\"&$A9),'All Data'!$A$2:$L$1048576,W$1,FALSE)","v":372.39395999999999},{"$f":"VLOOKUP(($B9&\"_\"&X$2&\"_\"&X$3&\"_\"&X$4&\"_\"&$A9),'All Data'!$A$2:$L$1048576,X$1,FALSE)","v":453.66752000000002},{"$f":"VLOOKUP(($B9&\"_\"&Y$2&\"_\"&Y$3&\"_\"&Y$4&\"_\"&$A9),'All Data'!$A$2:$L$1048576,Y$1,FALSE)","v":465.96588000000003},{"$f":"VLOOKUP(($B9&\"_\"&Z$2&\"_\"&Z$3&\"_\"&Z$4&\"_\"&$A9),'All Data'!$A$2:$L$1048576,Z$1,FALSE)","v":595.21693000000005},{"$f":"VLOOKUP(($B9&\"_\"&AA$2&\"_\"&AA$3&\"_\"&AA$4&\"_\"&$A9),'All Data'!$A$2:$L$1048576,AA$1,FALSE)","v":253.77180999999999},{"$f":"VLOOKUP(($B9&\"_\"&AB$2&\"_\"&AB$3&\"_\"&AB$4&\"_\"&$A9),'All Data'!$A$2:$L$1048576,AB$1,FALSE)","v":354.86909000000003},{"$f":"VLOOKUP(($B9&\"_\"&AC$2&\"_\"&AC$3&\"_\"&AC$4&\"_\"&$A9),'All Data'!$A$2:$L$1048576,AC$1,FALSE)","v":30.505522088353416},{"$f":"VLOOKUP(($B9&\"_\"&AD$2&\"_\"&AD$3&\"_\"&AD$4&\"_\"&$A9),'All Data'!$A$2:$L$1048576,AD$1,FALSE)","v":48.311746987951807},{"$f":"VLOOKUP(($B9&\"_\"&AE$2&\"_\"&AE$3&\"_\"&AE$4&\"_\"&$A9),'All Data'!$A$2:$L$1048576,AE$1,FALSE)","v":627.92705000000001},{"$f":"VLOOKUP(($B9&\"_\"&AF$2&\"_\"&AF$3&\"_\"&AF$4&\"_\"&$A9),'All Data'!$A$2:$L$1048576,AF$1,FALSE)","v":811.96808999999996},{"$f":"VLOOKUP(($B9&\"_\"&AG$2&\"_\"&AG$3&\"_\"&AG$4&\"_\"&$A9),'All Data'!$A$2:$L$1048576,AG$1,FALSE)","v":392.51495999999997},{"$f":"VLOOKUP(($B9&\"_\"&AH$2&\"_\"&AH$3&\"_\"&AH$4&\"_\"&$A9),'All Data'!$A$2:$L$1048576,AH$1,FALSE)","v":638.29253000000006},{"$f":"VLOOKUP(($B9&\"_\"&AI$2&\"_\"&AI$3&\"_\"&AI$4&\"_\"&$A9),'All Data'!$A$2:$L$1048576,AI$1,FALSE)","v":733.54246999999998},{"$f":"VLOOKUP(($B9&\"_\"&AJ$2&\"_\"&AJ$3&\"_\"&AJ$4&\"_\"&$A9),'All Data'!$A$2:$L$1048576,AJ$1,FALSE)","v":1001.30242},{"$f":"VLOOKUP(($B9&\"_\"&AK$2&\"_\"&AK$3&\"_\"&AK$4&\"_\"&$A9),'All Data'!$A$2:$L$1048576,AK$1,FALSE)","v":78.821662305346919},{"$f":"VLOOKUP(($B9&\"_\"&AL$2&\"_\"&AL$3&\"_\"&AL$4&\"_\"&$A9),'All Data'!$A$2:$L$1048576,AL$1,FALSE)","v":83.417419232886587}]
["LA","Denbighshire",{"$f":"VLOOKUP(($B10&\"_\"&C$2&\"_\"&C$3&\"_\"&C$4&\"_\"&$A10),'All Data'!$A$2:$L$1048576,C$1,FALSE)","v":0},{"$f":"VLOOKUP(($B10&\"_\"&D$2&\"_\"&D$3&\"_\"&D$4&\"_\"&$A10),'All Data'!$A$2:$L$1048576,D$1,FALSE)","v":0},{"$f":"VLOOKUP(($B10&\"_\"&E$2&\"_\"&E$3&\"_\"&E$4&\"_\"&$A10),'All Data'!$A$2:$L$1048576,E$1,FALSE)","v":0},{"$f":"VLOOKUP(($B10&\"_\"&F$2&\"_\"&F$3&\"_\"&F$4&\"_\"&$A10),'All Data'!$A$2:$L$1048576,F$1,FALSE)","v":0},{"$f":"VLOOKUP(($B10&\"_\"&G$2&\"_\"&G$3&\"_\"&G$4&\"_\"&$A10),'All Data'!$A$2:$L$1048576,G$1,FALSE)","v":-3.09605},{"$f":"VLOOKUP(($B10&\"_\"&H$2&\"_\"&H$3&\"_\"&H$4&\"_\"&$A10),'All Data'!$A$2:$L$1048576,H$1,FALSE)","v":18.387889999999999},{"$f":"VLOOKUP(($B10&\"_\"&I$2&\"_\"&I$3&\"_\"&I$4&\"_\"&$A10),'All Data'!$A$2:$L$1048576,I$1,FALSE)","v":-2.9595189999999998},{"$f":"VLOOKUP(($B10&\"_\"&J$2&\"_\"&J$3&\"_\"&J$4&\"_\"&$A10),'All Data'!$A$2:$L$1048576,J$1,FALSE)","v":10.43322},{"$f":"VLOOKUP(($B10&\"_\"&K$2&\"_\"&K$3&\"_\"&K$4&\"_\"&$A10),'All Data'!$A$2:$L$1048576,K$1,FALSE)","v":74.474209999999999},{"$f":"VLOOKUP(($B10&\"_\"&L$2&\"_\"&L$3&\"_\"&L$4&\"_\"&$A10),'All Data'!$A$2:$L$1048576,L$1,FALSE)","v":79.552900000000008},{"$f":"VLOOKUP(($B10&\"_\"&M$2&\"_\"&M$3&\"_\"&M$4&\"_\"&$A10),'All Data'!$A$2:$L$1048576,M$1,FALSE)","v":{"$error":"#N/A"}},{"$f":"VLOOKUP(($B10&\"_\"&N$2&\"_\"&N$3&\"_\"&N$4&\"_\"&$A10),'All Data'!$A$2:$L$1048576,N$1,FALSE)","v":{"$error":"#N/A"}},{"$f":"VLOOKUP(($B10&\"_\"&O$2&\"_\"&O$3&\"_\"&O$4&\"_\"&$A10),'All Data'!$A$2:$L$1048576,O$1,FALSE)","v":20.35108},{"$f":"VLOOKUP(($B10&\"_\"&P$2&\"_\"&P$3&\"_\"&P$4&\"_\"&$A10),'All Data'!$A$2:$L$1048576,P$1,FALSE)","v":25.744759999999999},{"$f":"VLOOKUP(($B10&\"_\"&Q$2&\"_\"&Q$3&\"_\"&Q$4&\"_\"&$A10),'All Data'!$A$2:$L$1048576,Q$1,FALSE)","v":2.3791579999999999},{"$f":"VLOOKUP(($B10&\"_\"&R$2&\"_\"&R$3&\"_\"&R$4&\"_\"&$A10),'All Data'!$A$2:$L$1048576,R$1,FALSE)","v":2.6371899999999999},{"$f":"VLOOKUP(($B10&\"_\"&S$2&\"_\"&S$3&\"_\"&S$4&\"_\"&$A10),'All Data'!$A$2:$L$1048576,S$1,FALSE)","v":33.01999},{"$f":"VLOOKUP(($B10&\"_\"&T$2&\"_\"&T$3&\"_\"&T$4&\"_\"&$A10),'All Data'!$A$2:$L$1048576,T$1,FALSE)","v":39.114750000000001},{"$f":"VLOOKUP(($B10&\"_\"&U$2&\"_\"&U$3&\"_\"&U$4&\"_\"&$A10),'All Data'!$A$2:$L$1048576,U$1,FALSE)","v":51.3506},{"$f":"VLOOKUP(($B10&\"_\"&V$2&\"_\"&V$3&\"_\"&V$4&\"_\"&$A10),'All Data'!$A$2:$L$1048576,V$1,FALSE)","v":57.540430000000001},{"$f":"VLOOKUP(($B10&\"_\"&W$2&\"_\"&W$3&\"_\"&W$4&\"_\"&$A10),'All Data'!$A$2:$L$1048576,W$1,FALSE)","v":328.41045000000003},{"$f":"VLOOKUP(($B10&\"_\"&X$2&\"_\"&X$3&\"_\"&X$4&\"_\"&$A10),'All Data'!$A$2:$L$1048576,X$1,FALSE)","v":408.56401},{"$f":"VLOOKUP(($B10&\"_\"&Y$2&\"_\"&Y$3&\"_\"&Y$4&\"_\"&$A10),'All Data'!$A$2:$L$1048576,Y$1,FALSE)","v":384.24912999999998},{"$f":"VLOOKUP(($B10&\"_\"&Z$2&\"_\"&Z$3&\"_\"&Z$4&\"_\"&$A10),'All Data'!$A$2:$L$1048576,Z$1,FALSE)","v":509.87144000000001},{"$f":"VLOOKUP(($B10&\"_\"&AA$2&\"_\"&AA$3&\"_\"&AA$4&\"_\"&$A10),'All Data'!$A$2:$L$1048576,AA$1,FALSE)","v":245.96544},{"$f":"VLOOKUP(($B10&\"_\"&AB$2&\"_\"&AB$3&\"_\"&AB$4&\"_\"&$A10),'All Data'!$A$2:$L$1048576,AB$1,FALSE)","v":348.34120000000001},{"$f":"VLOOKUP(($B10&\"_\"&AC$2&\"_\"&AC$3&\"_\"&AC$4&\"_\"&$A10),'All Data'!$A$2:$L$1048576,AC$1,FALSE)","v":27.237993596584843},{"$f":"VLOOKUP(($B10&\"_\"&AD$2&\"_\"&AD$3&\"_\"&AD$4&\"_\"&$A10),'All Data'!$A$2:$L$1048576,AD$1,FALSE)","v":44.806830309498395},{"$f":"VLOOKUP(($B10&\"_\"&AE$2&\"_\"&AE$3&\"_\"&AE$4&\"_\"&$A10),'All Data'!$A$2:$L$1048576,AE$1,FALSE)","v":378.21557999999999},{"$f":"VLOOKUP(($B10&\"_\"&AF$2&\"_\"&AF$3&\"_\"&AF$4&\"_\"&$A10),'All Data'!$A$2:$L$1048576,AF$1,FALSE)","v":541.99528999999995},{"$f":"VLOOKUP(($B10&\"_\"&AG$2&\"_\"&AG$3&\"_\"&AG$4&\"_\"&$A10),'All Data'!$A$2:$L$1048576,AG$1,FALSE)","v":175.15889000000001},{"$f":"VLOOKUP(($B10&\"_\"&AH$2&\"_\"&AH$3&\"_\"&AH$4&\"_\"&$A10),'All Data'!$A$2:$L$1048576,AH$1,FALSE)","v":383.02936},{"$f":"VLOOKUP(($B10&\"_\"&AI$2&\"_\"&AI$3&\"_\"&AI$4&\"_\"&$A10),'All Data'!$A$2:$L$1048576,AI$1,FALSE)","v":471.04228000000001},{"$f":"VLOOKUP(($B10&\"_\"&AJ$2&\"_\"&AJ$3&\"_\"&AJ$4&\"_\"&$A10),'All Data'!$A$2:$L$1048576,AJ$1,FALSE)","v":720.49932999999999},{"$f":"VLOOKUP(($B10&\"_\"&AK$2&\"_\"&AK$3&\"_\"&AK$4&\"_\"&$A10),'All Data'!$A$2:$L$1048576,AK$1,FALSE)","v":79.889767026769547},{"$f":"VLOOKUP(($B10&\"_\"&AL$2&\"_\"&AL$3&\"_\"&AL$4&\"_\"&$A10),'All Data'!$A$2:$L$1048576,AL$1,FALSE)","v":84.521910303076424}]
["LA","Flintshire",{"$f":"VLOOKUP(($B11&\"_\"&C$2&\"_\"&C$3&\"_\"&C$4&\"_\"&$A11),'All Data'!$A$2:$L$1048576,C$1,FALSE)","v":0},{"$f":"VLOOKUP(($B11&\"_\"&D$2&\"_\"&D$3&\"_\"&D$4&\"_\"&$A11),'All Data'!$A$2:$L$1048576,D$1,FALSE)","v":0},{"$f":"VLOOKUP(($B11&\"_\"&E$2&\"_\"&E$3&\"_\"&E$4&\"_\"&$A11),'All Data'!$A$2:$L$1048576,E$1,FALSE)","v":0},{"$f":"VLOOKUP(($B11&\"_\"&F$2&\"_\"&F$3&\"_\"&F$4&\"_\"&$A11),'All Data'!$A$2:$L$1048576,F$1,FALSE)","v":0},{"$f":"VLOOKUP(($B11&\"_\"&G$2&\"_\"&G$3&\"_\"&G$4&\"_\"&$A11),'All Data'!$A$2:$L$1048576,G$1,FALSE)","v":1.470987},{"$f":"VLOOKUP(($B11&\"_\"&H$2&\"_\"&H$3&\"_\"&H$4&\"_\"&$A11),'All Data'!$A$2:$L$1048576,H$1,FALSE)","v":13.449009999999999},{"$f":"VLOOKUP(($B11&\"_\"&I$2&\"_\"&I$3&\"_\"&I$4&\"_\"&$A11),'All Data'!$A$2:$L$1048576,I$1,FALSE)","v":4.1297090000000001},{"$f":"VLOOKUP(($B11&\"_\"&J$2&\"_\"&J$3&\"_\"&J$4&\"_\"&$A11),'All Data'!$A$2:$L$1048576,J$1,FALSE)","v":9.4902899999999999},{"$f":"VLOOKUP(($B11&\"_\"&K$2&\"_\"&K$3&\"_\"&K$4&\"_\"&$A11),'All Data'!$A$2:$L$1048576,K$1,FALSE)","v":77.054169999999999},{"$f":"VLOOKUP(($B11&\"_\"&L$2&\"_\"&L$3&\"_\"&L$4&\"_\"&$A11),'All Data'!$A$2:$L$1048576,L$1,FALSE)","v":81.732749999999996},{"$f":"VLOOKUP(($B11&\"_\"&M$2&\"_\"&M$3&\"_\"&M$4&\"_\"&$A11),'All Data'!$A$2:$L$1048576,M$1,FALSE)","v":{"$error":"#N/A"}},{"$f":"VLOOKUP(($B11&\"_\"&N$2&\"_\"&N$3&\"_\"&N$4&\"_\"&$A11),'All Data'!$A$2:$L$1048576,N$1,FALSE)","v":{"$error":"#N/A"}},{"$f":"VLOOKUP(($B11&\"_\"&O$2&\"_\"&O$3&\"_\"&O$4&\"_\"&$A11),'All Data'!$A$2:$L$1048576,O$1,FALSE)","v":18.910820000000001},{"$f":"VLOOKUP(($B11&\"_\"&P$2&\"_\"&P$3&\"_\"&P$4&\"_\"&$A11),'All Data'!$A$2:$L$1048576,P$1,FALSE)","v":24.0504},{"$f":"VLOOKUP(($B11&\"_\"&Q$2&\"_\"&Q$3&\"_\"&Q$4&\"_\"&$A11),'All Data'!$A$2:$L$1048576,Q$1,FALSE)","v":2.3481489999999998},{"$f":"VLOOKUP(($B11&\"_\"&R$2&\"_\"&R$3&\"_\"&R$4&\"_\"&$A11),'All Data'!$A$2:$L$1048576,R$1,FALSE)","v":2.5911369999999998},{"$f":"VLOOKUP(($B11&\"_\"&S$2&\"_\"&S$3&\"_\"&S$4&\"_\"&$A11),'All Data'!$A$2:$L$1048576,S$1,FALSE)","v":32.514189999999999},{"$f":"VLOOKUP(($B11&\"_\"&T$2&\"_\"&T$3&\"_\"&T$4&\"_\"&$A11),'All Data'!$A$2:$L$1048576,T$1,FALSE)","v":38.783250000000002},{"$f":"VLOOKUP(($B11&\"_\"&U$2&\"_\"&U$3&\"_\"&U$4&\"_\"&$A11),'All Data'!$A$2:$L$1048576,U$1,FALSE)","v":53.399319999999996},{"$f":"VLOOKUP(($B11&\"_\"&V$2&\"_\"&V$3&\"_\"&V$4&\"_\"&$A11),'All Data'!$A$2:$L$1048576,V$1,FALSE)","v":59.088339999999995},{"$f":"VLOOKUP(($B11&\"_\"&W$2&\"_\"&W$3&\"_\"&W$4&\"_\"&$A11),'All Data'!$A$2:$L$1048576,W$1,FALSE)","v":294.10234000000003},{"$f":"VLOOKUP(($B11&\"_\"&X$2&\"_\"&X$3&\"_\"&X$4&\"_\"&$A11),'All Data'!$A$2:$L$1048576,X$1,FALSE)","v":353.09652999999997},{"$f":"VLOOKUP(($B11&\"_\"&Y$2&\"_\"&Y$3&\"_\"&Y$4&\"_\"&$A11),'All Data'!$A$2:$L$1048576,Y$1,FALSE)","v":339.83902999999998},{"$f":"VLOOKUP(($B11&\"_\"&Z$2&\"_\"&Z$3&\"_\"&Z$4&\"_\"&$A11),'All Data'!$A$2:$L$1048576,Z$1,FALSE)","v":430.08524},{"$f":"VLOOKUP(($B11&\"_\"&AA$2&\"_\"&AA$3&\"_\"&AA$4&\"_\"&$A11),'All Data'!$A$2:$L$1048576,AA$1,FALSE)","v":228.68026},{"$f":"VLOOKUP(($B11&\"_\"&AB$2&\"_\"&AB$3&\"_\"&AB$4&\"_\"&$A11),'All Data'!$A$2:$L$1048576,AB$1,FALSE)","v":306.17178000000001},{"$f":"VLOOKUP(($B11&\"_\"&AC$2&\"_\"&AC$3&\"_\"&AC$4&\"_\"&$A11),'All Data'!$A$2:$L$1048576,AC$1,FALSE)","v":30.87967511640387},{"$f":"VLOOKUP(($B11&\"_\"&AD$2&\"_\"&AD$3&\"_\"&AD$4&\"_\"&$A11),'All Data'!$A$2:$L$1048576,AD$1,FALSE)","v":45.717308549562944},{"$f":"VLOOKUP(($B11&\"_\"&AE$2&\"_\"&AE$3&\"_\"&AE$4&\"_\"&$A11),'All Data'!$A$2:$L$1048576,AE$1,FALSE)","v":640.13422000000003},{"$f":"VLOOKUP(($B11&\"_\"&AF$2&\"_\"&AF$3&\"_\"&AF$4&\"_\"&$A11),'All Data'!$A$2:$L$1048576,AF$1,FALSE)","v":837.76833999999997},{"$f":"VLOOKUP(($B11&\"_\"&AG$2&\"_\"&AG$3&\"_\"&AG$4&\"_\"&$A11),'All Data'!$A$2:$L$1048576,AG$1,FALSE)","v":359.11914000000002},{"$f":"VLOOKUP(($B11&\"_\"&AH$2&\"_\"&AH$3&\"_\"&AH$4&\"_\"&$A11),'All Data'!$A$2:$L$1048576,AH$1,FALSE)","v":610.85365000000002},{"$f":"VLOOKUP(($B11&\"_\"&AI$2&\"_\"&AI$3&\"_\"&AI$4&\"_\"&$A11),'All Data'!$A$2:$L$1048576,AI$1,FALSE)","v":787.12114999999994},{"$f":"VLOOKUP(($B11&\"_\"&AJ$2&\"_\"&AJ$3&\"_\"&AJ$4&\"_\"&$A11),'All Data'!$A$2:$L$1048576,AJ$1,FALSE)","v":1084.92247},{"$f":"VLOOKUP(($B11&\"_\"&AK$2&\"_\"&AK$3&\"_\"&AK$4&\"_\"&$A11),'All Data'!$A$2:$L$1048576,AK$1,FALSE)","v":81.266821004160278},{"$f":"VLOOKUP(($B11&\"_\"&AL$2&\"_\"&AL$3&\"_\"&AL$4&\"_\"&$A11),'All Data'!$A$2:$L$1048576,AL$1,FALSE)","v":84.724594258223817}]
["LA","Wrexham",{"$f":"VLOOKUP(($B12&\"_\"&C$2&\"_\"&C$3&\"_\"&C$4&\"_\"&$A12),'All Data'!$A$2:$L$1048576,C$1,FALSE)","v":0},{"$f":"VLOOKUP(($B12&\"_\"&D$2&\"_\"&D$3&\"_\"&D$4&\"_\"&$A12),'All Data'!$A$2:$L$1048576,D$1,FALSE)","v":0},{"$f":"VLOOKUP(($B12&\"_\"&E$2&\"_\"&E$3&\"_\"&E$4&\"_\"&$A12),'All Data'!$A$2:$L$1048576,E$1,FALSE)","v":0},{"$f":"VLOOKUP(($B12&\"_\"&F$2&\"_\"&F$3&\"_\"&F$4&\"_\"&$A12),'All Data'!$A$2:$L$1048576,F$1,FALSE)","v":0},{"$f":"VLOOKUP(($B12&\"_\"&G$2&\"_\"&G$3&\"_\"&G$4&\"_\"&$A12),'All Data'!$A$2:$L$1048576,G$1,FALSE)","v":5.5414770000000004},{"$f":"VLOOKUP(($B12&\"_\"&H$2&\"_\"&H$3&\"_\"&H$4&\"_\"&$A12),'All Data'!$A$2:$L$1048576,H$1,FALSE)","v":12.81256},{"$f":"VLOOKUP(($B12&\"_\"&I$2&\"_\"&I$3&\"_\"&I$4&\"_\"&$A12),'All Data'!$A$2:$L$1048576,I$1,FALSE)","v":0.97660049999999998},{"$f":"VLOOKUP(($B12&\"_\"&J$2&\"_\"&J$3&\"_\"&J$4&\"_\"&$A12),'All Data'!$A$2:$L$1048576,J$1,FALSE)","v":15.336499999999999},{"$f":"VLOOKUP(($B12&\"_\"&K$2&\"_\"&K$3&\"_\"&K$4&\"_\"&$A12),'All Data'!$A$2:$L$1048576,K$1,FALSE)","v":72.279319999999998},{"$f":"VLOOKUP(($B12&\"_\"&L$2&\"_\"&L$3&\"_\"&L$4&\"_\"&$A12),'All Data'!$A$2:$L$1048576,L$1,FALSE)","v":77.497479999999996},{"$f":"VLOOKUP(($B12&\"_\"&M$2&\"_\"&M$3&\"_\"&M$4&\"_\"&$A12),'All Data'!$A$2:$L$1048576,M$1,FALSE)","v":{"$error":"#N/A"}},{"$f":"VLOOKUP(($B12&\"_\"&N$2&\"_\"&N$3&\"_\"&N$4&\"_\"&$A12),'All Data'!$A$2:$L$1048576,N$1,FALSE)","v":{"$error":"#N/A"}},{"$f":"VLOOKUP(($B12&\"_\"&O$2&\"_\"&O$3&\"_\"&O$4&\"_\"&$A12),'All Data'!$A$2:$L$1048576,O$1,FALSE)","v":23.267699999999998},{"$f":"VLOOKUP(($B12&\"_\"&P$2&\"_\"&P$3&\"_\"&P$4&\"_\"&$A12),'All Data'!$A$2:$L$1048576,P$1,FALSE)","v":29.052240000000001},{"$f":"VLOOKUP(($B12&\"_\"&Q$2&\"_\"&Q$3&\"_\"&Q$4&\"_\"&$A12),'All Data'!$A$2:$L$1048576,Q$1,FALSE)","v":2.2382460000000002},{"$f":"VLOOKUP(($B12&\"_\"&R$2&\"_\"&R$3&\"_\"&R$4&\"_\"&$A12),'All Data'!$A$2:$L$1048576,R$1,FALSE)","v":2.4946139999999999},{"$f":"VLOOKUP(($B12&\"_\"&S$2&\"_\"&S$3&\"_\"&S$4&\"_\"&$A12),'All Data'!$A$2:$L$1048576,S$1,FALSE)","v":28.832090000000001},{"$f":"VLOOKUP(($B12&\"_\"&T$2&\"_\"&T$3&\"_\"&T$4&\"_\"&$A12),'All Data'!$A$2:$L$1048576,T$1,FALSE)","v":34.656779999999998},{"$f":"VLOOKUP(($B12&\"_\"&U$2&\"_\"&U$3&\"_\"&U$4&\"_\"&$A12),'All Data'!$A$2:$L$1048576,U$1,FALSE)","v":51.403770000000002},{"$f":"VLOOKUP(($B12&\"_\"&V$2&\"_\"&V$3&\"_\"&V$4&\"_\"&$A12),'All Data'!$A$2:$L$1048576,V$1,FALSE)","v":57.29533},{"$f":"VLOOKUP(($B12&\"_\"&W$2&\"_\"&W$3&\"_\"&W$4&\"_\"&$A12),'All Data'!$A$2:$L$1048576,W$1,FALSE)","v":351.2045},{"$f":"VLOOKUP(($B12&\"_\"&X$2&\"_\"&X$3&\"_\"&X$4&\"_\"&$A12),'All Data'!$A$2:$L$1048576,X$1,FALSE)","v":418.61322000000001},{"$f":"VLOOKUP(($B12&\"_\"&Y$2&\"_\"&Y$3&\"_\"&Y$4&\"_\"&$A12),'All Data'!$A$2:$L$1048576,Y$1,FALSE)","v":422.72622999999999},{"$f":"VLOOKUP(($B12&\"_\"&Z$2&\"_\"&Z$3&\"_\"&Z$4&\"_\"&$A12),'All Data'!$A$2:$L$1048576,Z$1,FALSE)","v":528.61239},{"$f":"VLOOKUP(($B12&\"_\"&AA$2&\"_\"&AA$3&\"_\"&AA$4&\"_\"&$A12),'All Data'!$A$2:$L$1048576,AA$1,FALSE)","v":256.36304000000001},{"$f":"VLOOKUP(($B12&\"_\"&AB$2&\"_\"&AB$3&\"_\"&AB$4&\"_\"&$A12),'All Data'!$A$2:$L$1048576,AB$1,FALSE)","v":341.25378000000001},{"$f":"VLOOKUP(($B12&\"_\"&AC$2&\"_\"&AC$3&\"_\"&AC$4&\"_\"&$A12),'All Data'!$A$2:$L$1048576,AC$1,FALSE)","v":34.756803455723542},{"$f":"VLOOKUP(($B12&\"_\"&AD$2&\"_\"&AD$3&\"_\"&AD$4&\"_\"&$A12),'All Data'!$A$2:$L$1048576,AD$1,FALSE)","v":52.064362850971918},{"$f":"VLOOKUP(($B12&\"_\"&AE$2&\"_\"&AE$3&\"_\"&AE$4&\"_\"&$A12),'All Data'!$A$2:$L$1048576,AE$1,FALSE)","v":406.99666000000002},{"$f":"VLOOKUP(($B12&\"_\"&AF$2&\"_\"&AF$3&\"_\"&AF$4&\"_\"&$A12),'All Data'!$A$2:$L$1048576,AF$1,FALSE)","v":574.48985000000005},{"$f":"VLOOKUP(($B12&\"_\"&AG$2&\"_\"&AG$3&\"_\"&AG$4&\"_\"&$A12),'All Data'!$A$2:$L$1048576,AG$1,FALSE)","v":231.16972999999999},{"$f":"VLOOKUP(($B12&\"_\"&AH$2&\"_\"&AH$3&\"_\"&AH$4&\"_\"&$A12),'All Data'!$A$2:$L$1048576,AH$1,FALSE)","v":460.38342},{"$f":"VLOOKUP(($B12&\"_\"&AI$2&\"_\"&AI$3&\"_\"&AI$4&\"_\"&$A12),'All Data'!$A$2:$L$1048576,AI$1,FALSE)","v":473.70765999999998},{"$f":"VLOOKUP(($B12&\"_\"&AJ$2&\"_\"&AJ$3&\"_\"&AJ$4&\"_\"&$A12),'All Data'!$A$2:$L$1048576,AJ$1,FALSE)","v":717.06965000000002},{"$f":"VLOOKUP(($B12&\"_\"&AK$2&\"_\"&AK$3&\"_\"&AK$4&\"_\"&$A12),'All Data'!$A$2:$L$1048576,AK$1,FALSE)","v":82.9392945361557},{"$f":"VLOOKUP(($B12&\"_\"&AL$2&\"_\"&AL$3&\"_\"&AL$4&\"_\"&$A12),'All Data'!$A$2:$L$1048576,AL$1,FALSE)","v":86.430183481808797}]
["LA","Powys",{"$f":"VLOOKUP(($B13&\"_\"&C$2&\"_\"&C$3&\"_\"&C$4&\"_\"&$A13),'All Data'!$A$2:$L$1048576,C$1,FALSE)","v":0},{"$f":"VLOOKUP(($B13&\"_\"&D$2&\"_\"&D$3&\"_\"&D$4&\"_\"&$A13),'All Data'!$A$2:$L$1048576,D$1,FALSE)","v":0},{"$f":"VLOOKUP(($B13&\"_\"&E$2&\"_\"&E$3&\"_\"&E$4&\"_\"&$A13),'All Data'!$A$2:$L$1048576,E$1,FALSE)","v":0},{"$f":"VLOOKUP(($B13&\"_\"&F$2&\"_\"&F$3&\"_\"&F$4&\"_\"&$A13),'All Data'!$A$2:$L$1048576,F$1,FALSE)","v":0},{"$f":"VLOOKUP(($B13&\"_\"&G$2&\"_\"&G$3&\"_\"&G$4&\"_\"&$A13),'All Data'!$A$2:$L$1048576,G$1,FALSE)","v":-0.49527690000000002},{"$f":"VLOOKUP(($B13&\"_\"&H$2&\"_\"&H$3&\"_\"&H$4&\"_\"&$A13),'All Data'!$A$2:$L$1048576,H$1,FALSE)","v":11.44021},{"$f":"VLOOKUP(($B13&\"_\"&I$2&\"_\"&I$3&\"_\"&I$4&\"_\"&$A13),'All Data'!$A$2:$L$1048576,I$1,FALSE)","v":-4.0372440000000003},{"$f":"VLOOKUP(($B13&\"_\"&J$2&\"_\"&J$3&\"_\"&J$4&\"_\"&$A13),'All Data'!$A$2:$L$1048576,J$1,FALSE)","v":13.85472},{"$f":"VLOOKUP(($B13&\"_\"&K$2&\"_\"&K$3&\"_\"&K$4&\"_\"&$A13),'All Data'!$A$2:$L$1048576,K$1,FALSE)","v":77.070390000000003},{"$f":"VLOOKUP(($B13&\"_\"&L$2&\"_\"&L$3&\"_\"&L$4&\"_\"&$A13),'All Data'!$A$2:$L$1048576,L$1,FALSE)","v":82.573810000000009},{"$f":"VLOOKUP(($B13&\"_\"&M$2&\"_\"&M$3&\"_\"&M$4&\"_\"&$A13),'All Data'!$A$2:$L$1048576,M$1,FALSE)","v":{"$error":"#N/A"}},{"$f":"VLOOKUP(($B13&\"_\"&N$2&\"_\"&N$3&\"_\"&N$4&\"_\"&$A13),'All Data'!$A$2:$L$1048576,N$1,FALSE)","v":{"$error":"#N/A"}},{"$f":"VLOOKUP(($B13&\"_\"&O$2&\"_\"&O$3&\"_\"&O$4&\"_\"&$A13),'All Data'!$A$2:$L$1048576,O$1,FALSE)","v":19.8109},{"$f":"VLOOKUP(($B13&\"_\"&P$2&\"_\"&P$3&\"_\"&P$4&\"_\"&$A13),'All Data'!$A$2:$L$1048576,P$1,FALSE)","v":25.693700000000003},{"$f":"VLOOKUP(($B13&\"_\"&Q$2&\"_\"&Q$3&\"_\"&Q$4&\"_\"&$A13),'All Data'!$A$2:$L$1048576,Q$1,FALSE)","v":2.6259760000000001},{"$f":"VLOOKUP(($B13&\"_\"&R$2&\"_\"&R$3&\"_\"&R$4&\"_\"&$A13),'All Data'!$A$2:$L$1048576,R$1,FALSE)","v":2.8918270000000001},{"$f":"VLOOKUP(($B13&\"_\"&S$2&\"_\"&S$3&\"_\"&S$4&\"_\"&$A13),'All Data'!$A$2:$L$1048576,S$1,FALSE)","v":33.775570000000002},{"$f":"VLOOKUP(($B13&\"_\"&T$2&\"_\"&T$3&\"_\"&T$4&\"_\"&$A13),'All Data'!$A$2:$L$1048576,T$1,FALSE)","v":40.363979999999998},{"$f":"VLOOKUP(($B13&\"_\"&U$2&\"_\"&U$3&\"_\"&U$4&\"_\"&$A13),'All Data'!$A$2:$L$1048576,U$1,FALSE)","v":52.762450000000008},{"$f":"VLOOKUP(($B13&\"_\"&V$2&\"_\"&V$3&\"_\"&V$4&\"_\"&$A13),'All Data'!$A$2:$L$1048576,V$1,FALSE)","v":59.183779999999999},{"$f":"VLOOKUP(($B13&\"_\"&W$2&\"_\"&W$3&\"_\"&W$4&\"_\"&$A13),'All Data'!$A$2:$L$1048576,W$1,FALSE)","v":193.4983},{"$f":"VLOOKUP(($B13&\"_\"&X$2&\"_\"&X$3&\"_\"&X$4&\"_\"&$A13),'All Data'!$A$2:$L$1048576,X$1,FALSE)","v":248.70436000000001},{"$f":"VLOOKUP(($B13&\"_\"&Y$2&\"_\"&Y$3&\"_\"&Y$4&\"_\"&$A13),'All Data'!$A$2:$L$1048576,Y$1,FALSE)","v":261.83452},{"$f":"VLOOKUP(($B13&\"_\"&Z$2&\"_\"&Z$3&\"_\"&Z$4&\"_\"&$A13),'All Data'!$A$2:$L$1048576,Z$1,FALSE)","v":353.29257999999999},{"$f":"VLOOKUP(($B13&\"_\"&AA$2&\"_\"&AA$3&\"_\"&AA$4&\"_\"&$A13),'All Data'!$A$2:$L$1048576,AA$1,FALSE)","v":105.40588},{"$f":"VLOOKUP(($B13&\"_\"&AB$2&\"_\"&AB$3&\"_\"&AB$4&\"_\"&$A13),'All Data'!$A$2:$L$1048576,AB$1,FALSE)","v":167.22681},{"$f":"VLOOKUP(($B13&\"_\"&AC$2&\"_\"&AC$3&\"_\"&AC$4&\"_\"&$A13),'All Data'!$A$2:$L$1048576,AC$1,FALSE)","v":18.148580318942045},{"$f":"VLOOKUP(($B13&\"_\"&AD$2&\"_\"&AD$3&\"_\"&AD$4&\"_\"&$A13),'All Data'!$A$2:$L$1048576,AD$1,FALSE)","v":30.477246207701281},{"$f":"VLOOKUP(($B13&\"_\"&AE$2&\"_\"&AE$3&\"_\"&AE$4&\"_\"&$A13),'All Data'!$A$2:$L$1048576,AE$1,FALSE)","v":536.83633999999995},{"$f":"VLOOKUP(($B13&\"_\"&AF$2&\"_\"&AF$3&\"_\"&AF$4&\"_\"&$A13),'All Data'!$A$2:$L$1048576,AF$1,FALSE)","v":700.17668000000003},{"$f":"VLOOKUP(($B13&\"_\"&AG$2&\"_\"&AG$3&\"_\"&AG$4&\"_\"&$A13),'All Data'!$A$2:$L$1048576,AG$1,FALSE)","v":274.07488000000001},{"$f":"VLOOKUP(($B13&\"_\"&AH$2&\"_\"&AH$3&\"_\"&AH$4&\"_\"&$A13),'All Data'!$A$2:$L$1048576,AH$1,FALSE)","v":469.64096000000001},{"$f":"VLOOKUP(($B13&\"_\"&AI$2&\"_\"&AI$3&\"_\"&AI$4&\"_\"&$A13),'All Data'!$A$2:$L$1048576,AI$1,FALSE)","v":681.24068999999997},{"$f":"VLOOKUP(($B13&\"_\"&AJ$2&\"_\"&AJ$3&\"_\"&AJ$4&\"_\"&$A13),'All Data'!$A$2:$L$1048576,AJ$1,FALSE)","v":932.70222000000001},{"$f":"VLOOKUP(($B13&\"_\"&AK$2&\"_\"&AK$3&\"_\"&AK$4&\"_\"&$A13),'All Data'!$A$2:$L$1048576,AK$1,FALSE)","v":79.183204060416742},{"$f":"VLOOKUP(($B13&\"_\"&AL$2&\"_\"&AL$3&\"_\"&AL$4&\"_\"&$A13),'All Data'!$A$2:$L$1048576,AL$1,FALSE)","v":83.451605442183137}]
["LA","Ceredigion",{"$f":"VLOOKUP(($B14&\"_\"&C$2&\"_\"&C$3&\"_\"&C$4&\"_\"&$A14),'All Data'!$A$2:$L$1048576,C$1,FALSE)","v":0},{"$f":"VLOOKUP(($B14&\"_\"&D$2&\"_\"&D$3&\"_\"&D$4&\"_\"&$A14),'All Data'!$A$2:$L$1048576,D$1,FALSE)","v":0},{"$f":"VLOOKUP(($B14&\"_\"&E$2&\"_\"&E$3&\"_\"&E$4&\"_\"&$A14),'All Data'!$A$2:$L$1048576,E$1,FALSE)","v":0},{"$f":"VLOOKUP(($B14&\"_\"&F$2&\"_\"&F$3&\"_\"&F$4&\"_\"&$A14),'All Data'!$A$2:$L$1048576,F$1,FALSE)","v":0},{"$f":"VLOOKUP(($B14&\"_\"&G$2&\"_\"&G$3&\"_\"&G$4&\"_\"&$A14),'All Data'!$A$2:$L$1048576,G$1,FALSE)","v":2.851477},{"$f":"VLOOKUP(($B14&\"_\"&H$2&\"_\"&H$3&\"_\"&H$4&\"_\"&$A14),'All Data'!$A$2:$L$1048576,H$1,FALSE)","v":12.485049999999999},{"$f":"VLOOKUP(($B14&\"_\"&I$2&\"_\"&I$3&\"_\"&I$4&\"_\"&$A14),'All Data'!$A$2:$L$1048576,I$1,FALSE)","v":-1.0924240000000001},{"$f":"VLOOKUP(($B14&\"_\"&J$2&\"_\"&J$3&\"_\"&J$4&\"_\"&$A14),'All Data'!$A$2:$L$1048576,J$1,FALSE)","v":3.5375770000000002},{"$f":"VLOOKUP(($B14&\"_\"&K$2&\"_\"&K$3&\"_\"&K$4&\"_\"&$A14),'All Data'!$A$2:$L$1048576,K$1,FALSE)","v":78.069599999999994},{"$f":"VLOOKUP(($B14&\"_\"&L$2&\"_\"&L$3&\"_\"&L$4&\"_\"&$A14),'All Data'!$A$2:$L$1048576,L$1,FALSE)","v":83.142079999999993},{"$f":"VLOOKUP(($B14&\"_\"&M$2&\"_\"&M$3&\"_\"&M$4&\"_\"&$A14),'All Data'!$A$2:$L$1048576,M$1,FALSE)","v":{"$error":"#N/A"}},{"$f":"VLOOKUP(($B14&\"_\"&N$2&\"_\"&N$3&\"_\"&N$4&\"_\"&$A14),'All Data'!$A$2:$L$1048576,N$1,FALSE)","v":{"$error":"#N/A"}},{"$f":"VLOOKUP(($B14&\"_\"&O$2&\"_\"&O$3&\"_\"&O$4&\"_\"&$A14),'All Data'!$A$2:$L$1048576,O$1,FALSE)","v":19.99239},{"$f":"VLOOKUP(($B14&\"_\"&P$2&\"_\"&P$3&\"_\"&P$4&\"_\"&$A14),'All Data'!$A$2:$L$1048576,P$1,FALSE)","v":25.774760000000001},{"$f":"VLOOKUP(($B14&\"_\"&Q$2&\"_\"&Q$3&\"_\"&Q$4&\"_\"&$A14),'All Data'!$A$2:$L$1048576,Q$1,FALSE)","v":2.5431650000000001},{"$f":"VLOOKUP(($B14&\"_\"&R$2&\"_\"&R$3&\"_\"&R$4&\"_\"&$A14),'All Data'!$A$2:$L$1048576,R$1,FALSE)","v":2.805847},{"$f":"VLOOKUP(($B14&\"_\"&S$2&\"_\"&S$3&\"_\"&S$4&\"_\"&$A14),'All Data'!$A$2:$L$1048576,S$1,FALSE)","v":37.88317},{"$f":"VLOOKUP(($B14&\"_\"&T$2&\"_\"&T$3&\"_\"&T$4&\"_\"&$A14),'All Data'!$A$2:$L$1048576,T$1,FALSE)","v":44.244749999999996},{"$f":"VLOOKUP(($B14&\"_\"&U$2&\"_\"&U$3&\"_\"&U$4&\"_\"&$A14),'All Data'!$A$2:$L$1048576,U$1,FALSE)","v":50.311760000000007},{"$f":"VLOOKUP(($B14&\"_\"&V$2&\"_\"&V$3&\"_\"&V$4&\"_\"&$A14),'All Data'!$A$2:$L$1048576,V$1,FALSE)","v":56.61647},{"$f":"VLOOKUP(($B14&\"_\"&W$2&\"_\"&W$3&\"_\"&W$4&\"_\"&$A14),'All Data'!$A$2:$L$1048576,W$1,FALSE)","v":156.51338999999999},{"$f":"VLOOKUP(($B14&\"_\"&X$2&\"_\"&X$3&\"_\"&X$4&\"_\"&$A14),'All Data'!$A$2:$L$1048576,X$1,FALSE)","v":225.04822999999999},{"$f":"VLOOKUP(($B14&\"_\"&Y$2&\"_\"&Y$3&\"_\"&Y$4&\"_\"&$A14),'All Data'!$A$2:$L$1048576,Y$1,FALSE)","v":210.13822999999999},{"$f":"VLOOKUP(($B14&\"_\"&Z$2&\"_\"&Z$3&\"_\"&Z$4&\"_\"&$A14),'All Data'!$A$2:$L$1048576,Z$1,FALSE)","v":328.82234},{"$f":"VLOOKUP(($B14&\"_\"&AA$2&\"_\"&AA$3&\"_\"&AA$4&\"_\"&$A14),'All Data'!$A$2:$L$1048576,AA$1,FALSE)","v":83.471940000000004},{"$f":"VLOOKUP(($B14&\"_\"&AB$2&\"_\"&AB$3&\"_\"&AB$4&\"_\"&$A14),'All Data'!$A$2:$L$1048576,AB$1,FALSE)","v":159.42984999999999},{"$f":"VLOOKUP(($B14&\"_\"&AC$2&\"_\"&AC$3&\"_\"&AC$4&\"_\"&$A14),'All Data'!$A$2:$L$1048576,AC$1,FALSE)","v":15.22100313479624},{"$f":"VLOOKUP(($B14&\"_\"&AD$2&\"_\"&AD$3&\"_\"&AD$4&\"_\"&$A14),'All Data'!$A$2:$L$1048576,AD$1,FALSE)","v":32.640282131661444},{"$f":"VLOOKUP(($B14&\"_\"&AE$2&\"_\"&AE$3&\"_\"&AE$4&\"_\"&$A14),'All Data'!$A$2:$L$1048576,AE$1,FALSE)","v":407.9042},{"$f":"VLOOKUP(($B14&\"_\"&AF$2&\"_\"&AF$3&\"_\"&AF$4&\"_\"&$A14),'All Data'!$A$2:$L$1048576,AF$1,FALSE)","v":605.29593},{"$f":"VLOOKUP(($B14&\"_\"&AG$2&\"_\"&AG$3&\"_\"&AG$4&\"_\"&$A14),'All Data'!$A$2:$L$1048576,AG$1,FALSE)","v":236.31156999999999},{"$f":"VLOOKUP(($B14&\"_\"&AH$2&\"_\"&AH$3&\"_\"&AH$4&\"_\"&$A14),'All Data'!$A$2:$L$1048576,AH$1,FALSE)","v":492.18630000000002},{"$f":"VLOOKUP(($B14&\"_\"&AI$2&\"_\"&AI$3&\"_\"&AI$4&\"_\"&$A14),'All Data'!$A$2:$L$1048576,AI$1,FALSE)","v":493.95632999999998},{"$f":"VLOOKUP(($B14&\"_\"&AJ$2&\"_\"&AJ$3&\"_\"&AJ$4&\"_\"&$A14),'All Data'!$A$2:$L$1048576,AJ$1,FALSE)","v":802.20324000000005},{"$f":"VLOOKUP(($B14&\"_\"&AK$2&\"_\"&AK$3&\"_\"&AK$4&\"_\"&$A14),'All Data'!$A$2:$L$1048576,AK$1,FALSE)","v":80.761300633610162},{"$f":"VLOOKUP(($B14&\"_\"&AL$2&\"_\"&AL$3&\"_\"&AL$4&\"_\"&$A14),'All Data'!$A$2:$L$1048576,AL$1,FALSE)","v":86.432937966687845}]
["LA","Pembrokeshire",{"$f":"VLOOKUP(($B15&\"_\"&C$2&\"_\"&C$3&\"_\"&C$4&\"_\"&$A15),'All Data'!$A$2:$L$1048576,C$1,FALSE)","v":0},{"$f":"VLOOKUP(($B15&\"_\"&D$2&\"_\"&D$3&\"_\"&D$4&\"_\"&$A15),'All Data'!$A$2:$L$1048576,D$1,FALSE)","v":0},{"$f":"VLOOKUP(($B15&\"_\"&E$2&\"_\"&E$3&\"_\"&E$4&\"_\"&$A15),'All Data'!$A$2:$L$1048576,E$1,FALSE)","v":0},{"$f":"VLOOKUP(($B15&\"_\"&F$2&\"_\"&F$3&\"_\"&F$4&\"_\"&$A15),'All Data'!$A$2:$L$1048576,F$1,FALSE)","v":0},{"$f":"VLOOKUP(($B15&\"_\"&G$2&\"_\"&G$3&\"_\"&G$4&\"_\"&$A15),'All Data'!$A$2:$L$1048576,G$1,FALSE)","v":-2.4788670000000002},{"$f":"VLOOKUP(($B15&\"_\"&H$2&\"_\"&H$3&\"_\"&H$4&\"_\"&$A15),'All Data'!$A$2:$L$1048576,H$1,FALSE)","v":14.37415},{"$f":"VLOOKUP(($B15&\"_\"&I$2&\"_\"&I$3&\"_\"&I$4&\"_\"&$A15),'All Data'!$A$2:$L$1048576,I$1,FALSE)","v":2.1196000000000002},{"$f":"VLOOKUP(($B15&\"_\"&J$2&\"_\"&J$3&\"_\"&J$4&\"_\"&$A15),'All Data'!$A$2:$L$1048576,J$1,FALSE)","v":6.2336640000000001},{"$f":"VLOOKUP(($B15&\"_\"&K$2&\"_\"&K$3&\"_\"&K$4&\"_\"&$A15),'All Data'!$A$2:$L$1048576,K$1,FALSE)","v":76.062909999999988},{"$f":"VLOOKUP(($B15&\"_\"&L$2&\"_\"&L$3&\"_\"&L$4&\"_\"&$A15),'All Data'!$A$2:$L$1048576,L$1,FALSE)","v":81.071100000000001},{"$f":"VLOOKUP(($B15&\"_\"&M$2&\"_\"&M$3&\"_\"&M$4&\"_\"&$A15),'All Data'!$A$2:$L$1048576,M$1,FALSE)","v":{"$error":"#N/A"}},{"$f":"VLOOKUP(($B15&\"_\"&N$2&\"_\"&N$3&\"_\"&N$4&\"_\"&$A15),'All Data'!$A$2:$L$1048576,N$1,FALSE)","v":{"$error":"#N/A"}},{"$f":"VLOOKUP(($B15&\"_\"&O$2&\"_\"&O$3&\"_\"&O$4&\"_\"&$A15),'All Data'!$A$2:$L$1048576,O$1,FALSE)","v":19.97523},{"$f":"VLOOKUP(($B15&\"_\"&P$2&\"_\"&P$3&\"_\"&P$4&\"_\"&$A15),'All Data'!$A$2:$L$1048576,P$1,FALSE)","v":25.676739999999999},{"$f":"VLOOKUP(($B15&\"_\"&Q$2&\"_\"&Q$3&\"_\"&Q$4&\"_\"&$A15),'All Data'!$A$2:$L$1048576,Q$1,FALSE)","v":2.4700790000000001},{"$f":"VLOOKUP(($B15&\"_\"&R$2&\"_\"&R$3&\"_\"&R$4&\"_\"&$A15),'All Data'!$A$2:$L$1048576,R$1,FALSE)","v":2.7544149999999998},{"$f":"VLOOKUP(($B15&\"_\"&S$2&\"_\"&S$3&\"_\"&S$4&\"_\"&$A15),'All Data'!$A$2:$L$1048576,S$1,FALSE)","v":35.050409999999999},{"$f":"VLOOKUP(($B15&\"_\"&T$2&\"_\"&T$3&\"_\"&T$4&\"_\"&$A15),'All Data'!$A$2:$L$1048576,T$1,FALSE)","v":41.479300000000002},{"$f":"VLOOKUP(($B15&\"_\"&U$2&\"_\"&U$3&\"_\"&U$4&\"_\"&$A15),'All Data'!$A$2:$L$1048576,U$1,FALSE)","v":56.100680000000004},{"$f":"VLOOKUP(($B15&\"_\"&V$2&\"_\"&V$3&\"_\"&V$4&\"_\"&$A15),'All Data'!$A$2:$L$1048576,V$1,FALSE)","v":62.34066},{"$f":"VLOOKUP(($B15&\"_\"&W$2&\"_\"&W$3&\"_\"&W$4&\"_\"&$A15),'All Data'!$A$2:$L$1048576,W$1,FALSE)","v":263.51382000000001},{"$f":"VLOOKUP(($B15&\"_\"&X$2&\"_\"&X$3&\"_\"&X$4&\"_\"&$A15),'All Data'!$A$2:$L$1048576,X$1,FALSE)","v":328.88472000000002},{"$f":"VLOOKUP(($B15&\"_\"&Y$2&\"_\"&Y$3&\"_\"&Y$4&\"_\"&$A15),'All Data'!$A$2:$L$1048576,Y$1,FALSE)","v":337.44841000000002},{"$f":"VLOOKUP(($B15&\"_\"&Z$2&\"_\"&Z$3&\"_\"&Z$4&\"_\"&$A15),'All Data'!$A$2:$L$1048576,Z$1,FALSE)","v":443.54613999999998},{"$f":"VLOOKUP(($B15&\"_\"&AA$2&\"_\"&AA$3&\"_\"&AA$4&\"_\"&$A15),'All Data'!$A$2:$L$1048576,AA$1,FALSE)","v":171.09990999999999},{"$f":"VLOOKUP(($B15&\"_\"&AB$2&\"_\"&AB$3&\"_\"&AB$4&\"_\"&$A15),'All Data'!$A$2:$L$1048576,AB$1,FALSE)","v":250.83873},{"$f":"VLOOKUP(($B15&\"_\"&AC$2&\"_\"&AC$3&\"_\"&AC$4&\"_\"&$A15),'All Data'!$A$2:$L$1048576,AC$1,FALSE)","v":23.161290322580644},{"$f":"VLOOKUP(($B15&\"_\"&AD$2&\"_\"&AD$3&\"_\"&AD$4&\"_\"&$A15),'All Data'!$A$2:$L$1048576,AD$1,FALSE)","v":37.538624787775895},{"$f":"VLOOKUP(($B15&\"_\"&AE$2&\"_\"&AE$3&\"_\"&AE$4&\"_\"&$A15),'All Data'!$A$2:$L$1048576,AE$1,FALSE)","v":535.00612000000001},{"$f":"VLOOKUP(($B15&\"_\"&AF$2&\"_\"&AF$3&\"_\"&AF$4&\"_\"&$A15),'All Data'!$A$2:$L$1048576,AF$1,FALSE)","v":714.65544},{"$f":"VLOOKUP(($B15&\"_\"&AG$2&\"_\"&AG$3&\"_\"&AG$4&\"_\"&$A15),'All Data'!$A$2:$L$1048576,AG$1,FALSE)","v":309.82317},{"$f":"VLOOKUP(($B15&\"_\"&AH$2&\"_\"&AH$3&\"_\"&AH$4&\"_\"&$A15),'All Data'!$A$2:$L$1048576,AH$1,FALSE)","v":548.31985999999995},{"$f":"VLOOKUP(($B15&\"_\"&AI$2&\"_\"&AI$3&\"_\"&AI$4&\"_\"&$A15),'All Data'!$A$2:$L$1048576,AI$1,FALSE)","v":647.54444000000001},{"$f":"VLOOKUP(($B15&\"_\"&AJ$2&\"_\"&AJ$3&\"_\"&AJ$4&\"_\"&$A15),'All Data'!$A$2:$L$1048576,AJ$1,FALSE)","v":916.63633000000004},{"$f":"VLOOKUP(($B15&\"_\"&AK$2&\"_\"&AK$3&\"_\"&AK$4&\"_\"&$A15),'All Data'!$A$2:$L$1048576,AK$1,FALSE)","v":72.942979542770331},{"$f":"VLOOKUP(($B15&\"_\"&AL$2&\"_\"&AL$3&\"_\"&AL$4&\"_\"&$A15),'All Data'!$A$2:$L$1048576,AL$1,FALSE)","v":77.592576305978866}]
["LA","Carmarthenshire",{"$f":"VLOOKUP(($B16&\"_\"&C$2&\"_\"&C$3&\"_\"&C$4&\"_\"&$A16),'All Data'!$A$2:$L$1048576,C$1,FALSE)","v":0},{"$f":"VLOOKUP(($B16&\"_\"&D$2&\"_\"&D$3&\"_\"&D$4&\"_\"&$A16),'All Data'!$A$2:$L$1048576,D$1,FALSE)","v":0},{"$f":"VLOOKUP(($B16&\"_\"&E$2&\"_\"&E$3&\"_\"&E$4&\"_\"&$A16),'All Data'!$A$2:$L$1048576,E$1,FALSE)","v":0},{"$f":"VLOOKUP(($B16&\"_\"&F$2&\"_\"&F$3&\"_\"&F$4&\"_\"&$A16),'All Data'!$A$2:$L$1048576,F$1,FALSE)","v":0},{"$f":"VLOOKUP(($B16&\"_\"&G$2&\"_\"&G$3&\"_\"&G$4&\"_\"&$A16),'All Data'!$A$2:$L$1048576,G$1,FALSE)","v":-0.47629850000000001},{"$f":"VLOOKUP(($B16&\"_\"&H$2&\"_\"&H$3&\"_\"&H$4&\"_\"&$A16),'All Data'!$A$2:$L$1048576,H$1,FALSE)","v":11.981920000000001},{"$f":"VLOOKUP(($B16&\"_\"&I$2&\"_\"&I$3&\"_\"&I$4&\"_\"&$A16),'All Data'!$A$2:$L$1048576,I$1,FALSE)","v":0.26154149999999998},{"$f":"VLOOKUP(($B16&\"_\"&J$2&\"_\"&J$3&\"_\"&J$4&\"_\"&$A16),'All Data'!$A$2:$L$1048576,J$1,FALSE)","v":5.6163829999999999},{"$f":"VLOOKUP(($B16&\"_\"&K$2&\"_\"&K$3&\"_\"&K$4&\"_\"&$A16),'All Data'!$A$2:$L$1048576,K$1,FALSE)","v":69.186849999999993},{"$f":"VLOOKUP(($B16&\"_\"&L$2&\"_\"&L$3&\"_\"&L$4&\"_\"&$A16),'All Data'!$A$2:$L$1048576,L$1,FALSE)","v":74.44747000000001},{"$f":"VLOOKUP(($B16&\"_\"&M$2&\"_\"&M$3&\"_\"&M$4&\"_\"&$A16),'All Data'!$A$2:$L$1048576,M$1,FALSE)","v":{"$error":"#N/A"}},{"$f":"VLOOKUP(($B16&\"_\"&N$2&\"_\"&N$3&\"_\"&N$4&\"_\"&$A16),'All Data'!$A$2:$L$1048576,N$1,FALSE)","v":{"$error":"#N/A"}},{"$f":"VLOOKUP(($B16&\"_\"&O$2&\"_\"&O$3&\"_\"&O$4&\"_\"&$A16),'All Data'!$A$2:$L$1048576,O$1,FALSE)","v":20.140689999999999},{"$f":"VLOOKUP(($B16&\"_\"&P$2&\"_\"&P$3&\"_\"&P$4&\"_\"&$A16),'All Data'!$A$2:$L$1048576,P$1,FALSE)","v":25.470209999999998},{"$f":"VLOOKUP(($B16&\"_\"&Q$2&\"_\"&Q$3&\"_\"&Q$4&\"_\"&$A16),'All Data'!$A$2:$L$1048576,Q$1,FALSE)","v":2.2373270000000001},{"$f":"VLOOKUP(($B16&\"_\"&R$2&\"_\"&R$3&\"_\"&R$4&\"_\"&$A16),'All Data'!$A$2:$L$1048576,R$1,FALSE)","v":2.4842110000000002},{"$f":"VLOOKUP(($B16&\"_\"&S$2&\"_\"&S$3&\"_\"&S$4&\"_\"&$A16),'All Data'!$A$2:$L$1048576,S$1,FALSE)","v":37.09234},{"$f":"VLOOKUP(($B16&\"_\"&T$2&\"_\"&T$3&\"_\"&T$4&\"_\"&$A16),'All Data'!$A$2:$L$1048576,T$1,FALSE)","v":42.962689999999995},{"$f":"VLOOKUP(($B16&\"_\"&U$2&\"_\"&U$3&\"_\"&U$4&\"_\"&$A16),'All Data'!$A$2:$L$1048576,U$1,FALSE)","v":56.723970000000001},{"$f":"VLOOKUP(($B16&\"_\"&V$2&\"_\"&V$3&\"_\"&V$4&\"_\"&$A16),'All Data'!$A$2:$L$1048576,V$1,FALSE)","v":62.172539999999998},{"$f":"VLOOKUP(($B16&\"_\"&W$2&\"_\"&W$3&\"_\"&W$4&\"_\"&$A16),'All Data'!$A$2:$L$1048576,W$1,FALSE)","v":261.40352999999999},{"$f":"VLOOKUP(($B16&\"_\"&X$2&\"_\"&X$3&\"_\"&X$4&\"_\"&$A16),'All Data'!$A$2:$L$1048576,X$1,FALSE)","v":313.06137999999999},{"$f":"VLOOKUP(($B16&\"_\"&Y$2&\"_\"&Y$3&\"_\"&Y$4&\"_\"&$A16),'All Data'!$A$2:$L$1048576,Y$1,FALSE)","v":309.93295999999998},{"$f":"VLOOKUP(($B16&\"_\"&Z$2&\"_\"&Z$3&\"_\"&Z$4&\"_\"&$A16),'All Data'!$A$2:$L$1048576,Z$1,FALSE)","v":392.17806000000002},{"$f":"VLOOKUP(($B16&\"_\"&AA$2&\"_\"&AA$3&\"_\"&AA$4&\"_\"&$A16),'All Data'!$A$2:$L$1048576,AA$1,FALSE)","v":197.84764999999999},{"$f":"VLOOKUP(($B16&\"_\"&AB$2&\"_\"&AB$3&\"_\"&AB$4&\"_\"&$A16),'All Data'!$A$2:$L$1048576,AB$1,FALSE)","v":262.77838000000003},{"$f":"VLOOKUP(($B16&\"_\"&AC$2&\"_\"&AC$3&\"_\"&AC$4&\"_\"&$A16),'All Data'!$A$2:$L$1048576,AC$1,FALSE)","v":26.722951988136273},{"$f":"VLOOKUP(($B16&\"_\"&AD$2&\"_\"&AD$3&\"_\"&AD$4&\"_\"&$A16),'All Data'!$A$2:$L$1048576,AD$1,FALSE)","v":39.199019023231259},{"$f":"VLOOKUP(($B16&\"_\"&AE$2&\"_\"&AE$3&\"_\"&AE$4&\"_\"&$A16),'All Data'!$A$2:$L$1048576,AE$1,FALSE)","v":582.83338000000003},{"$f":"VLOOKUP(($B16&\"_\"&AF$2&\"_\"&AF$3&\"_\"&AF$4&\"_\"&$A16),'All Data'!$A$2:$L$1048576,AF$1,FALSE)","v":732.46767},{"$f":"VLOOKUP(($B16&\"_\"&AG$2&\"_\"&AG$3&\"_\"&AG$4&\"_\"&$A16),'All Data'!$A$2:$L$1048576,AG$1,FALSE)","v":414.46634},{"$f":"VLOOKUP(($B16&\"_\"&AH$2&\"_\"&AH$3&\"_\"&AH$4&\"_\"&$A16),'All Data'!$A$2:$L$1048576,AH$1,FALSE)","v":628.24359000000004},{"$f":"VLOOKUP(($B16&\"_\"&AI$2&\"_\"&AI$3&\"_\"&AI$4&\"_\"&$A16),'All Data'!$A$2:$L$1048576,AI$1,FALSE)","v":657.87057000000004},{"$f":"VLOOKUP(($B16&\"_\"&AJ$2&\"_\"&AJ$3&\"_\"&AJ$4&\"_\"&$A16),'All Data'!$A$2:$L$1048576,AJ$1,FALSE)","v":873.12228000000005},{"$f":"VLOOKUP(($B16&\"_\"&AK$2&\"_\"&AK$3&\"_\"&AK$4&\"_\"&$A16),'All Data'!$A$2:$L$1048576,AK$1,FALSE)","v":76.78365337075401},{"$f":"VLOOKUP(($B16&\"_\"&AL$2&\"_\"&AL$3&\"_\"&AL$4&\"_\"&$A16),'All Data'!$A$2:$L$1048576,AL$1,FALSE)","v":80.356618737444478}]
["LA","Swansea",{"$f":"VLOOKUP(($B17&\"_\"&C$2&\"_\"&C$3&\"_\"&C$4&\"_\"&$A17),'All Data'!$A$2:$L$1048576,C$1,FALSE)","v":0},{"$f":"VLOOKUP(($B17&\"_\"&D$2&\"_\"&D$3&\"_\"&D$4&\"_\"&$A17),'All Data'!$A$2:$L$1048576,D$1,FALSE)","v":0},{"$f":"VLOOKUP(($B17&\"_\"&E$2&\"_\"&E$3&\"_\"&E$4&\"_\"&$A17),'All Data'!$A$2:$L$1048576,E$1,FALSE)","v":0},{"$f":"VLOOKUP(($B17&\"_\"&F$2&\"_\"&F$3&\"_\"&F$4&\"_\"&$A17),'All Data'!$A$2:$L$1048576,F$1,FALSE)","v":0},{"$f":"VLOOKUP(($B17&\"_\"&G$2&\"_\"&G$3&\"_\"&G$4&\"_\"&$A17),'All Data'!$A$2:$L$1048576,G$1,FALSE)","v":9.2075390000000006},{"$f":"VLOOKUP(($B17&\"_\"&H$2&\"_\"&H$3&\"_\"&H$4&\"_\"&$A17),'All Data'!$A$2:$L$1048576,H$1,FALSE)","v":15.133419999999999},{"$f":"VLOOKUP(($B17&\"_\"&I$2&\"_\"&I$3&\"_\"&I$4&\"_\"&$A17),'All Data'!$A$2:$L$1048576,I$1,FALSE)","v":5.3445780000000003},{"$f":"VLOOKUP(($B17&\"_\"&J$2&\"_\"&J$3&\"_\"&J$4&\"_\"&$A17),'All Data'!$A$2:$L$1048576,J$1,FALSE)","v":9.4119829999999993},{"$f":"VLOOKUP(($B17&\"_\"&K$2&\"_\"&K$3&\"_\"&K$4&\"_\"&$A17),'All Data'!$A$2:$L$1048576,K$1,FALSE)","v":72.635000000000005},{"$f":"VLOOKUP(($B17&\"_\"&L$2&\"_\"&L$3&\"_\"&L$4&\"_\"&$A17),'All Data'!$A$2:$L$1048576,L$1,FALSE)","v":77.120440000000002},{"$f":"VLOOKUP(($B17&\"_\"&M$2&\"_\"&M$3&\"_\"&M$4&\"_\"&$A17),'All Data'!$A$2:$L$1048576,M$1,FALSE)","v":{"$error":"#N/A"}},{"$f":"VLOOKUP(($B17&\"_\"&N$2&\"_\"&N$3&\"_\"&N$4&\"_\"&$A17),'All Data'!$A$2:$L$1048576,N$1,FALSE)","v":{"$error":"#N/A"}},{"$f":"VLOOKUP(($B17&\"_\"&O$2&\"_\"&O$3&\"_\"&O$4&\"_\"&$A17),'All Data'!$A$2:$L$1048576,O$1,FALSE)","v":19.714979999999997},{"$f":"VLOOKUP(($B17&\"_\"&P$2&\"_\"&P$3&\"_\"&P$4&\"_\"&$A17),'All Data'!$A$2:$L$1048576,P$1,FALSE)","v":24.209720000000001},{"$f":"VLOOKUP(($B17&\"_\"&Q$2&\"_\"&Q$3&\"_\"&Q$4&\"_\"&$A17),'All Data'!$A$2:$L$1048576,Q$1,FALSE)","v":2.2200120000000001},{"$f":"VLOOKUP(($B17&\"_\"&R$2&\"_\"&R$3&\"_\"&R$4&\"_\"&$A17),'All Data'!$A$2:$L$1048576,R$1,FALSE)","v":2.430469},{"$f":"VLOOKUP(($B17&\"_\"&S$2&\"_\"&S$3&\"_\"&S$4&\"_\"&$A17),'All Data'!$A$2:$L$1048576,S$1,FALSE)","v":35.335450000000002},{"$f":"VLOOKUP(($B17&\"_\"&T$2&\"_\"&T$3&\"_\"&T$4&\"_\"&$A17),'All Data'!$A$2:$L$1048576,T$1,FALSE)","v":40.602460000000001},{"$f":"VLOOKUP(($B17&\"_\"&U$2&\"_\"&U$3&\"_\"&U$4&\"_\"&$A17),'All Data'!$A$2:$L$1048576,U$1,FALSE)","v":54.009640000000005},{"$f":"VLOOKUP(($B17&\"_\"&V$2&\"_\"&V$3&\"_\"&V$4&\"_\"&$A17),'All Data'!$A$2:$L$1048576,V$1,FALSE)","v":59.215430000000005},{"$f":"VLOOKUP(($B17&\"_\"&W$2&\"_\"&W$3&\"_\"&W$4&\"_\"&$A17),'All Data'!$A$2:$L$1048576,W$1,FALSE)","v":290.89451000000003},{"$f":"VLOOKUP(($B17&\"_\"&X$2&\"_\"&X$3&\"_\"&X$4&\"_\"&$A17),'All Data'!$A$2:$L$1048576,X$1,FALSE)","v":337.66649999999998},{"$f":"VLOOKUP(($B17&\"_\"&Y$2&\"_\"&Y$3&\"_\"&Y$4&\"_\"&$A17),'All Data'!$A$2:$L$1048576,Y$1,FALSE)","v":402.99572999999998},{"$f":"VLOOKUP(($B17&\"_\"&Z$2&\"_\"&Z$3&\"_\"&Z$4&\"_\"&$A17),'All Data'!$A$2:$L$1048576,Z$1,FALSE)","v":481.80887999999999},{"$f":"VLOOKUP(($B17&\"_\"&AA$2&\"_\"&AA$3&\"_\"&AA$4&\"_\"&$A17),'All Data'!$A$2:$L$1048576,AA$1,FALSE)","v":167.50418999999999},{"$f":"VLOOKUP(($B17&\"_\"&AB$2&\"_\"&AB$3&\"_\"&AB$4&\"_\"&$A17),'All Data'!$A$2:$L$1048576,AB$1,FALSE)","v":220.02967000000001},{"$f":"VLOOKUP(($B17&\"_\"&AC$2&\"_\"&AC$3&\"_\"&AC$4&\"_\"&$A17),'All Data'!$A$2:$L$1048576,AC$1,FALSE)","v":33.593903954599675},{"$f":"VLOOKUP(($B17&\"_\"&AD$2&\"_\"&AD$3&\"_\"&AD$4&\"_\"&$A17),'All Data'!$A$2:$L$1048576,AD$1,FALSE)","v":46.741906713218562},{"$f":"VLOOKUP(($B17&\"_\"&AE$2&\"_\"&AE$3&\"_\"&AE$4&\"_\"&$A17),'All Data'!$A$2:$L$1048576,AE$1,FALSE)","v":481.60448000000002},{"$f":"VLOOKUP(($B17&\"_\"&AF$2&\"_\"&AF$3&\"_\"&AF$4&\"_\"&$A17),'All Data'!$A$2:$L$1048576,AF$1,FALSE)","v":613.06569999999999},{"$f":"VLOOKUP(($B17&\"_\"&AG$2&\"_\"&AG$3&\"_\"&AG$4&\"_\"&$A17),'All Data'!$A$2:$L$1048576,AG$1,FALSE)","v":306.02076},{"$f":"VLOOKUP(($B17&\"_\"&AH$2&\"_\"&AH$3&\"_\"&AH$4&\"_\"&$A17),'All Data'!$A$2:$L$1048576,AH$1,FALSE)","v":486.84374000000003},{"$f":"VLOOKUP(($B17&\"_\"&AI$2&\"_\"&AI$3&\"_\"&AI$4&\"_\"&$A17),'All Data'!$A$2:$L$1048576,AI$1,FALSE)","v":549.90408000000002},{"$f":"VLOOKUP(($B17&\"_\"&AJ$2&\"_\"&AJ$3&\"_\"&AJ$4&\"_\"&$A17),'All Data'!$A$2:$L$1048576,AJ$1,FALSE)","v":732.67443000000003},{"$f":"VLOOKUP(($B17&\"_\"&AK$2&\"_\"&AK$3&\"_\"&AK$4&\"_\"&$A17),'All Data'!$A$2:$L$1048576,AK$1,FALSE)","v":78.5355975550099},{"$f":"VLOOKUP(($B17&\"_\"&AL$2&\"_\"&AL$3&\"_\"&AL$4&\"_\"&$A17),'All Data'!$A$2:$L$1048576,AL$1,FALSE)","v":81.541572324809209}]
["LA","Neath Port Talbot",{"$f":"VLOOKUP(($B18&\"_\"&C$2&\"_\"&C$3&\"_\"&C$4&\"_\"&$A18),'All Data'!$A$2:$L$1048576,C$1,FALSE)","v":0},{"$f":"VLOOKUP(($B18&\"_\"&D$2&\"_\"&D$3&\"_\"&D$4&\"_\"&$A18),'All Data'!$A$2:$L$1048576,D$1,FALSE)","v":0},{"$f":"VLOOKUP(($B18&\"_\"&E$2&\"_\"&E$3&\"_\"&E$4&\"_\"&$A18),'All Data'!$A$2:$L$1048576,E$1,FALSE)","v":0},{"$f":"VLOOKUP(($B18&\"_\"&F$2&\"_\"&F$3&\"_\"&F$4&\"_\"&$A18),'All Data'!$A$2:$L$1048576,F$1,FALSE)","v":0},{"$f":"VLOOKUP(($B18&\"_\"&G$2&\"_\"&G$3&\"_\"&G$4&\"_\"&$A18),'All Data'!$A$2:$L$1048576,G$1,FALSE)","v":7.9771660000000004},{"$f":"VLOOKUP(($B18&\"_\"&H$2&\"_\"&H$3&\"_\"&H$4&\"_\"&$A18),'All Data'!$A$2:$L$1048576,H$1,FALSE)","v":12.85454},{"$f":"VLOOKUP(($B18&\"_\"&I$2&\"_\"&I$3&\"_\"&I$4&\"_\"&$A18),'All Data'!$A$2:$L$1048576,I$1,FALSE)","v":4.055021},{"$f":"VLOOKUP(($B18&\"_\"&J$2&\"_\"&J$3&\"_\"&J$4&\"_\"&$A18),'All Data'!$A$2:$L$1048576,J$1,FALSE)","v":9.4149940000000001},{"$f":"VLOOKUP(($B18&\"_\"&K$2&\"_\"&K$3&\"_\"&K$4&\"_\"&$A18),'All Data'!$A$2:$L$1048576,K$1,FALSE)","v":68.179460000000006},{"$f":"VLOOKUP(($B18&\"_\"&L$2&\"_\"&L$3&\"_\"&L$4&\"_\"&$A18),'All Data'!$A$2:$L$1048576,L$1,FALSE)","v":73.393349999999998},{"$f":"VLOOKUP(($B18&\"_\"&M$2&\"_\"&M$3&\"_\"&M$4&\"_\"&$A18),'All Data'!$A$2:$L$1048576,M$1,FALSE)","v":{"$error":"#N/A"}},{"$f":"VLOOKUP(($B18&\"_\"&N$2&\"_\"&N$3&\"_\"&N$4&\"_\"&$A18),'All Data'!$A$2:$L$1048576,N$1,FALSE)","v":{"$error":"#N/A"}},{"$f":"VLOOKUP(($B18&\"_\"&O$2&\"_\"&O$3&\"_\"&O$4&\"_\"&$A18),'All Data'!$A$2:$L$1048576,O$1,FALSE)","v":23.169039999999999},{"$f":"VLOOKUP(($B18&\"_\"&P$2&\"_\"&P$3&\"_\"&P$4&\"_\"&$A18),'All Data'!$A$2:$L$1048576,P$1,FALSE)","v":28.714869999999998},{"$f":"VLOOKUP(($B18&\"_\"&Q$2&\"_\"&Q$3&\"_\"&Q$4&\"_\"&$A18),'All Data'!$A$2:$L$1048576,Q$1,FALSE)","v":2.0103930000000001},{"$f":"VLOOKUP(($B18&\"_\"&R$2&\"_\"&R$3&\"_\"&R$4&\"_\"&$A18),'All Data'!$A$2:$L$1048576,R$1,FALSE)","v":2.2504550000000001},{"$f":"VLOOKUP(($B18&\"_\"&S$2&\"_\"&S$3&\"_\"&S$4&\"_\"&$A18),'All Data'!$A$2:$L$1048576,S$1,FALSE)","v":29.817430000000002},{"$f":"VLOOKUP(($B18&\"_\"&T$2&\"_\"&T$3&\"_\"&T$4&\"_\"&$A18),'All Data'!$A$2:$L$1048576,T$1,FALSE)","v":35.385280000000002},{"$f":"VLOOKUP(($B18&\"_\"&U$2&\"_\"&U$3&\"_\"&U$4&\"_\"&$A18),'All Data'!$A$2:$L$1048576,U$1,FALSE)","v":57.810029999999998},{"$f":"VLOOKUP(($B18&\"_\"&V$2&\"_\"&V$3&\"_\"&V$4&\"_\"&$A18),'All Data'!$A$2:$L$1048576,V$1,FALSE)","v":63.4529},{"$f":"VLOOKUP(($B18&\"_\"&W$2&\"_\"&W$3&\"_\"&W$4&\"_\"&$A18),'All Data'!$A$2:$L$1048576,W$1,FALSE)","v":320.52539999999999},{"$f":"VLOOKUP(($B18&\"_\"&X$2&\"_\"&X$3&\"_\"&X$4&\"_\"&$A18),'All Data'!$A$2:$L$1048576,X$1,FALSE)","v":384.36284999999998},{"$f":"VLOOKUP(($B18&\"_\"&Y$2&\"_\"&Y$3&\"_\"&Y$4&\"_\"&$A18),'All Data'!$A$2:$L$1048576,Y$1,FALSE)","v":422.14395000000002},{"$f":"VLOOKUP(($B18&\"_\"&Z$2&\"_\"&Z$3&\"_\"&Z$4&\"_\"&$A18),'All Data'!$A$2:$L$1048576,Z$1,FALSE)","v":527.47717999999998},{"$f":"VLOOKUP(($B18&\"_\"&AA$2&\"_\"&AA$3&\"_\"&AA$4&\"_\"&$A18),'All Data'!$A$2:$L$1048576,AA$1,FALSE)","v":201.07561000000001},{"$f":"VLOOKUP(($B18&\"_\"&AB$2&\"_\"&AB$3&\"_\"&AB$4&\"_\"&$A18),'All Data'!$A$2:$L$1048576,AB$1,FALSE)","v":276.08368000000002},{"$f":"VLOOKUP(($B18&\"_\"&AC$2&\"_\"&AC$3&\"_\"&AC$4&\"_\"&$A18),'All Data'!$A$2:$L$1048576,AC$1,FALSE)","v":28.890056588520615},{"$f":"VLOOKUP(($B18&\"_\"&AD$2&\"_\"&AD$3&\"_\"&AD$4&\"_\"&$A18),'All Data'!$A$2:$L$1048576,AD$1,FALSE)","v":44.269199676637029},{"$f":"VLOOKUP(($B18&\"_\"&AE$2&\"_\"&AE$3&\"_\"&AE$4&\"_\"&$A18),'All Data'!$A$2:$L$1048576,AE$1,FALSE)","v":614.90909999999997},{"$f":"VLOOKUP(($B18&\"_\"&AF$2&\"_\"&AF$3&\"_\"&AF$4&\"_\"&$A18),'All Data'!$A$2:$L$1048576,AF$1,FALSE)","v":807.82141000000001},{"$f":"VLOOKUP(($B18&\"_\"&AG$2&\"_\"&AG$3&\"_\"&AG$4&\"_\"&$A18),'All Data'!$A$2:$L$1048576,AG$1,FALSE)","v":329.62389000000002},{"$f":"VLOOKUP(($B18&\"_\"&AH$2&\"_\"&AH$3&\"_\"&AH$4&\"_\"&$A18),'All Data'!$A$2:$L$1048576,AH$1,FALSE)","v":572.76554999999996},{"$f":"VLOOKUP(($B18&\"_\"&AI$2&\"_\"&AI$3&\"_\"&AI$4&\"_\"&$A18),'All Data'!$A$2:$L$1048576,AI$1,FALSE)","v":754.70074999999997},{"$f":"VLOOKUP(($B18&\"_\"&AJ$2&\"_\"&AJ$3&\"_\"&AJ$4&\"_\"&$A18),'All Data'!$A$2:$L$1048576,AJ$1,FALSE)","v":1045.37976},{"$f":"VLOOKUP(($B18&\"_\"&AK$2&\"_\"&AK$3&\"_\"&AK$4&\"_\"&$A18),'All Data'!$A$2:$L$1048576,AK$1,FALSE)","v":79.489481665165357},{"$f":"VLOOKUP(($B18&\"_\"&AL$2&\"_\"&AL$3&\"_\"&AL$4&\"_\"&$A18),'All Data'!$A$2:$L$1048576,AL$1,FALSE)","v":83.364858870459784}]
["LA","Bridgend",{"$f":"VLOOKUP(($B19&\"_\"&C$2&\"_\"&C$3&\"_\"&C$4&\"_\"&$A19),'All Data'!$A$2:$L$1048576,C$1,FALSE)","v":0},{"$f":"VLOOKUP(($B19&\"_\"&D$2&\"_\"&D$3&\"_\"&D$4&\"_\"&$A19),'All Data'!$A$2:$L$1048576,D$1,FALSE)","v":0},{"$f":"VLOOKUP(($B19&\"_\"&E$2&\"_\"&E$3&\"_\"&E$4&\"_\"&$A19),'All Data'!$A$2:$L$1048576,E$1,FALSE)","v":0},{"$f":"VLOOKUP(($B19&\"_\"&F$2&\"_\"&F$3&\"_\"&F$4&\"_\"&$A19),'All Data'!$A$2:$L$1048576,F$1,FALSE)","v":0},{"$f":"VLOOKUP(($B19&\"_\"&G$2&\"_\"&G$3&\"_\"&G$4&\"_\"&$A19),'All Data'!$A$2:$L$1048576,G$1,FALSE)","v":4.0547209999999998},{"$f":"VLOOKUP(($B19&\"_\"&H$2&\"_\"&H$3&\"_\"&H$4&\"_\"&$A19),'All Data'!$A$2:$L$1048576,H$1,FALSE)","v":11.63528},{"$f":"VLOOKUP(($B19&\"_\"&I$2&\"_\"&I$3&\"_\"&I$4&\"_\"&$A19),'All Data'!$A$2:$L$1048576,I$1,FALSE)","v":5.1051190000000002},{"$f":"VLOOKUP(($B19&\"_\"&J$2&\"_\"&J$3&\"_\"&J$4&\"_\"&$A19),'All Data'!$A$2:$L$1048576,J$1,FALSE)","v":10.934659999999999},{"$f":"VLOOKUP(($B19&\"_\"&K$2&\"_\"&K$3&\"_\"&K$4&\"_\"&$A19),'All Data'!$A$2:$L$1048576,K$1,FALSE)","v":71.245620000000002},{"$f":"VLOOKUP(($B19&\"_\"&L$2&\"_\"&L$3&\"_\"&L$4&\"_\"&$A19),'All Data'!$A$2:$L$1048576,L$1,FALSE)","v":76.60163},{"$f":"VLOOKUP(($B19&\"_\"&M$2&\"_\"&M$3&\"_\"&M$4&\"_\"&$A19),'All Data'!$A$2:$L$1048576,M$1,FALSE)","v":{"$error":"#N/A"}},{"$f":"VLOOKUP(($B19&\"_\"&N$2&\"_\"&N$3&\"_\"&N$4&\"_\"&$A19),'All Data'!$A$2:$L$1048576,N$1,FALSE)","v":{"$error":"#N/A"}},{"$f":"VLOOKUP(($B19&\"_\"&O$2&\"_\"&O$3&\"_\"&O$4&\"_\"&$A19),'All Data'!$A$2:$L$1048576,O$1,FALSE)","v":19.098010000000002},{"$f":"VLOOKUP(($B19&\"_\"&P$2&\"_\"&P$3&\"_\"&P$4&\"_\"&$A19),'All Data'!$A$2:$L$1048576,P$1,FALSE)","v":24.36975},{"$f":"VLOOKUP(($B19&\"_\"&Q$2&\"_\"&Q$3&\"_\"&Q$4&\"_\"&$A19),'All Data'!$A$2:$L$1048576,Q$1,FALSE)","v":2.1800259999999998},{"$f":"VLOOKUP(($B19&\"_\"&R$2&\"_\"&R$3&\"_\"&R$4&\"_\"&$A19),'All Data'!$A$2:$L$1048576,R$1,FALSE)","v":2.4394559999999998},{"$f":"VLOOKUP(($B19&\"_\"&S$2&\"_\"&S$3&\"_\"&S$4&\"_\"&$A19),'All Data'!$A$2:$L$1048576,S$1,FALSE)","v":27.920859999999998},{"$f":"VLOOKUP(($B19&\"_\"&T$2&\"_\"&T$3&\"_\"&T$4&\"_\"&$A19),'All Data'!$A$2:$L$1048576,T$1,FALSE)","v":33.637900000000002},{"$f":"VLOOKUP(($B19&\"_\"&U$2&\"_\"&U$3&\"_\"&U$4&\"_\"&$A19),'All Data'!$A$2:$L$1048576,U$1,FALSE)","v":57.015210000000003},{"$f":"VLOOKUP(($B19&\"_\"&V$2&\"_\"&V$3&\"_\"&V$4&\"_\"&$A19),'All Data'!$A$2:$L$1048576,V$1,FALSE)","v":62.911019999999994},{"$f":"VLOOKUP(($B19&\"_\"&W$2&\"_\"&W$3&\"_\"&W$4&\"_\"&$A19),'All Data'!$A$2:$L$1048576,W$1,FALSE)","v":274.17685999999998},{"$f":"VLOOKUP(($B19&\"_\"&X$2&\"_\"&X$3&\"_\"&X$4&\"_\"&$A19),'All Data'!$A$2:$L$1048576,X$1,FALSE)","v":334.18281000000002},{"$f":"VLOOKUP(($B19&\"_\"&Y$2&\"_\"&Y$3&\"_\"&Y$4&\"_\"&$A19),'All Data'!$A$2:$L$1048576,Y$1,FALSE)","v":377.18804999999998},{"$f":"VLOOKUP(($B19&\"_\"&Z$2&\"_\"&Z$3&\"_\"&Z$4&\"_\"&$A19),'All Data'!$A$2:$L$1048576,Z$1,FALSE)","v":477.73340999999999},{"$f":"VLOOKUP(($B19&\"_\"&AA$2&\"_\"&AA$3&\"_\"&AA$4&\"_\"&$A19),'All Data'!$A$2:$L$1048576,AA$1,FALSE)","v":154.05044000000001},{"$f":"VLOOKUP(($B19&\"_\"&AB$2&\"_\"&AB$3&\"_\"&AB$4&\"_\"&$A19),'All Data'!$A$2:$L$1048576,AB$1,FALSE)","v":221.84200999999999},{"$f":"VLOOKUP(($B19&\"_\"&AC$2&\"_\"&AC$3&\"_\"&AC$4&\"_\"&$A19),'All Data'!$A$2:$L$1048576,AC$1,FALSE)","v":34.578664893906279},{"$f":"VLOOKUP(($B19&\"_\"&AD$2&\"_\"&AD$3&\"_\"&AD$4&\"_\"&$A19),'All Data'!$A$2:$L$1048576,AD$1,FALSE)","v":51.599592130806926},{"$f":"VLOOKUP(($B19&\"_\"&AE$2&\"_\"&AE$3&\"_\"&AE$4&\"_\"&$A19),'All Data'!$A$2:$L$1048576,AE$1,FALSE)","v":392.59124000000003},{"$f":"VLOOKUP(($B19&\"_\"&AF$2&\"_\"&AF$3&\"_\"&AF$4&\"_\"&$A19),'All Data'!$A$2:$L$1048576,AF$1,FALSE)","v":550.75044000000003},{"$f":"VLOOKUP(($B19&\"_\"&AG$2&\"_\"&AG$3&\"_\"&AG$4&\"_\"&$A19),'All Data'!$A$2:$L$1048576,AG$1,FALSE)","v":201.86581000000001},{"$f":"VLOOKUP(($B19&\"_\"&AH$2&\"_\"&AH$3&\"_\"&AH$4&\"_\"&$A19),'All Data'!$A$2:$L$1048576,AH$1,FALSE)","v":409.87304999999998},{"$f":"VLOOKUP(($B19&\"_\"&AI$2&\"_\"&AI$3&\"_\"&AI$4&\"_\"&$A19),'All Data'!$A$2:$L$1048576,AI$1,FALSE)","v":473.93279999999999},{"$f":"VLOOKUP(($B19&\"_\"&AJ$2&\"_\"&AJ$3&\"_\"&AJ$4&\"_\"&$A19),'All Data'!$A$2:$L$1048576,AJ$1,FALSE)","v":705.20770000000005},{"$f":"VLOOKUP(($B19&\"_\"&AK$2&\"_\"&AK$3&\"_\"&AK$4&\"_\"&$A19),'All Data'!$A$2:$L$1048576,AK$1,FALSE)","v":78.924789625456356},{"$f":"VLOOKUP(($B19&\"_\"&AL$2&\"_\"&AL$3&\"_\"&AL$4&\"_\"&$A19),'All Data'!$A$2:$L$1048576,AL$1,FALSE)","v":82.821711107567424}]
["LA","The Vale of Glamorgan",{"$f":"VLOOKUP(($B20&\"_\"&C$2&\"_\"&C$3&\"_\"&C$4&\"_\"&$A20),'All Data'!$A$2:$L$1048576,C$1,FALSE)","v":0},{"$f":"VLOOKUP(($B20&\"_\"&D$2&\"_\"&D$3&\"_\"&D$4&\"_\"&$A20),'All Data'!$A$2:$L$1048576,D$1,FALSE)","v":0},{"$f":"VLOOKUP(($B20&\"_\"&E$2&\"_\"&E$3&\"_\"&E$4&\"_\"&$A20),'All Data'!$A$2:$L$1048576,E$1,FALSE)","v":0},{"$f":"VLOOKUP(($B20&\"_\"&F$2&\"_\"&F$3&\"_\"&F$4&\"_\"&$A20),'All Data'!$A$2:$L$1048576,F$1,FALSE)","v":0},{"$f":"VLOOKUP(($B20&\"_\"&G$2&\"_\"&G$3&\"_\"&G$4&\"_\"&$A20),'All Data'!$A$2:$L$1048576,G$1,FALSE)","v":3.1381389999999998},{"$f":"VLOOKUP(($B20&\"_\"&H$2&\"_\"&H$3&\"_\"&H$4&\"_\"&$A20),'All Data'!$A$2:$L$1048576,H$1,FALSE)","v":11.887219999999999},{"$f":"VLOOKUP(($B20&\"_\"&I$2&\"_\"&I$3&\"_\"&I$4&\"_\"&$A20),'All Data'!$A$2:$L$1048576,I$1,FALSE)","v":6.7376680000000002},{"$f":"VLOOKUP(($B20&\"_\"&J$2&\"_\"&J$3&\"_\"&J$4&\"_\"&$A20),'All Data'!$A$2:$L$1048576,J$1,FALSE)","v":8.1498419999999996},{"$f":"VLOOKUP(($B20&\"_\"&K$2&\"_\"&K$3&\"_\"&K$4&\"_\"&$A20),'All Data'!$A$2:$L$1048576,K$1,FALSE)","v":74.045659999999998},{"$f":"VLOOKUP(($B20&\"_\"&L$2&\"_\"&L$3&\"_\"&L$4&\"_\"&$A20),'All Data'!$A$2:$L$1048576,L$1,FALSE)","v":79.379350000000002},{"$f":"VLOOKUP(($B20&\"_\"&M$2&\"_\"&M$3&\"_\"&M$4&\"_\"&$A20),'All Data'!$A$2:$L$1048576,M$1,FALSE)","v":{"$error":"#N/A"}},{"$f":"VLOOKUP(($B20&\"_\"&N$2&\"_\"&N$3&\"_\"&N$4&\"_\"&$A20),'All Data'!$A$2:$L$1048576,N$1,FALSE)","v":{"$error":"#N/A"}},{"$f":"VLOOKUP(($B20&\"_\"&O$2&\"_\"&O$3&\"_\"&O$4&\"_\"&$A20),'All Data'!$A$2:$L$1048576,O$1,FALSE)","v":18.210930000000001},{"$f":"VLOOKUP(($B20&\"_\"&P$2&\"_\"&P$3&\"_\"&P$4&\"_\"&$A20),'All Data'!$A$2:$L$1048576,P$1,FALSE)","v":23.89978},{"$f":"VLOOKUP(($B20&\"_\"&Q$2&\"_\"&Q$3&\"_\"&Q$4&\"_\"&$A20),'All Data'!$A$2:$L$1048576,Q$1,FALSE)","v":2.2985250000000002},{"$f":"VLOOKUP(($B20&\"_\"&R$2&\"_\"&R$3&\"_\"&R$4&\"_\"&$A20),'All Data'!$A$2:$L$1048576,R$1,FALSE)","v":2.558449},{"$f":"VLOOKUP(($B20&\"_\"&S$2&\"_\"&S$3&\"_\"&S$4&\"_\"&$A20),'All Data'!$A$2:$L$1048576,S$1,FALSE)","v":30.620969999999996},{"$f":"VLOOKUP(($B20&\"_\"&T$2&\"_\"&T$3&\"_\"&T$4&\"_\"&$A20),'All Data'!$A$2:$L$1048576,T$1,FALSE)","v":36.662149999999997},{"$f":"VLOOKUP(($B20&\"_\"&U$2&\"_\"&U$3&\"_\"&U$4&\"_\"&$A20),'All Data'!$A$2:$L$1048576,U$1,FALSE)","v":51.47766},{"$f":"VLOOKUP(($B20&\"_\"&V$2&\"_\"&V$3&\"_\"&V$4&\"_\"&$A20),'All Data'!$A$2:$L$1048576,V$1,FALSE)","v":57.839260000000003},{"$f":"VLOOKUP(($B20&\"_\"&W$2&\"_\"&W$3&\"_\"&W$4&\"_\"&$A20),'All Data'!$A$2:$L$1048576,W$1,FALSE)","v":304.10404},{"$f":"VLOOKUP(($B20&\"_\"&X$2&\"_\"&X$3&\"_\"&X$4&\"_\"&$A20),'All Data'!$A$2:$L$1048576,X$1,FALSE)","v":370.19157999999999},{"$f":"VLOOKUP(($B20&\"_\"&Y$2&\"_\"&Y$3&\"_\"&Y$4&\"_\"&$A20),'All Data'!$A$2:$L$1048576,Y$1,FALSE)","v":383.36162999999999},{"$f":"VLOOKUP(($B20&\"_\"&Z$2&\"_\"&Z$3&\"_\"&Z$4&\"_\"&$A20),'All Data'!$A$2:$L$1048576,Z$1,FALSE)","v":491.02280999999999},{"$f":"VLOOKUP(($B20&\"_\"&AA$2&\"_\"&AA$3&\"_\"&AA$4&\"_\"&$A20),'All Data'!$A$2:$L$1048576,AA$1,FALSE)","v":208.17413999999999},{"$f":"VLOOKUP(($B20&\"_\"&AB$2&\"_\"&AB$3&\"_\"&AB$4&\"_\"&$A20),'All Data'!$A$2:$L$1048576,AB$1,FALSE)","v":289.07359000000002},{"$f":"VLOOKUP(($B20&\"_\"&AC$2&\"_\"&AC$3&\"_\"&AC$4&\"_\"&$A20),'All Data'!$A$2:$L$1048576,AC$1,FALSE)","v":25.260500807754443},{"$f":"VLOOKUP(($B20&\"_\"&AD$2&\"_\"&AD$3&\"_\"&AD$4&\"_\"&$A20),'All Data'!$A$2:$L$1048576,AD$1,FALSE)","v":39.764943457189013},{"$f":"VLOOKUP(($B20&\"_\"&AE$2&\"_\"&AE$3&\"_\"&AE$4&\"_\"&$A20),'All Data'!$A$2:$L$1048576,AE$1,FALSE)","v":430.81007},{"$f":"VLOOKUP(($B20&\"_\"&AF$2&\"_\"&AF$3&\"_\"&AF$4&\"_\"&$A20),'All Data'!$A$2:$L$1048576,AF$1,FALSE)","v":606.70537999999999},{"$f":"VLOOKUP(($B20&\"_\"&AG$2&\"_\"&AG$3&\"_\"&AG$4&\"_\"&$A20),'All Data'!$A$2:$L$1048576,AG$1,FALSE)","v":213.44672},{"$f":"VLOOKUP(($B20&\"_\"&AH$2&\"_\"&AH$3&\"_\"&AH$4&\"_\"&$A20),'All Data'!$A$2:$L$1048576,AH$1,FALSE)","v":428.28356000000002},{"$f":"VLOOKUP(($B20&\"_\"&AI$2&\"_\"&AI$3&\"_\"&AI$4&\"_\"&$A20),'All Data'!$A$2:$L$1048576,AI$1,FALSE)","v":544.29618000000005},{"$f":"VLOOKUP(($B20&\"_\"&AJ$2&\"_\"&AJ$3&\"_\"&AJ$4&\"_\"&$A20),'All Data'!$A$2:$L$1048576,AJ$1,FALSE)","v":816.01760999999999},{"$f":"VLOOKUP(($B20&\"_\"&AK$2&\"_\"&AK$3&\"_\"&AK$4&\"_\"&$A20),'All Data'!$A$2:$L$1048576,AK$1,FALSE)","v":79.334224029815147},{"$f":"VLOOKUP(($B20&\"_\"&AL$2&\"_\"&AL$3&\"_\"&AL$4&\"_\"&$A20),'All Data'!$A$2:$L$1048576,AL$1,FALSE)","v":83.254652174394835}]
["LA","Cardiff",{"$f":"VLOOKUP(($B21&\"_\"&C$2&\"_\"&C$3&\"_\"&C$4&\"_\"&$A21),'All Data'!$A$2:$L$1048576,C$1,FALSE)","v":0},{"$f":"VLOOKUP(($B21&\"_\"&D$2&\"_\"&D$3&\"_\"&D$4&\"_\"&$A21),'All Data'!$A$2:$L$1048576,D$1,FALSE)","v":0},{"$f":"VLOOKUP(($B21&\"_\"&E$2&\"_\"&E$3&\"_\"&E$4&\"_\"&$A21),'All Data'!$A$2:$L$1048576,E$1,FALSE)","v":0},{"$f":"VLOOKUP(($B21&\"_\"&F$2&\"_\"&F$3&\"_\"&F$4&\"_\"&$A21),'All Data'!$A$2:$L$1048576,F$1,FALSE)","v":0},{"$f":"VLOOKUP(($B21&\"_\"&G$2&\"_\"&G$3&\"_\"&G$4&\"_\"&$A21),'All Data'!$A$2:$L$1048576,G$1,FALSE)","v":10.99283},{"$f":"VLOOKUP(($B21&\"_\"&H$2&\"_\"&H$3&\"_\"&H$4&\"_\"&$A21),'All Data'!$A$2:$L$1048576,H$1,FALSE)","v":14.69811},{"$f":"VLOOKUP(($B21&\"_\"&I$2&\"_\"&I$3&\"_\"&I$4&\"_\"&$A21),'All Data'!$A$2:$L$1048576,I$1,FALSE)","v":8.2461579999999994},{"$f":"VLOOKUP(($B21&\"_\"&J$2&\"_\"&J$3&\"_\"&J$4&\"_\"&$A21),'All Data'!$A$2:$L$1048576,J$1,FALSE)","v":11.68303},{"$f":"VLOOKUP(($B21&\"_\"&K$2&\"_\"&K$3&\"_\"&K$4&\"_\"&$A21),'All Data'!$A$2:$L$1048576,K$1,FALSE)","v":71.658000000000001},{"$f":"VLOOKUP(($B21&\"_\"&L$2&\"_\"&L$3&\"_\"&L$4&\"_\"&$A21),'All Data'!$A$2:$L$1048576,L$1,FALSE)","v":75.776200000000003},{"$f":"VLOOKUP(($B21&\"_\"&M$2&\"_\"&M$3&\"_\"&M$4&\"_\"&$A21),'All Data'!$A$2:$L$1048576,M$1,FALSE)","v":{"$error":"#N/A"}},{"$f":"VLOOKUP(($B21&\"_\"&N$2&\"_\"&N$3&\"_\"&N$4&\"_\"&$A21),'All Data'!$A$2:$L$1048576,N$1,FALSE)","v":{"$error":"#N/A"}},{"$f":"VLOOKUP(($B21&\"_\"&O$2&\"_\"&O$3&\"_\"&O$4&\"_\"&$A21),'All Data'!$A$2:$L$1048576,O$1,FALSE)","v":20.939230000000002},{"$f":"VLOOKUP(($B21&\"_\"&P$2&\"_\"&P$3&\"_\"&P$4&\"_\"&$A21),'All Data'!$A$2:$L$1048576,P$1,FALSE)","v":24.927299999999999},{"$f":"VLOOKUP(($B21&\"_\"&Q$2&\"_\"&Q$3&\"_\"&Q$4&\"_\"&$A21),'All Data'!$A$2:$L$1048576,Q$1,FALSE)","v":2.0746920000000002},{"$f":"VLOOKUP(($B21&\"_\"&R$2&\"_\"&R$3&\"_\"&R$4&\"_\"&$A21),'All Data'!$A$2:$L$1048576,R$1,FALSE)","v":2.2619410000000002},{"$f":"VLOOKUP(($B21&\"_\"&S$2&\"_\"&S$3&\"_\"&S$4&\"_\"&$A21),'All Data'!$A$2:$L$1048576,S$1,FALSE)","v":35.371069999999996},{"$f":"VLOOKUP(($B21&\"_\"&T$2&\"_\"&T$3&\"_\"&T$4&\"_\"&$A21),'All Data'!$A$2:$L$1048576,T$1,FALSE)","v":39.981569999999998},{"$f":"VLOOKUP(($B21&\"_\"&U$2&\"_\"&U$3&\"_\"&U$4&\"_\"&$A21),'All Data'!$A$2:$L$1048576,U$1,FALSE)","v":52.206180000000003},{"$f":"VLOOKUP(($B21&\"_\"&V$2&\"_\"&V$3&\"_\"&V$4&\"_\"&$A21),'All Data'!$A$2:$L$1048576,V$1,FALSE)","v":56.903890000000004},{"$f":"VLOOKUP(($B21&\"_\"&W$2&\"_\"&W$3&\"_\"&W$4&\"_\"&$A21),'All Data'!$A$2:$L$1048576,W$1,FALSE)","v":296.02695999999997},{"$f":"VLOOKUP(($B21&\"_\"&X$2&\"_\"&X$3&\"_\"&X$4&\"_\"&$A21),'All Data'!$A$2:$L$1048576,X$1,FALSE)","v":335.43923999999998},{"$f":"VLOOKUP(($B21&\"_\"&Y$2&\"_\"&Y$3&\"_\"&Y$4&\"_\"&$A21),'All Data'!$A$2:$L$1048576,Y$1,FALSE)","v":384.34134999999998},{"$f":"VLOOKUP(($B21&\"_\"&Z$2&\"_\"&Z$3&\"_\"&Z$4&\"_\"&$A21),'All Data'!$A$2:$L$1048576,Z$1,FALSE)","v":449.30076000000003},{"$f":"VLOOKUP(($B21&\"_\"&AA$2&\"_\"&AA$3&\"_\"&AA$4&\"_\"&$A21),'All Data'!$A$2:$L$1048576,AA$1,FALSE)","v":197.50945999999999},{"$f":"VLOOKUP(($B21&\"_\"&AB$2&\"_\"&AB$3&\"_\"&AB$4&\"_\"&$A21),'All Data'!$A$2:$L$1048576,AB$1,FALSE)","v":243.65133},{"$f":"VLOOKUP(($B21&\"_\"&AC$2&\"_\"&AC$3&\"_\"&AC$4&\"_\"&$A21),'All Data'!$A$2:$L$1048576,AC$1,FALSE)","v":41.597817532802829},{"$f":"VLOOKUP(($B21&\"_\"&AD$2&\"_\"&AD$3&\"_\"&AD$4&\"_\"&$A21),'All Data'!$A$2:$L$1048576,AD$1,FALSE)","v":53.152549673154077},{"$f":"VLOOKUP(($B21&\"_\"&AE$2&\"_\"&AE$3&\"_\"&AE$4&\"_\"&$A21),'All Data'!$A$2:$L$1048576,AE$1,FALSE)","v":454.97892000000002},{"$f":"VLOOKUP(($B21&\"_\"&AF$2&\"_\"&AF$3&\"_\"&AF$4&\"_\"&$A21),'All Data'!$A$2:$L$1048576,AF$1,FALSE)","v":578.96947},{"$f":"VLOOKUP(($B21&\"_\"&AG$2&\"_\"&AG$3&\"_\"&AG$4&\"_\"&$A21),'All Data'!$A$2:$L$1048576,AG$1,FALSE)","v":305.64251999999999},{"$f":"VLOOKUP(($B21&\"_\"&AH$2&\"_\"&AH$3&\"_\"&AH$4&\"_\"&$A21),'All Data'!$A$2:$L$1048576,AH$1,FALSE)","v":475.98302999999999},{"$f":"VLOOKUP(($B21&\"_\"&AI$2&\"_\"&AI$3&\"_\"&AI$4&\"_\"&$A21),'All Data'!$A$2:$L$1048576,AI$1,FALSE)","v":514.13672999999994},{"$f":"VLOOKUP(($B21&\"_\"&AJ$2&\"_\"&AJ$3&\"_\"&AJ$4&\"_\"&$A21),'All Data'!$A$2:$L$1048576,AJ$1,FALSE)","v":689.90997000000004},{"$f":"VLOOKUP(($B21&\"_\"&AK$2&\"_\"&AK$3&\"_\"&AK$4&\"_\"&$A21),'All Data'!$A$2:$L$1048576,AK$1,FALSE)","v":75.610695210149814},{"$f":"VLOOKUP(($B21&\"_\"&AL$2&\"_\"&AL$3&\"_\"&AL$4&\"_\"&$A21),'All Data'!$A$2:$L$1048576,AL$1,FALSE)","v":78.094929670378889}]
["LA","Rhondda Cynon Taf",{"$f":"VLOOKUP(($B22&\"_\"&C$2&\"_\"&C$3&\"_\"&C$4&\"_\"&$A22),'All Data'!$A$2:$L$1048576,C$1,FALSE)","v":0},{"$f":"VLOOKUP(($B22&\"_\"&D$2&\"_\"&D$3&\"_\"&D$4&\"_\"&$A22),'All Data'!$A$2:$L$1048576,D$1,FALSE)","v":0},{"$f":"VLOOKUP(($B22&\"_\"&E$2&\"_\"&E$3&\"_\"&E$4&\"_\"&$A22),'All Data'!$A$2:$L$1048576,E$1,FALSE)","v":0},{"$f":"VLOOKUP(($B22&\"_\"&F$2&\"_\"&F$3&\"_\"&F$4&\"_\"&$A22),'All Data'!$A$2:$L$1048576,F$1,FALSE)","v":0},{"$f":"VLOOKUP(($B22&\"_\"&G$2&\"_\"&G$3&\"_\"&G$4&\"_\"&$A22),'All Data'!$A$2:$L$1048576,G$1,FALSE)","v":5.2450979999999996},{"$f":"VLOOKUP(($B22&\"_\"&H$2&\"_\"&H$3&\"_\"&H$4&\"_\"&$A22),'All Data'!$A$2:$L$1048576,H$1,FALSE)","v":10.605090000000001},{"$f":"VLOOKUP(($B22&\"_\"&I$2&\"_\"&I$3&\"_\"&I$4&\"_\"&$A22),'All Data'!$A$2:$L$1048576,I$1,FALSE)","v":3.5697589999999999},{"$f":"VLOOKUP(($B22&\"_\"&J$2&\"_\"&J$3&\"_\"&J$4&\"_\"&$A22),'All Data'!$A$2:$L$1048576,J$1,FALSE)","v":7.2195150000000003},{"$f":"VLOOKUP(($B22&\"_\"&K$2&\"_\"&K$3&\"_\"&K$4&\"_\"&$A22),'All Data'!$A$2:$L$1048576,K$1,FALSE)","v":68.317239999999998},{"$f":"VLOOKUP(($B22&\"_\"&L$2&\"_\"&L$3&\"_\"&L$4&\"_\"&$A22),'All Data'!$A$2:$L$1048576,L$1,FALSE)","v":73.313699999999997},{"$f":"VLOOKUP(($B22&\"_\"&M$2&\"_\"&M$3&\"_\"&M$4&\"_\"&$A22),'All Data'!$A$2:$L$1048576,M$1,FALSE)","v":{"$error":"#N/A"}},{"$f":"VLOOKUP(($B22&\"_\"&N$2&\"_\"&N$3&\"_\"&N$4&\"_\"&$A22),'All Data'!$A$2:$L$1048576,N$1,FALSE)","v":{"$error":"#N/A"}},{"$f":"VLOOKUP(($B22&\"_\"&O$2&\"_\"&O$3&\"_\"&O$4&\"_\"&$A22),'All Data'!$A$2:$L$1048576,O$1,FALSE)","v":24.324860000000001},{"$f":"VLOOKUP(($B22&\"_\"&P$2&\"_\"&P$3&\"_\"&P$4&\"_\"&$A22),'All Data'!$A$2:$L$1048576,P$1,FALSE)","v":29.343700000000002},{"$f":"VLOOKUP(($B22&\"_\"&Q$2&\"_\"&Q$3&\"_\"&Q$4&\"_\"&$A22),'All Data'!$A$2:$L$1048576,Q$1,FALSE)","v":2.0808469999999999},{"$f":"VLOOKUP(($B22&\"_\"&R$2&\"_\"&R$3&\"_\"&R$4&\"_\"&$A22),'All Data'!$A$2:$L$1048576,R$1,FALSE)","v":2.3091170000000001},{"$f":"VLOOKUP(($B22&\"_\"&S$2&\"_\"&S$3&\"_\"&S$4&\"_\"&$A22),'All Data'!$A$2:$L$1048576,S$1,FALSE)","v":27.25534},{"$f":"VLOOKUP(($B22&\"_\"&T$2&\"_\"&T$3&\"_\"&T$4&\"_\"&$A22),'All Data'!$A$2:$L$1048576,T$1,FALSE)","v":32.521050000000002},{"$f":"VLOOKUP(($B22&\"_\"&U$2&\"_\"&U$3&\"_\"&U$4&\"_\"&$A22),'All Data'!$A$2:$L$1048576,U$1,FALSE)","v":59.056620000000002},{"$f":"VLOOKUP(($B22&\"_\"&V$2&\"_\"&V$3&\"_\"&V$4&\"_\"&$A22),'All Data'!$A$2:$L$1048576,V$1,FALSE)","v":64.046860000000009},{"$f":"VLOOKUP(($B22&\"_\"&W$2&\"_\"&W$3&\"_\"&W$4&\"_\"&$A22),'All Data'!$A$2:$L$1048576,W$1,FALSE)","v":326.13753000000003},{"$f":"VLOOKUP(($B22&\"_\"&X$2&\"_\"&X$3&\"_\"&X$4&\"_\"&$A22),'All Data'!$A$2:$L$1048576,X$1,FALSE)","v":374.91577999999998},{"$f":"VLOOKUP(($B22&\"_\"&Y$2&\"_\"&Y$3&\"_\"&Y$4&\"_\"&$A22),'All Data'!$A$2:$L$1048576,Y$1,FALSE)","v":428.20328999999998},{"$f":"VLOOKUP(($B22&\"_\"&Z$2&\"_\"&Z$3&\"_\"&Z$4&\"_\"&$A22),'All Data'!$A$2:$L$1048576,Z$1,FALSE)","v":508.48372999999998},{"$f":"VLOOKUP(($B22&\"_\"&AA$2&\"_\"&AA$3&\"_\"&AA$4&\"_\"&$A22),'All Data'!$A$2:$L$1048576,AA$1,FALSE)","v":211.05869000000001},{"$f":"VLOOKUP(($B22&\"_\"&AB$2&\"_\"&AB$3&\"_\"&AB$4&\"_\"&$A22),'All Data'!$A$2:$L$1048576,AB$1,FALSE)","v":268.42295000000001},{"$f":"VLOOKUP(($B22&\"_\"&AC$2&\"_\"&AC$3&\"_\"&AC$4&\"_\"&$A22),'All Data'!$A$2:$L$1048576,AC$1,FALSE)","v":41.902310173175103},{"$f":"VLOOKUP(($B22&\"_\"&AD$2&\"_\"&AD$3&\"_\"&AD$4&\"_\"&$A22),'All Data'!$A$2:$L$1048576,AD$1,FALSE)","v":55.297883915999456},{"$f":"VLOOKUP(($B22&\"_\"&AE$2&\"_\"&AE$3&\"_\"&AE$4&\"_\"&$A22),'All Data'!$A$2:$L$1048576,AE$1,FALSE)","v":651.61521000000005},{"$f":"VLOOKUP(($B22&\"_\"&AF$2&\"_\"&AF$3&\"_\"&AF$4&\"_\"&$A22),'All Data'!$A$2:$L$1048576,AF$1,FALSE)","v":805.18415000000005},{"$f":"VLOOKUP(($B22&\"_\"&AG$2&\"_\"&AG$3&\"_\"&AG$4&\"_\"&$A22),'All Data'!$A$2:$L$1048576,AG$1,FALSE)","v":372.04255000000001},{"$f":"VLOOKUP(($B22&\"_\"&AH$2&\"_\"&AH$3&\"_\"&AH$4&\"_\"&$A22),'All Data'!$A$2:$L$1048576,AH$1,FALSE)","v":574.23396000000002},{"$f":"VLOOKUP(($B22&\"_\"&AI$2&\"_\"&AI$3&\"_\"&AI$4&\"_\"&$A22),'All Data'!$A$2:$L$1048576,AI$1,FALSE)","v":769.36742000000004},{"$f":"VLOOKUP(($B22&\"_\"&AJ$2&\"_\"&AJ$3&\"_\"&AJ$4&\"_\"&$A22),'All Data'!$A$2:$L$1048576,AJ$1,FALSE)","v":986.89661000000001},{"$f":"VLOOKUP(($B22&\"_\"&AK$2&\"_\"&AK$3&\"_\"&AK$4&\"_\"&$A22),'All Data'!$A$2:$L$1048576,AK$1,FALSE)","v":81.143220169327947},{"$f":"VLOOKUP(($B22&\"_\"&AL$2&\"_\"&AL$3&\"_\"&AL$4&\"_\"&$A22),'All Data'!$A$2:$L$1048576,AL$1,FALSE)","v":83.9827615729223}]
["LA","Merthyr Tydfil",{"$f":"VLOOKUP(($B23&\"_\"&C$2&\"_\"&C$3&\"_\"&C$4&\"_\"&$A23),'All Data'!$A$2:$L$1048576,C$1,FALSE)","v":0},{"$f":"VLOOKUP(($B23&\"_\"&D$2&\"_\"&D$3&\"_\"&D$4&\"_\"&$A23),'All Data'!$A$2:$L$1048576,D$1,FALSE)","v":0},{"$f":"VLOOKUP(($B23&\"_\"&E$2&\"_\"&E$3&\"_\"&E$4&\"_\"&$A23),'All Data'!$A$2:$L$1048576,E$1,FALSE)","v":0},{"$f":"VLOOKUP(($B23&\"_\"&F$2&\"_\"&F$3&\"_\"&F$4&\"_\"&$A23),'All Data'!$A$2:$L$1048576,F$1,FALSE)","v":0},{"$f":"VLOOKUP(($B23&\"_\"&G$2&\"_\"&G$3&\"_\"&G$4&\"_\"&$A23),'All Data'!$A$2:$L$1048576,G$1,FALSE)","v":5.005026},{"$f":"VLOOKUP(($B23&\"_\"&H$2&\"_\"&H$3&\"_\"&H$4&\"_\"&$A23),'All Data'!$A$2:$L$1048576,H$1,FALSE)","v":13.74404},{"$f":"VLOOKUP(($B23&\"_\"&I$2&\"_\"&I$3&\"_\"&I$4&\"_\"&$A23),'All Data'!$A$2:$L$1048576,I$1,FALSE)","v":4.3828519999999997},{"$f":"VLOOKUP(($B23&\"_\"&J$2&\"_\"&J$3&\"_\"&J$4&\"_\"&$A23),'All Data'!$A$2:$L$1048576,J$1,FALSE)","v":11.16488},{"$f":"VLOOKUP(($B23&\"_\"&K$2&\"_\"&K$3&\"_\"&K$4&\"_\"&$A23),'All Data'!$A$2:$L$1048576,K$1,FALSE)","v":63.696669999999997},{"$f":"VLOOKUP(($B23&\"_\"&L$2&\"_\"&L$3&\"_\"&L$4&\"_\"&$A23),'All Data'!$A$2:$L$1048576,L$1,FALSE)","v":69.452480000000008},{"$f":"VLOOKUP(($B23&\"_\"&M$2&\"_\"&M$3&\"_\"&M$4&\"_\"&$A23),'All Data'!$A$2:$L$1048576,M$1,FALSE)","v":{"$error":"#N/A"}},{"$f":"VLOOKUP(($B23&\"_\"&N$2&\"_\"&N$3&\"_\"&N$4&\"_\"&$A23),'All Data'!$A$2:$L$1048576,N$1,FALSE)","v":{"$error":"#N/A"}},{"$f":"VLOOKUP(($B23&\"_\"&O$2&\"_\"&O$3&\"_\"&O$4&\"_\"&$A23),'All Data'!$A$2:$L$1048576,O$1,FALSE)","v":23.340600000000002},{"$f":"VLOOKUP(($B23&\"_\"&P$2&\"_\"&P$3&\"_\"&P$4&\"_\"&$A23),'All Data'!$A$2:$L$1048576,P$1,FALSE)","v":29.191990000000001},{"$f":"VLOOKUP(($B23&\"_\"&Q$2&\"_\"&Q$3&\"_\"&Q$4&\"_\"&$A23),'All Data'!$A$2:$L$1048576,Q$1,FALSE)","v":2.0406010000000001},{"$f":"VLOOKUP(($B23&\"_\"&R$2&\"_\"&R$3&\"_\"&R$4&\"_\"&$A23),'All Data'!$A$2:$L$1048576,R$1,FALSE)","v":2.3115519999999998},{"$f":"VLOOKUP(($B23&\"_\"&S$2&\"_\"&S$3&\"_\"&S$4&\"_\"&$A23),'All Data'!$A$2:$L$1048576,S$1,FALSE)","v":29.567179999999997},{"$f":"VLOOKUP(($B23&\"_\"&T$2&\"_\"&T$3&\"_\"&T$4&\"_\"&$A23),'All Data'!$A$2:$L$1048576,T$1,FALSE)","v":35.486179999999997},{"$f":"VLOOKUP(($B23&\"_\"&U$2&\"_\"&U$3&\"_\"&U$4&\"_\"&$A23),'All Data'!$A$2:$L$1048576,U$1,FALSE)","v":60.370339999999999},{"$f":"VLOOKUP(($B23&\"_\"&V$2&\"_\"&V$3&\"_\"&V$4&\"_\"&$A23),'All Data'!$A$2:$L$1048576,V$1,FALSE)","v":66.336200000000005},{"$f":"VLOOKUP(($B23&\"_\"&W$2&\"_\"&W$3&\"_\"&W$4&\"_\"&$A23),'All Data'!$A$2:$L$1048576,W$1,FALSE)","v":313.01636999999999},{"$f":"VLOOKUP(($B23&\"_\"&X$2&\"_\"&X$3&\"_\"&X$4&\"_\"&$A23),'All Data'!$A$2:$L$1048576,X$1,FALSE)","v":416.46296000000001},{"$f":"VLOOKUP(($B23&\"_\"&Y$2&\"_\"&Y$3&\"_\"&Y$4&\"_\"&$A23),'All Data'!$A$2:$L$1048576,Y$1,FALSE)","v":442.01150000000001},{"$f":"VLOOKUP(($B23&\"_\"&Z$2&\"_\"&Z$3&\"_\"&Z$4&\"_\"&$A23),'All Data'!$A$2:$L$1048576,Z$1,FALSE)","v":619.44530999999995},{"$f":"VLOOKUP(($B23&\"_\"&AA$2&\"_\"&AA$3&\"_\"&AA$4&\"_\"&$A23),'All Data'!$A$2:$L$1048576,AA$1,FALSE)","v":156.22108},{"$f":"VLOOKUP(($B23&\"_\"&AB$2&\"_\"&AB$3&\"_\"&AB$4&\"_\"&$A23),'All Data'!$A$2:$L$1048576,AB$1,FALSE)","v":270.06823000000003},{"$f":"VLOOKUP(($B23&\"_\"&AC$2&\"_\"&AC$3&\"_\"&AC$4&\"_\"&$A23),'All Data'!$A$2:$L$1048576,AC$1,FALSE)","v":32.954545454545453},{"$f":"VLOOKUP(($B23&\"_\"&AD$2&\"_\"&AD$3&\"_\"&AD$4&\"_\"&$A23),'All Data'!$A$2:$L$1048576,AD$1,FALSE)","v":58.891818181818181},{"$f":"VLOOKUP(($B23&\"_\"&AE$2&\"_\"&AE$3&\"_\"&AE$4&\"_\"&$A23),'All Data'!$A$2:$L$1048576,AE$1,FALSE)","v":512.97619999999995},{"$f":"VLOOKUP(($B23&\"_\"&AF$2&\"_\"&AF$3&\"_\"&AF$4&\"_\"&$A23),'All Data'!$A$2:$L$1048576,AF$1,FALSE)","v":811.06411000000003},{"$f":"VLOOKUP(($B23&\"_\"&AG$2&\"_\"&AG$3&\"_\"&AG$4&\"_\"&$A23),'All Data'!$A$2:$L$1048576,AG$1,FALSE)","v":252.85289},{"$f":"VLOOKUP(($B23&\"_\"&AH$2&\"_\"&AH$3&\"_\"&AH$4&\"_\"&$A23),'All Data'!$A$2:$L$1048576,AH$1,FALSE)","v":666.32568000000003},{"$f":"VLOOKUP(($B23&\"_\"&AI$2&\"_\"&AI$3&\"_\"&AI$4&\"_\"&$A23),'All Data'!$A$2:$L$1048576,AI$1,FALSE)","v":610.30380000000002},{"$f":"VLOOKUP(($B23&\"_\"&AJ$2&\"_\"&AJ$3&\"_\"&AJ$4&\"_\"&$A23),'All Data'!$A$2:$L$1048576,AJ$1,FALSE)","v":1051.0731800000001},{"$f":"VLOOKUP(($B23&\"_\"&AK$2&\"_\"&AK$3&\"_\"&AK$4&\"_\"&$A23),'All Data'!$A$2:$L$1048576,AK$1,FALSE)","v":82.244793182272034},{"$f":"VLOOKUP(($B23&\"_\"&AL$2&\"_\"&AL$3&\"_\"&AL$4&\"_\"&$A23),'All Data'!$A$2:$L$1048576,AL$1,FALSE)","v":87.555287872172599}]
["LA","Caerphilly",{"$f":"VLOOKUP(($B24&\"_\"&C$2&\"_\"&C$3&\"_\"&C$4&\"_\"&$A24),'All Data'!$A$2:$L$1048576,C$1,FALSE)","v":0},{"$f":"VLOOKUP(($B24&\"_\"&D$2&\"_\"&D$3&\"_\"&D$4&\"_\"&$A24),'All Data'!$A$2:$L$1048576,D$1,FALSE)","v":0},{"$f":"VLOOKUP(($B24&\"_\"&E$2&\"_\"&E$3&\"_\"&E$4&\"_\"&$A24),'All Data'!$A$2:$L$1048576,E$1,FALSE)","v":0},{"$f":"VLOOKUP(($B24&\"_\"&F$2&\"_\"&F$3&\"_\"&F$4&\"_\"&$A24),'All Data'!$A$2:$L$1048576,F$1,FALSE)","v":0},{"$f":"VLOOKUP(($B24&\"_\"&G$2&\"_\"&G$3&\"_\"&G$4&\"_\"&$A24),'All Data'!$A$2:$L$1048576,G$1,FALSE)","v":5.9764549999999996},{"$f":"VLOOKUP(($B24&\"_\"&H$2&\"_\"&H$3&\"_\"&H$4&\"_\"&$A24),'All Data'!$A$2:$L$1048576,H$1,FALSE)","v":11.01066},{"$f":"VLOOKUP(($B24&\"_\"&I$2&\"_\"&I$3&\"_\"&I$4&\"_\"&$A24),'All Data'!$A$2:$L$1048576,I$1,FALSE)","v":5.821472},{"$f":"VLOOKUP(($B24&\"_\"&J$2&\"_\"&J$3&\"_\"&J$4&\"_\"&$A24),'All Data'!$A$2:$L$1048576,J$1,FALSE)","v":9.8373790000000003},{"$f":"VLOOKUP(($B24&\"_\"&K$2&\"_\"&K$3&\"_\"&K$4&\"_\"&$A24),'All Data'!$A$2:$L$1048576,K$1,FALSE)","v":65.996610000000004},{"$f":"VLOOKUP(($B24&\"_\"&L$2&\"_\"&L$3&\"_\"&L$4&\"_\"&$A24),'All Data'!$A$2:$L$1048576,L$1,FALSE)","v":71.441649999999996},{"$f":"VLOOKUP(($B24&\"_\"&M$2&\"_\"&M$3&\"_\"&M$4&\"_\"&$A24),'All Data'!$A$2:$L$1048576,M$1,FALSE)","v":{"$error":"#N/A"}},{"$f":"VLOOKUP(($B24&\"_\"&N$2&\"_\"&N$3&\"_\"&N$4&\"_\"&$A24),'All Data'!$A$2:$L$1048576,N$1,FALSE)","v":{"$error":"#N/A"}},{"$f":"VLOOKUP(($B24&\"_\"&O$2&\"_\"&O$3&\"_\"&O$4&\"_\"&$A24),'All Data'!$A$2:$L$1048576,O$1,FALSE)","v":21.26661},{"$f":"VLOOKUP(($B24&\"_\"&P$2&\"_\"&P$3&\"_\"&P$4&\"_\"&$A24),'All Data'!$A$2:$L$1048576,P$1,FALSE)","v":26.41367},{"$f":"VLOOKUP(($B24&\"_\"&Q$2&\"_\"&Q$3&\"_\"&Q$4&\"_\"&$A24),'All Data'!$A$2:$L$1048576,Q$1,FALSE)","v":2.0753460000000001},{"$f":"VLOOKUP(($B24&\"_\"&R$2&\"_\"&R$3&\"_\"&R$4&\"_\"&$A24),'All Data'!$A$2:$L$1048576,R$1,FALSE)","v":2.321898},{"$f":"VLOOKUP(($B24&\"_\"&S$2&\"_\"&S$3&\"_\"&S$4&\"_\"&$A24),'All Data'!$A$2:$L$1048576,S$1,FALSE)","v":26.963140000000003},{"$f":"VLOOKUP(($B24&\"_\"&T$2&\"_\"&T$3&\"_\"&T$4&\"_\"&$A24),'All Data'!$A$2:$L$1048576,T$1,FALSE)","v":32.415840000000003},{"$f":"VLOOKUP(($B24&\"_\"&U$2&\"_\"&U$3&\"_\"&U$4&\"_\"&$A24),'All Data'!$A$2:$L$1048576,U$1,FALSE)","v":57.256339999999994},{"$f":"VLOOKUP(($B24&\"_\"&V$2&\"_\"&V$3&\"_\"&V$4&\"_\"&$A24),'All Data'!$A$2:$L$1048576,V$1,FALSE)","v":63.088960000000007},{"$f":"VLOOKUP(($B24&\"_\"&W$2&\"_\"&W$3&\"_\"&W$4&\"_\"&$A24),'All Data'!$A$2:$L$1048576,W$1,FALSE)","v":297.78613000000001},{"$f":"VLOOKUP(($B24&\"_\"&X$2&\"_\"&X$3&\"_\"&X$4&\"_\"&$A24),'All Data'!$A$2:$L$1048576,X$1,FALSE)","v":352.71105},{"$f":"VLOOKUP(($B24&\"_\"&Y$2&\"_\"&Y$3&\"_\"&Y$4&\"_\"&$A24),'All Data'!$A$2:$L$1048576,Y$1,FALSE)","v":395.65877999999998},{"$f":"VLOOKUP(($B24&\"_\"&Z$2&\"_\"&Z$3&\"_\"&Z$4&\"_\"&$A24),'All Data'!$A$2:$L$1048576,Z$1,FALSE)","v":487.06013999999999},{"$f":"VLOOKUP(($B24&\"_\"&AA$2&\"_\"&AA$3&\"_\"&AA$4&\"_\"&$A24),'All Data'!$A$2:$L$1048576,AA$1,FALSE)","v":184.45939000000001},{"$f":"VLOOKUP(($B24&\"_\"&AB$2&\"_\"&AB$3&\"_\"&AB$4&\"_\"&$A24),'All Data'!$A$2:$L$1048576,AB$1,FALSE)","v":247.83457999999999},{"$f":"VLOOKUP(($B24&\"_\"&AC$2&\"_\"&AC$3&\"_\"&AC$4&\"_\"&$A24),'All Data'!$A$2:$L$1048576,AC$1,FALSE)","v":32.402434865172097},{"$f":"VLOOKUP(($B24&\"_\"&AD$2&\"_\"&AD$3&\"_\"&AD$4&\"_\"&$A24),'All Data'!$A$2:$L$1048576,AD$1,FALSE)","v":46.060150763373763},{"$f":"VLOOKUP(($B24&\"_\"&AE$2&\"_\"&AE$3&\"_\"&AE$4&\"_\"&$A24),'All Data'!$A$2:$L$1048576,AE$1,FALSE)","v":674.36541},{"$f":"VLOOKUP(($B24&\"_\"&AF$2&\"_\"&AF$3&\"_\"&AF$4&\"_\"&$A24),'All Data'!$A$2:$L$1048576,AF$1,FALSE)","v":863.04348000000005},{"$f":"VLOOKUP(($B24&\"_\"&AG$2&\"_\"&AG$3&\"_\"&AG$4&\"_\"&$A24),'All Data'!$A$2:$L$1048576,AG$1,FALSE)","v":340.39312999999999},{"$f":"VLOOKUP(($B24&\"_\"&AH$2&\"_\"&AH$3&\"_\"&AH$4&\"_\"&$A24),'All Data'!$A$2:$L$1048576,AH$1,FALSE)","v":576.67728},{"$f":"VLOOKUP(($B24&\"_\"&AI$2&\"_\"&AI$3&\"_\"&AI$4&\"_\"&$A24),'All Data'!$A$2:$L$1048576,AI$1,FALSE)","v":824.34853999999996},{"$f":"VLOOKUP(($B24&\"_\"&AJ$2&\"_\"&AJ$3&\"_\"&AJ$4&\"_\"&$A24),'All Data'!$A$2:$L$1048576,AJ$1,FALSE)","v":1097.6584600000001},{"$f":"VLOOKUP(($B24&\"_\"&AK$2&\"_\"&AK$3&\"_\"&AK$4&\"_\"&$A24),'All Data'!$A$2:$L$1048576,AK$1,FALSE)","v":80.075776817749357},{"$f":"VLOOKUP(($B24&\"_\"&AL$2&\"_\"&AL$3&\"_\"&AL$4&\"_\"&$A24),'All Data'!$A$2:$L$1048576,AL$1,FALSE)","v":83.415000659929532}]
["LA","Blaenau Gwent",{"$f":"VLOOKUP(($B25&\"_\"&C$2&\"_\"&C$3&\"_\"&C$4&\"_\"&$A25),'All Data'!$A$2:$L$1048576,C$1,FALSE)","v":0},{"$f":"VLOOKUP(($B25&\"_\"&D$2&\"_\"&D$3&\"_\"&D$4&\"_\"&$A25),'All Data'!$A$2:$L$1048576,D$1,FALSE)","v":0},{"$f":"VLOOKUP(($B25&\"_\"&E$2&\"_\"&E$3&\"_\"&E$4&\"_\"&$A25),'All Data'!$A$2:$L$1048576,E$1,FALSE)","v":0},{"$f":"VLOOKUP(($B25&\"_\"&F$2&\"_\"&F$3&\"_\"&F$4&\"_\"&$A25),'All Data'!$A$2:$L$1048576,F$1,FALSE)","v":0},{"$f":"VLOOKUP(($B25&\"_\"&G$2&\"_\"&G$3&\"_\"&G$4&\"_\"&$A25),'All Data'!$A$2:$L$1048576,G$1,FALSE)","v":-3.1136550000000001},{"$f":"VLOOKUP(($B25&\"_\"&H$2&\"_\"&H$3&\"_\"&H$4&\"_\"&$A25),'All Data'!$A$2:$L$1048576,H$1,FALSE)","v":8.4073469999999997},{"$f":"VLOOKUP(($B25&\"_\"&I$2&\"_\"&I$3&\"_\"&I$4&\"_\"&$A25),'All Data'!$A$2:$L$1048576,I$1,FALSE)","v":-1.882884},{"$f":"VLOOKUP(($B25&\"_\"&J$2&\"_\"&J$3&\"_\"&J$4&\"_\"&$A25),'All Data'!$A$2:$L$1048576,J$1,FALSE)","v":5.7599989999999996},{"$f":"VLOOKUP(($B25&\"_\"&K$2&\"_\"&K$3&\"_\"&K$4&\"_\"&$A25),'All Data'!$A$2:$L$1048576,K$1,FALSE)","v":62.100639999999999},{"$f":"VLOOKUP(($B25&\"_\"&L$2&\"_\"&L$3&\"_\"&L$4&\"_\"&$A25),'All Data'!$A$2:$L$1048576,L$1,FALSE)","v":68.199250000000006},{"$f":"VLOOKUP(($B25&\"_\"&M$2&\"_\"&M$3&\"_\"&M$4&\"_\"&$A25),'All Data'!$A$2:$L$1048576,M$1,FALSE)","v":{"$error":"#N/A"}},{"$f":"VLOOKUP(($B25&\"_\"&N$2&\"_\"&N$3&\"_\"&N$4&\"_\"&$A25),'All Data'!$A$2:$L$1048576,N$1,FALSE)","v":{"$error":"#N/A"}},{"$f":"VLOOKUP(($B25&\"_\"&O$2&\"_\"&O$3&\"_\"&O$4&\"_\"&$A25),'All Data'!$A$2:$L$1048576,O$1,FALSE)","v":24.712419999999998},{"$f":"VLOOKUP(($B25&\"_\"&P$2&\"_\"&P$3&\"_\"&P$4&\"_\"&$A25),'All Data'!$A$2:$L$1048576,P$1,FALSE)","v":30.59535},{"$f":"VLOOKUP(($B25&\"_\"&Q$2&\"_\"&Q$3&\"_\"&Q$4&\"_\"&$A25),'All Data'!$A$2:$L$1048576,Q$1,FALSE)","v":2.0699969999999999},{"$f":"VLOOKUP(($B25&\"_\"&R$2&\"_\"&R$3&\"_\"&R$4&\"_\"&$A25),'All Data'!$A$2:$L$1048576,R$1,FALSE)","v":2.328535},{"$f":"VLOOKUP(($B25&\"_\"&S$2&\"_\"&S$3&\"_\"&S$4&\"_\"&$A25),'All Data'!$A$2:$L$1048576,S$1,FALSE)","v":25.492720000000002},{"$f":"VLOOKUP(($B25&\"_\"&T$2&\"_\"&T$3&\"_\"&T$4&\"_\"&$A25),'All Data'!$A$2:$L$1048576,T$1,FALSE)","v":31.29712},{"$f":"VLOOKUP(($B25&\"_\"&U$2&\"_\"&U$3&\"_\"&U$4&\"_\"&$A25),'All Data'!$A$2:$L$1048576,U$1,FALSE)","v":57.885220000000004},{"$f":"VLOOKUP(($B25&\"_\"&V$2&\"_\"&V$3&\"_\"&V$4&\"_\"&$A25),'All Data'!$A$2:$L$1048576,V$1,FALSE)","v":63.88026},{"$f":"VLOOKUP(($B25&\"_\"&W$2&\"_\"&W$3&\"_\"&W$4&\"_\"&$A25),'All Data'!$A$2:$L$1048576,W$1,FALSE)","v":369.63902999999999},{"$f":"VLOOKUP(($B25&\"_\"&X$2&\"_\"&X$3&\"_\"&X$4&\"_\"&$A25),'All Data'!$A$2:$L$1048576,X$1,FALSE)","v":469.67525000000001},{"$f":"VLOOKUP(($B25&\"_\"&Y$2&\"_\"&Y$3&\"_\"&Y$4&\"_\"&$A25),'All Data'!$A$2:$L$1048576,Y$1,FALSE)","v":503.92583999999999},{"$f":"VLOOKUP(($B25&\"_\"&Z$2&\"_\"&Z$3&\"_\"&Z$4&\"_\"&$A25),'All Data'!$A$2:$L$1048576,Z$1,FALSE)","v":674.0557},{"$f":"VLOOKUP(($B25&\"_\"&AA$2&\"_\"&AA$3&\"_\"&AA$4&\"_\"&$A25),'All Data'!$A$2:$L$1048576,AA$1,FALSE)","v":208.58721},{"$f":"VLOOKUP(($B25&\"_\"&AB$2&\"_\"&AB$3&\"_\"&AB$4&\"_\"&$A25),'All Data'!$A$2:$L$1048576,AB$1,FALSE)","v":320.27782999999999},{"$f":"VLOOKUP(($B25&\"_\"&AC$2&\"_\"&AC$3&\"_\"&AC$4&\"_\"&$A25),'All Data'!$A$2:$L$1048576,AC$1,FALSE)","v":28.190410006949275},{"$f":"VLOOKUP(($B25&\"_\"&AD$2&\"_\"&AD$3&\"_\"&AD$4&\"_\"&$A25),'All Data'!$A$2:$L$1048576,AD$1,FALSE)","v":48.963168867268941},{"$f":"VLOOKUP(($B25&\"_\"&AE$2&\"_\"&AE$3&\"_\"&AE$4&\"_\"&$A25),'All Data'!$A$2:$L$1048576,AE$1,FALSE)","v":796.27994000000001},{"$f":"VLOOKUP(($B25&\"_\"&AF$2&\"_\"&AF$3&\"_\"&AF$4&\"_\"&$A25),'All Data'!$A$2:$L$1048576,AF$1,FALSE)","v":1107.4205999999999},{"$f":"VLOOKUP(($B25&\"_\"&AG$2&\"_\"&AG$3&\"_\"&AG$4&\"_\"&$A25),'All Data'!$A$2:$L$1048576,AG$1,FALSE)","v":430.42426},{"$f":"VLOOKUP(($B25&\"_\"&AH$2&\"_\"&AH$3&\"_\"&AH$4&\"_\"&$A25),'All Data'!$A$2:$L$1048576,AH$1,FALSE)","v":855.55472999999995},{"$f":"VLOOKUP(($B25&\"_\"&AI$2&\"_\"&AI$3&\"_\"&AI$4&\"_\"&$A25),'All Data'!$A$2:$L$1048576,AI$1,FALSE)","v":930.71866},{"$f":"VLOOKUP(($B25&\"_\"&AJ$2&\"_\"&AJ$3&\"_\"&AJ$4&\"_\"&$A25),'All Data'!$A$2:$L$1048576,AJ$1,FALSE)","v":1373.0137},{"$f":"VLOOKUP(($B25&\"_\"&AK$2&\"_\"&AK$3&\"_\"&AK$4&\"_\"&$A25),'All Data'!$A$2:$L$1048576,AK$1,FALSE)","v":81.16770282360369},{"$f":"VLOOKUP(($B25&\"_\"&AL$2&\"_\"&AL$3&\"_\"&AL$4&\"_\"&$A25),'All Data'!$A$2:$L$1048576,AL$1,FALSE)","v":86.385570001547492}]
["LA","Torfaen",{"$f":"VLOOKUP(($B26&\"_\"&C$2&\"_\"&C$3&\"_\"&C$4&\"_\"&$A26),'All Data'!$A$2:$L$1048576,C$1,FALSE)","v":0},{"$f":"VLOOKUP(($B26&\"_\"&D$2&\"_\"&D$3&\"_\"&D$4&\"_\"&$A26),'All Data'!$A$2:$L$1048576,D$1,FALSE)","v":0},{"$f":"VLOOKUP(($B26&\"_\"&E$2&\"_\"&E$3&\"_\"&E$4&\"_\"&$A26),'All Data'!$A$2:$L$1048576,E$1,FALSE)","v":0},{"$f":"VLOOKUP(($B26&\"_\"&F$2&\"_\"&F$3&\"_\"&F$4&\"_\"&$A26),'All Data'!$A$2:$L$1048576,F$1,FALSE)","v":0},{"$f":"VLOOKUP(($B26&\"_\"&G$2&\"_\"&G$3&\"_\"&G$4&\"_\"&$A26),'All Data'!$A$2:$L$1048576,G$1,FALSE)","v":4.6733919999999998},{"$f":"VLOOKUP(($B26&\"_\"&H$2&\"_\"&H$3&\"_\"&H$4&\"_\"&$A26),'All Data'!$A$2:$L$1048576,H$1,FALSE)","v":9.9368960000000008},{"$f":"VLOOKUP(($B26&\"_\"&I$2&\"_\"&I$3&\"_\"&I$4&\"_\"&$A26),'All Data'!$A$2:$L$1048576,I$1,FALSE)","v":2.9951349999999999},{"$f":"VLOOKUP(($B26&\"_\"&J$2&\"_\"&J$3&\"_\"&J$4&\"_\"&$A26),'All Data'!$A$2:$L$1048576,J$1,FALSE)","v":9.1086550000000006},{"$f":"VLOOKUP(($B26&\"_\"&K$2&\"_\"&K$3&\"_\"&K$4&\"_\"&$A26),'All Data'!$A$2:$L$1048576,K$1,FALSE)","v":67.92607000000001},{"$f":"VLOOKUP(($B26&\"_\"&L$2&\"_\"&L$3&\"_\"&L$4&\"_\"&$A26),'All Data'!$A$2:$L$1048576,L$1,FALSE)","v":73.594760000000008},{"$f":"VLOOKUP(($B26&\"_\"&M$2&\"_\"&M$3&\"_\"&M$4&\"_\"&$A26),'All Data'!$A$2:$L$1048576,M$1,FALSE)","v":{"$error":"#N/A"}},{"$f":"VLOOKUP(($B26&\"_\"&N$2&\"_\"&N$3&\"_\"&N$4&\"_\"&$A26),'All Data'!$A$2:$L$1048576,N$1,FALSE)","v":{"$error":"#N/A"}},{"$f":"VLOOKUP(($B26&\"_\"&O$2&\"_\"&O$3&\"_\"&O$4&\"_\"&$A26),'All Data'!$A$2:$L$1048576,O$1,FALSE)","v":22.64048},{"$f":"VLOOKUP(($B26&\"_\"&P$2&\"_\"&P$3&\"_\"&P$4&\"_\"&$A26),'All Data'!$A$2:$L$1048576,P$1,FALSE)","v":28.466010000000004},{"$f":"VLOOKUP(($B26&\"_\"&Q$2&\"_\"&Q$3&\"_\"&Q$4&\"_\"&$A26),'All Data'!$A$2:$L$1048576,Q$1,FALSE)","v":2.115748},{"$f":"VLOOKUP(($B26&\"_\"&R$2&\"_\"&R$3&\"_\"&R$4&\"_\"&$A26),'All Data'!$A$2:$L$1048576,R$1,FALSE)","v":2.379931},{"$f":"VLOOKUP(($B26&\"_\"&S$2&\"_\"&S$3&\"_\"&S$4&\"_\"&$A26),'All Data'!$A$2:$L$1048576,S$1,FALSE)","v":26.638400000000001},{"$f":"VLOOKUP(($B26&\"_\"&T$2&\"_\"&T$3&\"_\"&T$4&\"_\"&$A26),'All Data'!$A$2:$L$1048576,T$1,FALSE)","v":32.478149999999999},{"$f":"VLOOKUP(($B26&\"_\"&U$2&\"_\"&U$3&\"_\"&U$4&\"_\"&$A26),'All Data'!$A$2:$L$1048576,U$1,FALSE)","v":59.673670000000001},{"$f":"VLOOKUP(($B26&\"_\"&V$2&\"_\"&V$3&\"_\"&V$4&\"_\"&$A26),'All Data'!$A$2:$L$1048576,V$1,FALSE)","v":65.501410000000007},{"$f":"VLOOKUP(($B26&\"_\"&W$2&\"_\"&W$3&\"_\"&W$4&\"_\"&$A26),'All Data'!$A$2:$L$1048576,W$1,FALSE)","v":367.01082000000002},{"$f":"VLOOKUP(($B26&\"_\"&X$2&\"_\"&X$3&\"_\"&X$4&\"_\"&$A26),'All Data'!$A$2:$L$1048576,X$1,FALSE)","v":452.48548},{"$f":"VLOOKUP(($B26&\"_\"&Y$2&\"_\"&Y$3&\"_\"&Y$4&\"_\"&$A26),'All Data'!$A$2:$L$1048576,Y$1,FALSE)","v":443.72446000000002},{"$f":"VLOOKUP(($B26&\"_\"&Z$2&\"_\"&Z$3&\"_\"&Z$4&\"_\"&$A26),'All Data'!$A$2:$L$1048576,Z$1,FALSE)","v":579.30795999999998},{"$f":"VLOOKUP(($B26&\"_\"&AA$2&\"_\"&AA$3&\"_\"&AA$4&\"_\"&$A26),'All Data'!$A$2:$L$1048576,AA$1,FALSE)","v":263.68432000000001},{"$f":"VLOOKUP(($B26&\"_\"&AB$2&\"_\"&AB$3&\"_\"&AB$4&\"_\"&$A26),'All Data'!$A$2:$L$1048576,AB$1,FALSE)","v":371.35329000000002},{"$f":"VLOOKUP(($B26&\"_\"&AC$2&\"_\"&AC$3&\"_\"&AC$4&\"_\"&$A26),'All Data'!$A$2:$L$1048576,AC$1,FALSE)","v":29.644395361678633},{"$f":"VLOOKUP(($B26&\"_\"&AD$2&\"_\"&AD$3&\"_\"&AD$4&\"_\"&$A26),'All Data'!$A$2:$L$1048576,AD$1,FALSE)","v":48.218663721700715},{"$f":"VLOOKUP(($B26&\"_\"&AE$2&\"_\"&AE$3&\"_\"&AE$4&\"_\"&$A26),'All Data'!$A$2:$L$1048576,AE$1,FALSE)","v":587.55557999999996},{"$f":"VLOOKUP(($B26&\"_\"&AF$2&\"_\"&AF$3&\"_\"&AF$4&\"_\"&$A26),'All Data'!$A$2:$L$1048576,AF$1,FALSE)","v":814.73058000000003},{"$f":"VLOOKUP(($B26&\"_\"&AG$2&\"_\"&AG$3&\"_\"&AG$4&\"_\"&$A26),'All Data'!$A$2:$L$1048576,AG$1,FALSE)","v":332.75513000000001},{"$f":"VLOOKUP(($B26&\"_\"&AH$2&\"_\"&AH$3&\"_\"&AH$4&\"_\"&$A26),'All Data'!$A$2:$L$1048576,AH$1,FALSE)","v":641.69996000000003},{"$f":"VLOOKUP(($B26&\"_\"&AI$2&\"_\"&AI$3&\"_\"&AI$4&\"_\"&$A26),'All Data'!$A$2:$L$1048576,AI$1,FALSE)","v":676.31075999999996},{"$f":"VLOOKUP(($B26&\"_\"&AJ$2&\"_\"&AJ$3&\"_\"&AJ$4&\"_\"&$A26),'All Data'!$A$2:$L$1048576,AJ$1,FALSE)","v":992.23249999999996},{"$f":"VLOOKUP(($B26&\"_\"&AK$2&\"_\"&AK$3&\"_\"&AK$4&\"_\"&$A26),'All Data'!$A$2:$L$1048576,AK$1,FALSE)","v":80.550734122462316},{"$f":"VLOOKUP(($B26&\"_\"&AL$2&\"_\"&AL$3&\"_\"&AL$4&\"_\"&$A26),'All Data'!$A$2:$L$1048576,AL$1,FALSE)","v":85.066456310214818}]
["LA","Monmouthshire",{"$f":"VLOOKUP(($B27&\"_\"&C$2&\"_\"&C$3&\"_\"&C$4&\"_\"&$A27),'All Data'!$A$2:$L$1048576,C$1,FALSE)","v":0},{"$f":"VLOOKUP(($B27&\"_\"&D$2&\"_\"&D$3&\"_\"&D$4&\"_\"&$A27),'All Data'!$A$2:$L$1048576,D$1,FALSE)","v":0},{"$f":"VLOOKUP(($B27&\"_\"&E$2&\"_\"&E$3&\"_\"&E$4&\"_\"&$A27),'All Data'!$A$2:$L$1048576,E$1,FALSE)","v":0},{"$f":"VLOOKUP(($B27&\"_\"&F$2&\"_\"&F$3&\"_\"&F$4&\"_\"&$A27),'All Data'!$A$2:$L$1048576,F$1,FALSE)","v":0},{"$f":"VLOOKUP(($B27&\"_\"&G$2&\"_\"&G$3&\"_\"&G$4&\"_\"&$A27),'All Data'!$A$2:$L$1048576,G$1,FALSE)","v":4.4028770000000002},{"$f":"VLOOKUP(($B27&\"_\"&H$2&\"_\"&H$3&\"_\"&H$4&\"_\"&$A27),'All Data'!$A$2:$L$1048576,H$1,FALSE)","v":7.3757989999999998},{"$f":"VLOOKUP(($B27&\"_\"&I$2&\"_\"&I$3&\"_\"&I$4&\"_\"&$A27),'All Data'!$A$2:$L$1048576,I$1,FALSE)","v":5.0236299999999998E-2},{"$f":"VLOOKUP(($B27&\"_\"&J$2&\"_\"&J$3&\"_\"&J$4&\"_\"&$A27),'All Data'!$A$2:$L$1048576,J$1,FALSE)","v":8.1758880000000005},{"$f":"VLOOKUP(($B27&\"_\"&K$2&\"_\"&K$3&\"_\"&K$4&\"_\"&$A27),'All Data'!$A$2:$L$1048576,K$1,FALSE)","v":77.983599999999996},{"$f":"VLOOKUP(($B27&\"_\"&L$2&\"_\"&L$3&\"_\"&L$4&\"_\"&$A27),'All Data'!$A$2:$L$1048576,L$1,FALSE)","v":82.996139999999997},{"$f":"VLOOKUP(($B27&\"_\"&M$2&\"_\"&M$3&\"_\"&M$4&\"_\"&$A27),'All Data'!$A$2:$L$1048576,M$1,FALSE)","v":{"$error":"#N/A"}},{"$f":"VLOOKUP(($B27&\"_\"&N$2&\"_\"&N$3&\"_\"&N$4&\"_\"&$A27),'All Data'!$A$2:$L$1048576,N$1,FALSE)","v":{"$error":"#N/A"}},{"$f":"VLOOKUP(($B27&\"_\"&O$2&\"_\"&O$3&\"_\"&O$4&\"_\"&$A27),'All Data'!$A$2:$L$1048576,O$1,FALSE)","v":15.899319999999999},{"$f":"VLOOKUP(($B27&\"_\"&P$2&\"_\"&P$3&\"_\"&P$4&\"_\"&$A27),'All Data'!$A$2:$L$1048576,P$1,FALSE)","v":21.347550000000002},{"$f":"VLOOKUP(($B27&\"_\"&Q$2&\"_\"&Q$3&\"_\"&Q$4&\"_\"&$A27),'All Data'!$A$2:$L$1048576,Q$1,FALSE)","v":2.549871},{"$f":"VLOOKUP(($B27&\"_\"&R$2&\"_\"&R$3&\"_\"&R$4&\"_\"&$A27),'All Data'!$A$2:$L$1048576,R$1,FALSE)","v":2.814168},{"$f":"VLOOKUP(($B27&\"_\"&S$2&\"_\"&S$3&\"_\"&S$4&\"_\"&$A27),'All Data'!$A$2:$L$1048576,S$1,FALSE)","v":34.475679999999997},{"$f":"VLOOKUP(($B27&\"_\"&T$2&\"_\"&T$3&\"_\"&T$4&\"_\"&$A27),'All Data'!$A$2:$L$1048576,T$1,FALSE)","v":40.786660000000005},{"$f":"VLOOKUP(($B27&\"_\"&U$2&\"_\"&U$3&\"_\"&U$4&\"_\"&$A27),'All Data'!$A$2:$L$1048576,U$1,FALSE)","v":50.579320000000003},{"$f":"VLOOKUP(($B27&\"_\"&V$2&\"_\"&V$3&\"_\"&V$4&\"_\"&$A27),'All Data'!$A$2:$L$1048576,V$1,FALSE)","v":56.788939999999997},{"$f":"VLOOKUP(($B27&\"_\"&W$2&\"_\"&W$3&\"_\"&W$4&\"_\"&$A27),'All Data'!$A$2:$L$1048576,W$1,FALSE)","v":234.27700999999999},{"$f":"VLOOKUP(($B27&\"_\"&X$2&\"_\"&X$3&\"_\"&X$4&\"_\"&$A27),'All Data'!$A$2:$L$1048576,X$1,FALSE)","v":307.08186999999998},{"$f":"VLOOKUP(($B27&\"_\"&Y$2&\"_\"&Y$3&\"_\"&Y$4&\"_\"&$A27),'All Data'!$A$2:$L$1048576,Y$1,FALSE)","v":291.63342999999998},{"$f":"VLOOKUP(($B27&\"_\"&Z$2&\"_\"&Z$3&\"_\"&Z$4&\"_\"&$A27),'All Data'!$A$2:$L$1048576,Z$1,FALSE)","v":406.41302000000002},{"$f":"VLOOKUP(($B27&\"_\"&AA$2&\"_\"&AA$3&\"_\"&AA$4&\"_\"&$A27),'All Data'!$A$2:$L$1048576,AA$1,FALSE)","v":154.98956000000001},{"$f":"VLOOKUP(($B27&\"_\"&AB$2&\"_\"&AB$3&\"_\"&AB$4&\"_\"&$A27),'All Data'!$A$2:$L$1048576,AB$1,FALSE)","v":248.57150999999999},{"$f":"VLOOKUP(($B27&\"_\"&AC$2&\"_\"&AC$3&\"_\"&AC$4&\"_\"&$A27),'All Data'!$A$2:$L$1048576,AC$1,FALSE)","v":16.045480067377877},{"$f":"VLOOKUP(($B27&\"_\"&AD$2&\"_\"&AD$3&\"_\"&AD$4&\"_\"&$A27),'All Data'!$A$2:$L$1048576,AD$1,FALSE)","v":30.583380123526108},{"$f":"VLOOKUP(($B27&\"_\"&AE$2&\"_\"&AE$3&\"_\"&AE$4&\"_\"&$A27),'All Data'!$A$2:$L$1048576,AE$1,FALSE)","v":692.56087000000002},{"$f":"VLOOKUP(($B27&\"_\"&AF$2&\"_\"&AF$3&\"_\"&AF$4&\"_\"&$A27),'All Data'!$A$2:$L$1048576,AF$1,FALSE)","v":927.73505999999998},{"$f":"VLOOKUP(($B27&\"_\"&AG$2&\"_\"&AG$3&\"_\"&AG$4&\"_\"&$A27),'All Data'!$A$2:$L$1048576,AG$1,FALSE)","v":394.61507999999998},{"$f":"VLOOKUP(($B27&\"_\"&AH$2&\"_\"&AH$3&\"_\"&AH$4&\"_\"&$A27),'All Data'!$A$2:$L$1048576,AH$1,FALSE)","v":702.36666000000002},{"$f":"VLOOKUP(($B27&\"_\"&AI$2&\"_\"&AI$3&\"_\"&AI$4&\"_\"&$A27),'All Data'!$A$2:$L$1048576,AI$1,FALSE)","v":812.49189000000001},{"$f":"VLOOKUP(($B27&\"_\"&AJ$2&\"_\"&AJ$3&\"_\"&AJ$4&\"_\"&$A27),'All Data'!$A$2:$L$1048576,AJ$1,FALSE)","v":1153.2515100000001},{"$f":"VLOOKUP(($B27&\"_\"&AK$2&\"_\"&AK$3&\"_\"&AK$4&\"_\"&$A27),'All Data'!$A$2:$L$1048576,AK$1,FALSE)","v":80.546303794244324},{"$f":"VLOOKUP(($B27&\"_\"&AL$2&\"_\"&AL$3&\"_\"&AL$4&\"_\"&$A27),'All Data'!$A$2:$L$1048576,AL$1,FALSE)","v":85.520743247328369}]
["LA","Newport",{"$f":"VLOOKUP(($B28&\"_\"&C$2&\"_\"&C$3&\"_\"&C$4&\"_\"&$A28),'All Data'!$A$2:$L$1048576,C$1,FALSE)","v":0},{"$f":"VLOOKUP(($B28&\"_\"&D$2&\"_\"&D$3&\"_\"&D$4&\"_\"&$A28),'All Data'!$A$2:$L$1048576,D$1,FALSE)","v":0},{"$f":"VLOOKUP(($B28&\"_\"&E$2&\"_\"&E$3&\"_\"&E$4&\"_\"&$A28),'All Data'!$A$2:$L$1048576,E$1,FALSE)","v":0},{"$f":"VLOOKUP(($B28&\"_\"&F$2&\"_\"&F$3&\"_\"&F$4&\"_\"&$A28),'All Data'!$A$2:$L$1048576,F$1,FALSE)","v":0},{"$f":"VLOOKUP(($B28&\"_\"&G$2&\"_\"&G$3&\"_\"&G$4&\"_\"&$A28),'All Data'!$A$2:$L$1048576,G$1,FALSE)","v":9.4929000000000006},{"$f":"VLOOKUP(($B28&\"_\"&H$2&\"_\"&H$3&\"_\"&H$4&\"_\"&$A28),'All Data'!$A$2:$L$1048576,H$1,FALSE)","v":12.56765},{"$f":"VLOOKUP(($B28&\"_\"&I$2&\"_\"&I$3&\"_\"&I$4&\"_\"&$A28),'All Data'!$A$2:$L$1048576,I$1,FALSE)","v":-0.1301842},{"$f":"VLOOKUP(($B28&\"_\"&J$2&\"_\"&J$3&\"_\"&J$4&\"_\"&$A28),'All Data'!$A$2:$L$1048576,J$1,FALSE)","v":12.652839999999999},{"$f":"VLOOKUP(($B28&\"_\"&K$2&\"_\"&K$3&\"_\"&K$4&\"_\"&$A28),'All Data'!$A$2:$L$1048576,K$1,FALSE)","v":69.498739999999998},{"$f":"VLOOKUP(($B28&\"_\"&L$2&\"_\"&L$3&\"_\"&L$4&\"_\"&$A28),'All Data'!$A$2:$L$1048576,L$1,FALSE)","v":74.698210000000003},{"$f":"VLOOKUP(($B28&\"_\"&M$2&\"_\"&M$3&\"_\"&M$4&\"_\"&$A28),'All Data'!$A$2:$L$1048576,M$1,FALSE)","v":{"$error":"#N/A"}},{"$f":"VLOOKUP(($B28&\"_\"&N$2&\"_\"&N$3&\"_\"&N$4&\"_\"&$A28),'All Data'!$A$2:$L$1048576,N$1,FALSE)","v":{"$error":"#N/A"}},{"$f":"VLOOKUP(($B28&\"_\"&O$2&\"_\"&O$3&\"_\"&O$4&\"_\"&$A28),'All Data'!$A$2:$L$1048576,O$1,FALSE)","v":21.837029999999999},{"$f":"VLOOKUP(($B28&\"_\"&P$2&\"_\"&P$3&\"_\"&P$4&\"_\"&$A28),'All Data'!$A$2:$L$1048576,P$1,FALSE)","v":27.583400000000001},{"$f":"VLOOKUP(($B28&\"_\"&Q$2&\"_\"&Q$3&\"_\"&Q$4&\"_\"&$A28),'All Data'!$A$2:$L$1048576,Q$1,FALSE)","v":2.1234670000000002},{"$f":"VLOOKUP(($B28&\"_\"&R$2&\"_\"&R$3&\"_\"&R$4&\"_\"&$A28),'All Data'!$A$2:$L$1048576,R$1,FALSE)","v":2.3638499999999998},{"$f":"VLOOKUP(($B28&\"_\"&S$2&\"_\"&S$3&\"_\"&S$4&\"_\"&$A28),'All Data'!$A$2:$L$1048576,S$1,FALSE)","v":30.615189999999998},{"$f":"VLOOKUP(($B28&\"_\"&T$2&\"_\"&T$3&\"_\"&T$4&\"_\"&$A28),'All Data'!$A$2:$L$1048576,T$1,FALSE)","v":36.446190000000001},{"$f":"VLOOKUP(($B28&\"_\"&U$2&\"_\"&U$3&\"_\"&U$4&\"_\"&$A28),'All Data'!$A$2:$L$1048576,U$1,FALSE)","v":54.966999999999999},{"$f":"VLOOKUP(($B28&\"_\"&V$2&\"_\"&V$3&\"_\"&V$4&\"_\"&$A28),'All Data'!$A$2:$L$1048576,V$1,FALSE)","v":60.876189999999994},{"$f":"VLOOKUP(($B28&\"_\"&W$2&\"_\"&W$3&\"_\"&W$4&\"_\"&$A28),'All Data'!$A$2:$L$1048576,W$1,FALSE)","v":392.11441000000002},{"$f":"VLOOKUP(($B28&\"_\"&X$2&\"_\"&X$3&\"_\"&X$4&\"_\"&$A28),'All Data'!$A$2:$L$1048576,X$1,FALSE)","v":461.89837999999997},{"$f":"VLOOKUP(($B28&\"_\"&Y$2&\"_\"&Y$3&\"_\"&Y$4&\"_\"&$A28),'All Data'!$A$2:$L$1048576,Y$1,FALSE)","v":499.96275000000003},{"$f":"VLOOKUP(($B28&\"_\"&Z$2&\"_\"&Z$3&\"_\"&Z$4&\"_\"&$A28),'All Data'!$A$2:$L$1048576,Z$1,FALSE)","v":614.04324999999994},{"$f":"VLOOKUP(($B28&\"_\"&AA$2&\"_\"&AA$3&\"_\"&AA$4&\"_\"&$A28),'All Data'!$A$2:$L$1048576,AA$1,FALSE)","v":264.36345},{"$f":"VLOOKUP(($B28&\"_\"&AB$2&\"_\"&AB$3&\"_\"&AB$4&\"_\"&$A28),'All Data'!$A$2:$L$1048576,AB$1,FALSE)","v":347.55135000000001},{"$f":"VLOOKUP(($B28&\"_\"&AC$2&\"_\"&AC$3&\"_\"&AC$4&\"_\"&$A28),'All Data'!$A$2:$L$1048576,AC$1,FALSE)","v":35.03174280572636},{"$f":"VLOOKUP(($B28&\"_\"&AD$2&\"_\"&AD$3&\"_\"&AD$4&\"_\"&$A28),'All Data'!$A$2:$L$1048576,AD$1,FALSE)","v":50.615182748472826},{"$f":"VLOOKUP(($B28&\"_\"&AE$2&\"_\"&AE$3&\"_\"&AE$4&\"_\"&$A28),'All Data'!$A$2:$L$1048576,AE$1,FALSE)","v":546.67102999999997},{"$f":"VLOOKUP(($B28&\"_\"&AF$2&\"_\"&AF$3&\"_\"&AF$4&\"_\"&$A28),'All Data'!$A$2:$L$1048576,AF$1,FALSE)","v":728.24469999999997},{"$f":"VLOOKUP(($B28&\"_\"&AG$2&\"_\"&AG$3&\"_\"&AG$4&\"_\"&$A28),'All Data'!$A$2:$L$1048576,AG$1,FALSE)","v":356.98421999999999},{"$f":"VLOOKUP(($B28&\"_\"&AH$2&\"_\"&AH$3&\"_\"&AH$4&\"_\"&$A28),'All Data'!$A$2:$L$1048576,AH$1,FALSE)","v":618.16553999999996},{"$f":"VLOOKUP(($B28&\"_\"&AI$2&\"_\"&AI$3&\"_\"&AI$4&\"_\"&$A28),'All Data'!$A$2:$L$1048576,AI$1,FALSE)","v":626.53036999999995},{"$f":"VLOOKUP(($B28&\"_\"&AJ$2&\"_\"&AJ$3&\"_\"&AJ$4&\"_\"&$A28),'All Data'!$A$2:$L$1048576,AJ$1,FALSE)","v":884.44754999999998},{"$f":"VLOOKUP(($B28&\"_\"&AK$2&\"_\"&AK$3&\"_\"&AK$4&\"_\"&$A28),'All Data'!$A$2:$L$1048576,AK$1,FALSE)","v":74.580163584196271},{"$f":"VLOOKUP(($B28&\"_\"&AL$2&\"_\"&AL$3&\"_\"&AL$4&\"_\"&$A28),'All Data'!$A$2:$L$1048576,AL$1,FALSE)","v":78.383895874692314}]
["HB","Betsi Cadwaladr UHB",{"$f":"VLOOKUP(($B29&\"_\"&C$2&\"_\"&C$3&\"_\"&C$4&\"_\"&$A29),'All Data'!$A$2:$L$1048576,C$1,FALSE)","v":0},{"$f":"VLOOKUP(($B29&\"_\"&D$2&\"_\"&D$3&\"_\"&D$4&\"_\"&$A29),'All Data'!$A$2:$L$1048576,D$1,FALSE)","v":0},{"$f":"VLOOKUP(($B29&\"_\"&E$2&\"_\"&E$3&\"_\"&E$4&\"_\"&$A29),'All Data'!$A$2:$L$1048576,E$1,FALSE)","v":0},{"$f":"VLOOKUP(($B29&\"_\"&F$2&\"_\"&F$3&\"_\"&F$4&\"_\"&$A29),'All Data'!$A$2:$L$1048576,F$1,FALSE)","v":0},{"$f":"VLOOKUP(($B29&\"_\"&G$2&\"_\"&G$3&\"_\"&G$4&\"_\"&$A29),'All Data'!$A$2:$L$1048576,G$1,FALSE)","v":2.8664239999999999},{"$f":"VLOOKUP(($B29&\"_\"&H$2&\"_\"&H$3&\"_\"&H$4&\"_\"&$A29),'All Data'!$A$2:$L$1048576,H$1,FALSE)","v":11.509969999999999},{"$f":"VLOOKUP(($B29&\"_\"&I$2&\"_\"&I$3&\"_\"&I$4&\"_\"&$A29),'All Data'!$A$2:$L$1048576,I$1,FALSE)","v":2.0153180000000002},{"$f":"VLOOKUP(($B29&\"_\"&J$2&\"_\"&J$3&\"_\"&J$4&\"_\"&$A29),'All Data'!$A$2:$L$1048576,J$1,FALSE)","v":9.0516290000000001},{"$f":"VLOOKUP(($B29&\"_\"&K$2&\"_\"&K$3&\"_\"&K$4&\"_\"&$A29),'All Data'!$A$2:$L$1048576,K$1,FALSE)","v":76.708629999999999},{"$f":"VLOOKUP(($B29&\"_\"&L$2&\"_\"&L$3&\"_\"&L$4&\"_\"&$A29),'All Data'!$A$2:$L$1048576,L$1,FALSE)","v":78.846890000000002},{"$f":"VLOOKUP(($B29&\"_\"&M$2&\"_\"&M$3&\"_\"&M$4&\"_\"&$A29),'All Data'!$A$2:$L$1048576,M$1,FALSE)","v":{"$error":"#N/A"}},{"$f":"VLOOKUP(($B29&\"_\"&N$2&\"_\"&N$3&\"_\"&N$4&\"_\"&$A29),'All Data'!$A$2:$L$1048576,N$1,FALSE)","v":{"$error":"#N/A"}},{"$f":"VLOOKUP(($B29&\"_\"&O$2&\"_\"&O$3&\"_\"&O$4&\"_\"&$A29),'All Data'!$A$2:$L$1048576,O$1,FALSE)","v":22.21743},{"$f":"VLOOKUP(($B29&\"_\"&P$2&\"_\"&P$3&\"_\"&P$4&\"_\"&$A29),'All Data'!$A$2:$L$1048576,P$1,FALSE)","v":24.535080000000001},{"$f":"VLOOKUP(($B29&\"_\"&Q$2&\"_\"&Q$3&\"_\"&Q$4&\"_\"&$A29),'All Data'!$A$2:$L$1048576,Q$1,FALSE)","v":2.4267349999999999},{"$f":"VLOOKUP(($B29&\"_\"&R$2&\"_\"&R$3&\"_\"&R$4&\"_\"&$A29),'All Data'!$A$2:$L$1048576,R$1,FALSE)","v":2.5343819999999999},{"$f":"VLOOKUP(($B29&\"_\"&S$2&\"_\"&S$3&\"_\"&S$4&\"_\"&$A29),'All Data'!$A$2:$L$1048576,S$1,FALSE)","v":34.636620000000001},{"$f":"VLOOKUP(($B29&\"_\"&T$2&\"_\"&T$3&\"_\"&T$4&\"_\"&$A29),'All Data'!$A$2:$L$1048576,T$1,FALSE)","v":37.234000000000002},{"$f":"VLOOKUP(($B29&\"_\"&U$2&\"_\"&U$3&\"_\"&U$4&\"_\"&$A29),'All Data'!$A$2:$L$1048576,U$1,FALSE)","v":53.257580000000004},{"$f":"VLOOKUP(($B29&\"_\"&V$2&\"_\"&V$3&\"_\"&V$4&\"_\"&$A29),'All Data'!$A$2:$L$1048576,V$1,FALSE)","v":55.777630000000002},{"$f":"VLOOKUP(($B29&\"_\"&W$2&\"_\"&W$3&\"_\"&W$4&\"_\"&$A29),'All Data'!$A$2:$L$1048576,W$1,FALSE)","v":355.25817000000001},{"$f":"VLOOKUP(($B29&\"_\"&X$2&\"_\"&X$3&\"_\"&X$4&\"_\"&$A29),'All Data'!$A$2:$L$1048576,X$1,FALSE)","v":385.04556000000002},{"$f":"VLOOKUP(($B29&\"_\"&Y$2&\"_\"&Y$3&\"_\"&Y$4&\"_\"&$A29),'All Data'!$A$2:$L$1048576,Y$1,FALSE)","v":445.01456999999999},{"$f":"VLOOKUP(($B29&\"_\"&Z$2&\"_\"&Z$3&\"_\"&Z$4&\"_\"&$A29),'All Data'!$A$2:$L$1048576,Z$1,FALSE)","v":492.38619},{"$f":"VLOOKUP(($B29&\"_\"&AA$2&\"_\"&AA$3&\"_\"&AA$4&\"_\"&$A29),'All Data'!$A$2:$L$1048576,AA$1,FALSE)","v":256.86076000000003},{"$f":"VLOOKUP(($B29&\"_\"&AB$2&\"_\"&AB$3&\"_\"&AB$4&\"_\"&$A29),'All Data'!$A$2:$L$1048576,AB$1,FALSE)","v":293.44396},{"$f":"VLOOKUP(($B29&\"_\"&AC$2&\"_\"&AC$3&\"_\"&AC$4&\"_\"&$A29),'All Data'!$A$2:$L$1048576,AC$1,FALSE)","v":34.036977712149287},{"$f":"VLOOKUP(($B29&\"_\"&AD$2&\"_\"&AD$3&\"_\"&AD$4&\"_\"&$A29),'All Data'!$A$2:$L$1048576,AD$1,FALSE)","v":40.928025507418859},{"$f":"VLOOKUP(($B29&\"_\"&AE$2&\"_\"&AE$3&\"_\"&AE$4&\"_\"&$A29),'All Data'!$A$2:$L$1048576,AE$1,FALSE)","v":622.87671},{"$f":"VLOOKUP(($B29&\"_\"&AF$2&\"_\"&AF$3&\"_\"&AF$4&\"_\"&$A29),'All Data'!$A$2:$L$1048576,AF$1,FALSE)","v":702.51561000000004},{"$f":"VLOOKUP(($B29&\"_\"&AG$2&\"_\"&AG$3&\"_\"&AG$4&\"_\"&$A29),'All Data'!$A$2:$L$1048576,AG$1,FALSE)","v":391.41392000000002},{"$f":"VLOOKUP(($B29&\"_\"&AH$2&\"_\"&AH$3&\"_\"&AH$4&\"_\"&$A29),'All Data'!$A$2:$L$1048576,AH$1,FALSE)","v":495.15989999999999},{"$f":"VLOOKUP(($B29&\"_\"&AI$2&\"_\"&AI$3&\"_\"&AI$4&\"_\"&$A29),'All Data'!$A$2:$L$1048576,AI$1,FALSE)","v":755.82510000000002},{"$f":"VLOOKUP(($B29&\"_\"&AJ$2&\"_\"&AJ$3&\"_\"&AJ$4&\"_\"&$A29),'All Data'!$A$2:$L$1048576,AJ$1,FALSE)","v":872.92105000000004},{"$f":"VLOOKUP(($B29&\"_\"&AK$2&\"_\"&AK$3&\"_\"&AK$4&\"_\"&$A29),'All Data'!$A$2:$L$1048576,AK$1,FALSE)","v":82.44393825028159},{"$f":"VLOOKUP(($B29&\"_\"&AL$2&\"_\"&AL$3&\"_\"&AL$4&\"_\"&$A29),'All Data'!$A$2:$L$1048576,AL$1,FALSE)","v":84.12304186964603}]
["HB","Powys THB",{"$f":"VLOOKUP(($B30&\"_\"&C$2&\"_\"&C$3&\"_\"&C$4&\"_\"&$A30),'All Data'!$A$2:$L$1048576,C$1,FALSE)","v":0},{"$f":"VLOOKUP(($B30&\"_\"&D$2&\"_\"&D$3&\"_\"&D$4&\"_\"&$A30),'All Data'!$A$2:$L$1048576,D$1,FALSE)","v":0},{"$f":"VLOOKUP(($B30&\"_\"&E$2&\"_\"&E$3&\"_\"&E$4&\"_\"&$A30),'All Data'!$A$2:$L$1048576,E$1,FALSE)","v":0},{"$f":"VLOOKUP(($B30&\"_\"&F$2&\"_\"&F$3&\"_\"&F$4&\"_\"&$A30),'All Data'!$A$2:$L$1048576,F$1,FALSE)","v":0},{"$f":"VLOOKUP(($B30&\"_\"&G$2&\"_\"&G$3&\"_\"&G$4&\"_\"&$A30),'All Data'!$A$2:$L$1048576,G$1,FALSE)","v":-0.49527690000000002},{"$f":"VLOOKUP(($B30&\"_\"&H$2&\"_\"&H$3&\"_\"&H$4&\"_\"&$A30),'All Data'!$A$2:$L$1048576,H$1,FALSE)","v":11.44021},{"$f":"VLOOKUP(($B30&\"_\"&I$2&\"_\"&I$3&\"_\"&I$4&\"_\"&$A30),'All Data'!$A$2:$L$1048576,I$1,FALSE)","v":-4.0372440000000003},{"$f":"VLOOKUP(($B30&\"_\"&J$2&\"_\"&J$3&\"_\"&J$4&\"_\"&$A30),'All Data'!$A$2:$L$1048576,J$1,FALSE)","v":13.85472},{"$f":"VLOOKUP(($B30&\"_\"&K$2&\"_\"&K$3&\"_\"&K$4&\"_\"&$A30),'All Data'!$A$2:$L$1048576,K$1,FALSE)","v":77.070390000000003},{"$f":"VLOOKUP(($B30&\"_\"&L$2&\"_\"&L$3&\"_\"&L$4&\"_\"&$A30),'All Data'!$A$2:$L$1048576,L$1,FALSE)","v":82.573810000000009},{"$f":"VLOOKUP(($B30&\"_\"&M$2&\"_\"&M$3&\"_\"&M$4&\"_\"&$A30),'All Data'!$A$2:$L$1048576,M$1,FALSE)","v":{"$error":"#N/A"}},{"$f":"VLOOKUP(($B30&\"_\"&N$2&\"_\"&N$3&\"_\"&N$4&\"_\"&$A30),'All Data'!$A$2:$L$1048576,N$1,FALSE)","v":{"$error":"#N/A"}},{"$f":"VLOOKUP(($B30&\"_\"&O$2&\"_\"&O$3&\"_\"&O$4&\"_\"&$A30),'All Data'!$A$2:$L$1048576,O$1,FALSE)","v":19.8109},{"$f":"VLOOKUP(($B30&\"_\"&P$2&\"_\"&P$3&\"_\"&P$4&\"_\"&$A30),'All Data'!$A$2:$L$1048576,P$1,FALSE)","v":25.693700000000003},{"$f":"VLOOKUP(($B30&\"_\"&Q$2&\"_\"&Q$3&\"_\"&Q$4&\"_\"&$A30),'All Data'!$A$2:$L$1048576,Q$1,FALSE)","v":2.6259760000000001},{"$f":"VLOOKUP(($B30&\"_\"&R$2&\"_\"&R$3&\"_\"&R$4&\"_\"&$A30),'All Data'!$A$2:$L$1048576,R$1,FALSE)","v":2.8918270000000001},{"$f":"VLOOKUP(($B30&\"_\"&S$2&\"_\"&S$3&\"_\"&S$4&\"_\"&$A30),'All Data'!$A$2:$L$1048576,S$1,FALSE)","v":33.775570000000002},{"$f":"VLOOKUP(($B30&\"_\"&T$2&\"_\"&T$3&\"_\"&T$4&\"_\"&$A30),'All Data'!$A$2:$L$1048576,T$1,FALSE)","v":40.363979999999998},{"$f":"VLOOKUP(($B30&\"_\"&U$2&\"_\"&U$3&\"_\"&U$4&\"_\"&$A30),'All Data'!$A$2:$L$1048576,U$1,FALSE)","v":52.762450000000008},{"$f":"VLOOKUP(($B30&\"_\"&V$2&\"_\"&V$3&\"_\"&V$4&\"_\"&$A30),'All Data'!$A$2:$L$1048576,V$1,FALSE)","v":59.183779999999999},{"$f":"VLOOKUP(($B30&\"_\"&W$2&\"_\"&W$3&\"_\"&W$4&\"_\"&$A30),'All Data'!$A$2:$L$1048576,W$1,FALSE)","v":193.4983},{"$f":"VLOOKUP(($B30&\"_\"&X$2&\"_\"&X$3&\"_\"&X$4&\"_\"&$A30),'All Data'!$A$2:$L$1048576,X$1,FALSE)","v":248.70436000000001},{"$f":"VLOOKUP(($B30&\"_\"&Y$2&\"_\"&Y$3&\"_\"&Y$4&\"_\"&$A30),'All Data'!$A$2:$L$1048576,Y$1,FALSE)","v":261.83452},{"$f":"VLOOKUP(($B30&\"_\"&Z$2&\"_\"&Z$3&\"_\"&Z$4&\"_\"&$A30),'All Data'!$A$2:$L$1048576,Z$1,FALSE)","v":353.29257999999999},{"$f":"VLOOKUP(($B30&\"_\"&AA$2&\"_\"&AA$3&\"_\"&AA$4&\"_\"&$A30),'All Data'!$A$2:$L$1048576,AA$1,FALSE)","v":105.40588},{"$f":"VLOOKUP(($B30&\"_\"&AB$2&\"_\"&AB$3&\"_\"&AB$4&\"_\"&$A30),'All Data'!$A$2:$L$1048576,AB$1,FALSE)","v":167.22681},{"$f":"VLOOKUP(($B30&\"_\"&AC$2&\"_\"&AC$3&\"_\"&AC$4&\"_\"&$A30),'All Data'!$A$2:$L$1048576,AC$1,FALSE)","v":18.148580318942045},{"$f":"VLOOKUP(($B30&\"_\"&AD$2&\"_\"&AD$3&\"_\"&AD$4&\"_\"&$A30),'All Data'!$A$2:$L$1048576,AD$1,FALSE)","v":30.477246207701281},{"$f":"VLOOKUP(($B30&\"_\"&AE$2&\"_\"&AE$3&\"_\"&AE$4&\"_\"&$A30),'All Data'!$A$2:$L$1048576,AE$1,FALSE)","v":536.83633999999995},{"$f":"VLOOKUP(($B30&\"_\"&AF$2&\"_\"&AF$3&\"_\"&AF$4&\"_\"&$A30),'All Data'!$A$2:$L$1048576,AF$1,FALSE)","v":700.17668000000003},{"$f":"VLOOKUP(($B30&\"_\"&AG$2&\"_\"&AG$3&\"_\"&AG$4&\"_\"&$A30),'All Data'!$A$2:$L$1048576,AG$1,FALSE)","v":274.07488000000001},{"$f":"VLOOKUP(($B30&\"_\"&AH$2&\"_\"&AH$3&\"_\"&AH$4&\"_\"&$A30),'All Data'!$A$2:$L$1048576,AH$1,FALSE)","v":469.64096000000001},{"$f":"VLOOKUP(($B30&\"_\"&AI$2&\"_\"&AI$3&\"_\"&AI$4&\"_\"&$A30),'All Data'!$A$2:$L$1048576,AI$1,FALSE)","v":681.24068999999997},{"$f":"VLOOKUP(($B30&\"_\"&AJ$2&\"_\"&AJ$3&\"_\"&AJ$4&\"_\"&$A30),'All Data'!$A$2:$L$1048576,AJ$1,FALSE)","v":932.70222000000001},{"$f":"VLOOKUP(($B30&\"_\"&AK$2&\"_\"&AK$3&\"_\"&AK$4&\"_\"&$A30),'All Data'!$A$2:$L$1048576,AK$1,FALSE)","v":79.183204060416742},{"$f":"VLOOKUP(($B30&\"_\"&AL$2&\"_\"&AL$3&\"_\"&AL$4&\"_\"&$A30),'All Data'!$A$2:$L$1048576,AL$1,FALSE)","v":83.451605442183137}]
["HB","Hywel Dda HB",{"$f":"VLOOKUP(($B31&\"_\"&C$2&\"_\"&C$3&\"_\"&C$4&\"_\"&$A31),'All Data'!$A$2:$L$1048576,C$1,FALSE)","v":0},{"$f":"VLOOKUP(($B31&\"_\"&D$2&\"_\"&D$3&\"_\"&D$4&\"_\"&$A31),'All Data'!$A$2:$L$1048576,D$1,FALSE)","v":0},{"$f":"VLOOKUP(($B31&\"_\"&E$2&\"_\"&E$3&\"_\"&E$4&\"_\"&$A31),'All Data'!$A$2:$L$1048576,E$1,FALSE)","v":0},{"$f":"VLOOKUP(($B31&\"_\"&F$2&\"_\"&F$3&\"_\"&F$4&\"_\"&$A31),'All Data'!$A$2:$L$1048576,F$1,FALSE)","v":0},{"$f":"VLOOKUP(($B31&\"_\"&G$2&\"_\"&G$3&\"_\"&G$4&\"_\"&$A31),'All Data'!$A$2:$L$1048576,G$1,FALSE)","v":2.2331889999999999},{"$f":"VLOOKUP(($B31&\"_\"&H$2&\"_\"&H$3&\"_\"&H$4&\"_\"&$A31),'All Data'!$A$2:$L$1048576,H$1,FALSE)","v":11.44197},{"$f":"VLOOKUP(($B31&\"_\"&I$2&\"_\"&I$3&\"_\"&I$4&\"_\"&$A31),'All Data'!$A$2:$L$1048576,I$1,FALSE)","v":1.274608},{"$f":"VLOOKUP(($B31&\"_\"&J$2&\"_\"&J$3&\"_\"&J$4&\"_\"&$A31),'All Data'!$A$2:$L$1048576,J$1,FALSE)","v":6.8313560000000004},{"$f":"VLOOKUP(($B31&\"_\"&K$2&\"_\"&K$3&\"_\"&K$4&\"_\"&$A31),'All Data'!$A$2:$L$1048576,K$1,FALSE)","v":74.187669999999997},{"$f":"VLOOKUP(($B31&\"_\"&L$2&\"_\"&L$3&\"_\"&L$4&\"_\"&$A31),'All Data'!$A$2:$L$1048576,L$1,FALSE)","v":77.315190000000001},{"$f":"VLOOKUP(($B31&\"_\"&M$2&\"_\"&M$3&\"_\"&M$4&\"_\"&$A31),'All Data'!$A$2:$L$1048576,M$1,FALSE)","v":{"$error":"#N/A"}},{"$f":"VLOOKUP(($B31&\"_\"&N$2&\"_\"&N$3&\"_\"&N$4&\"_\"&$A31),'All Data'!$A$2:$L$1048576,N$1,FALSE)","v":{"$error":"#N/A"}},{"$f":"VLOOKUP(($B31&\"_\"&O$2&\"_\"&O$3&\"_\"&O$4&\"_\"&$A31),'All Data'!$A$2:$L$1048576,O$1,FALSE)","v":21.258240000000001},{"$f":"VLOOKUP(($B31&\"_\"&P$2&\"_\"&P$3&\"_\"&P$4&\"_\"&$A31),'All Data'!$A$2:$L$1048576,P$1,FALSE)","v":24.591750000000001},{"$f":"VLOOKUP(($B31&\"_\"&Q$2&\"_\"&Q$3&\"_\"&Q$4&\"_\"&$A31),'All Data'!$A$2:$L$1048576,Q$1,FALSE)","v":2.4213209999999998},{"$f":"VLOOKUP(($B31&\"_\"&R$2&\"_\"&R$3&\"_\"&R$4&\"_\"&$A31),'All Data'!$A$2:$L$1048576,R$1,FALSE)","v":2.5773519999999999},{"$f":"VLOOKUP(($B31&\"_\"&S$2&\"_\"&S$3&\"_\"&S$4&\"_\"&$A31),'All Data'!$A$2:$L$1048576,S$1,FALSE)","v":37.887450000000001},{"$f":"VLOOKUP(($B31&\"_\"&T$2&\"_\"&T$3&\"_\"&T$4&\"_\"&$A31),'All Data'!$A$2:$L$1048576,T$1,FALSE)","v":41.547070000000005},{"$f":"VLOOKUP(($B31&\"_\"&U$2&\"_\"&U$3&\"_\"&U$4&\"_\"&$A31),'All Data'!$A$2:$L$1048576,U$1,FALSE)","v":56.28181},{"$f":"VLOOKUP(($B31&\"_\"&V$2&\"_\"&V$3&\"_\"&V$4&\"_\"&$A31),'All Data'!$A$2:$L$1048576,V$1,FALSE)","v":59.766359999999999},{"$f":"VLOOKUP(($B31&\"_\"&W$2&\"_\"&W$3&\"_\"&W$4&\"_\"&$A31),'All Data'!$A$2:$L$1048576,W$1,FALSE)","v":251.38105999999999},{"$f":"VLOOKUP(($B31&\"_\"&X$2&\"_\"&X$3&\"_\"&X$4&\"_\"&$A31),'All Data'!$A$2:$L$1048576,X$1,FALSE)","v":286.08051999999998},{"$f":"VLOOKUP(($B31&\"_\"&Y$2&\"_\"&Y$3&\"_\"&Y$4&\"_\"&$A31),'All Data'!$A$2:$L$1048576,Y$1,FALSE)","v":315.42232999999999},{"$f":"VLOOKUP(($B31&\"_\"&Z$2&\"_\"&Z$3&\"_\"&Z$4&\"_\"&$A31),'All Data'!$A$2:$L$1048576,Z$1,FALSE)","v":371.67507999999998},{"$f":"VLOOKUP(($B31&\"_\"&AA$2&\"_\"&AA$3&\"_\"&AA$4&\"_\"&$A31),'All Data'!$A$2:$L$1048576,AA$1,FALSE)","v":179.12868},{"$f":"VLOOKUP(($B31&\"_\"&AB$2&\"_\"&AB$3&\"_\"&AB$4&\"_\"&$A31),'All Data'!$A$2:$L$1048576,AB$1,FALSE)","v":221.46433999999999},{"$f":"VLOOKUP(($B31&\"_\"&AC$2&\"_\"&AC$3&\"_\"&AC$4&\"_\"&$A31),'All Data'!$A$2:$L$1048576,AC$1,FALSE)","v":25.89094920915041},{"$f":"VLOOKUP(($B31&\"_\"&AD$2&\"_\"&AD$3&\"_\"&AD$4&\"_\"&$A31),'All Data'!$A$2:$L$1048576,AD$1,FALSE)","v":34.121667629726488},{"$f":"VLOOKUP(($B31&\"_\"&AE$2&\"_\"&AE$3&\"_\"&AE$4&\"_\"&$A31),'All Data'!$A$2:$L$1048576,AE$1,FALSE)","v":562.75545},{"$f":"VLOOKUP(($B31&\"_\"&AF$2&\"_\"&AF$3&\"_\"&AF$4&\"_\"&$A31),'All Data'!$A$2:$L$1048576,AF$1,FALSE)","v":661.79616999999996},{"$f":"VLOOKUP(($B31&\"_\"&AG$2&\"_\"&AG$3&\"_\"&AG$4&\"_\"&$A31),'All Data'!$A$2:$L$1048576,AG$1,FALSE)","v":382.89184},{"$f":"VLOOKUP(($B31&\"_\"&AH$2&\"_\"&AH$3&\"_\"&AH$4&\"_\"&$A31),'All Data'!$A$2:$L$1048576,AH$1,FALSE)","v":517.36027999999999},{"$f":"VLOOKUP(($B31&\"_\"&AI$2&\"_\"&AI$3&\"_\"&AI$4&\"_\"&$A31),'All Data'!$A$2:$L$1048576,AI$1,FALSE)","v":666.97379999999998},{"$f":"VLOOKUP(($B31&\"_\"&AJ$2&\"_\"&AJ$3&\"_\"&AJ$4&\"_\"&$A31),'All Data'!$A$2:$L$1048576,AJ$1,FALSE)","v":813.13553000000002},{"$f":"VLOOKUP(($B31&\"_\"&AK$2&\"_\"&AK$3&\"_\"&AK$4&\"_\"&$A31),'All Data'!$A$2:$L$1048576,AK$1,FALSE)","v":77.07493142993323},{"$f":"VLOOKUP(($B31&\"_\"&AL$2&\"_\"&AL$3&\"_\"&AL$4&\"_\"&$A31),'All Data'!$A$2:$L$1048576,AL$1,FALSE)","v":79.629899951998823}]
["HB","ABM UHB",{"$f":"VLOOKUP(($B32&\"_\"&C$2&\"_\"&C$3&\"_\"&C$4&\"_\"&$A32),'All Data'!$A$2:$L$1048576,C$1,FALSE)","v":0},{"$f":"VLOOKUP(($B32&\"_\"&D$2&\"_\"&D$3&\"_\"&D$4&\"_\"&$A32),'All Data'!$A$2:$L$1048576,D$1,FALSE)","v":0},{"$f":"VLOOKUP(($B32&\"_\"&E$2&\"_\"&E$3&\"_\"&E$4&\"_\"&$A32),'All Data'!$A$2:$L$1048576,E$1,FALSE)","v":0},{"$f":"VLOOKUP(($B32&\"_\"&F$2&\"_\"&F$3&\"_\"&F$4&\"_\"&$A32),'All Data'!$A$2:$L$1048576,F$1,FALSE)","v":0},{"$f":"VLOOKUP(($B32&\"_\"&G$2&\"_\"&G$3&\"_\"&G$4&\"_\"&$A32),'All Data'!$A$2:$L$1048576,G$1,FALSE)","v":8.9340499999999992},{"$f":"VLOOKUP(($B32&\"_\"&H$2&\"_\"&H$3&\"_\"&H$4&\"_\"&$A32),'All Data'!$A$2:$L$1048576,H$1,FALSE)","v":11.817959999999999},{"$f":"VLOOKUP(($B32&\"_\"&I$2&\"_\"&I$3&\"_\"&I$4&\"_\"&$A32),'All Data'!$A$2:$L$1048576,I$1,FALSE)","v":5.7114479999999999},{"$f":"VLOOKUP(($B32&\"_\"&J$2&\"_\"&J$3&\"_\"&J$4&\"_\"&$A32),'All Data'!$A$2:$L$1048576,J$1,FALSE)","v":8.9417469999999994},{"$f":"VLOOKUP(($B32&\"_\"&K$2&\"_\"&K$3&\"_\"&K$4&\"_\"&$A32),'All Data'!$A$2:$L$1048576,K$1,FALSE)","v":72.1541},{"$f":"VLOOKUP(($B32&\"_\"&L$2&\"_\"&L$3&\"_\"&L$4&\"_\"&$A32),'All Data'!$A$2:$L$1048576,L$1,FALSE)","v":75.03022},{"$f":"VLOOKUP(($B32&\"_\"&M$2&\"_\"&M$3&\"_\"&M$4&\"_\"&$A32),'All Data'!$A$2:$L$1048576,M$1,FALSE)","v":{"$error":"#N/A"}},{"$f":"VLOOKUP(($B32&\"_\"&N$2&\"_\"&N$3&\"_\"&N$4&\"_\"&$A32),'All Data'!$A$2:$L$1048576,N$1,FALSE)","v":{"$error":"#N/A"}},{"$f":"VLOOKUP(($B32&\"_\"&O$2&\"_\"&O$3&\"_\"&O$4&\"_\"&$A32),'All Data'!$A$2:$L$1048576,O$1,FALSE)","v":21.461919999999999},{"$f":"VLOOKUP(($B32&\"_\"&P$2&\"_\"&P$3&\"_\"&P$4&\"_\"&$A32),'All Data'!$A$2:$L$1048576,P$1,FALSE)","v":24.382090000000002},{"$f":"VLOOKUP(($B32&\"_\"&Q$2&\"_\"&Q$3&\"_\"&Q$4&\"_\"&$A32),'All Data'!$A$2:$L$1048576,Q$1,FALSE)","v":2.1976689999999999},{"$f":"VLOOKUP(($B32&\"_\"&R$2&\"_\"&R$3&\"_\"&R$4&\"_\"&$A32),'All Data'!$A$2:$L$1048576,R$1,FALSE)","v":2.333755},{"$f":"VLOOKUP(($B32&\"_\"&S$2&\"_\"&S$3&\"_\"&S$4&\"_\"&$A32),'All Data'!$A$2:$L$1048576,S$1,FALSE)","v":32.957830000000001},{"$f":"VLOOKUP(($B32&\"_\"&T$2&\"_\"&T$3&\"_\"&T$4&\"_\"&$A32),'All Data'!$A$2:$L$1048576,T$1,FALSE)","v":36.196559999999998},{"$f":"VLOOKUP(($B32&\"_\"&U$2&\"_\"&U$3&\"_\"&U$4&\"_\"&$A32),'All Data'!$A$2:$L$1048576,U$1,FALSE)","v":56.820700000000002},{"$f":"VLOOKUP(($B32&\"_\"&V$2&\"_\"&V$3&\"_\"&V$4&\"_\"&$A32),'All Data'!$A$2:$L$1048576,V$1,FALSE)","v":60.085589999999996},{"$f":"VLOOKUP(($B32&\"_\"&W$2&\"_\"&W$3&\"_\"&W$4&\"_\"&$A32),'All Data'!$A$2:$L$1048576,W$1,FALSE)","v":303.93767000000003},{"$f":"VLOOKUP(($B32&\"_\"&X$2&\"_\"&X$3&\"_\"&X$4&\"_\"&$A32),'All Data'!$A$2:$L$1048576,X$1,FALSE)","v":335.52395000000001},{"$f":"VLOOKUP(($B32&\"_\"&Y$2&\"_\"&Y$3&\"_\"&Y$4&\"_\"&$A32),'All Data'!$A$2:$L$1048576,Y$1,FALSE)","v":416.61968000000002},{"$f":"VLOOKUP(($B32&\"_\"&Z$2&\"_\"&Z$3&\"_\"&Z$4&\"_\"&$A32),'All Data'!$A$2:$L$1048576,Z$1,FALSE)","v":469.30333999999999},{"$f":"VLOOKUP(($B32&\"_\"&AA$2&\"_\"&AA$3&\"_\"&AA$4&\"_\"&$A32),'All Data'!$A$2:$L$1048576,AA$1,FALSE)","v":184.64718999999999},{"$f":"VLOOKUP(($B32&\"_\"&AB$2&\"_\"&AB$3&\"_\"&AB$4&\"_\"&$A32),'All Data'!$A$2:$L$1048576,AB$1,FALSE)","v":220.60075000000001},{"$f":"VLOOKUP(($B32&\"_\"&AC$2&\"_\"&AC$3&\"_\"&AC$4&\"_\"&$A32),'All Data'!$A$2:$L$1048576,AC$1,FALSE)","v":35.319249460661489},{"$f":"VLOOKUP(($B32&\"_\"&AD$2&\"_\"&AD$3&\"_\"&AD$4&\"_\"&$A32),'All Data'!$A$2:$L$1048576,AD$1,FALSE)","v":43.85901304903701},{"$f":"VLOOKUP(($B32&\"_\"&AE$2&\"_\"&AE$3&\"_\"&AE$4&\"_\"&$A32),'All Data'!$A$2:$L$1048576,AE$1,FALSE)","v":524.96154999999999},{"$f":"VLOOKUP(($B32&\"_\"&AF$2&\"_\"&AF$3&\"_\"&AF$4&\"_\"&$A32),'All Data'!$A$2:$L$1048576,AF$1,FALSE)","v":614.92029000000002},{"$f":"VLOOKUP(($B32&\"_\"&AG$2&\"_\"&AG$3&\"_\"&AG$4&\"_\"&$A32),'All Data'!$A$2:$L$1048576,AG$1,FALSE)","v":318.04360000000003},{"$f":"VLOOKUP(($B32&\"_\"&AH$2&\"_\"&AH$3&\"_\"&AH$4&\"_\"&$A32),'All Data'!$A$2:$L$1048576,AH$1,FALSE)","v":434.76105000000001},{"$f":"VLOOKUP(($B32&\"_\"&AI$2&\"_\"&AI$3&\"_\"&AI$4&\"_\"&$A32),'All Data'!$A$2:$L$1048576,AI$1,FALSE)","v":631.25886000000003},{"$f":"VLOOKUP(($B32&\"_\"&AJ$2&\"_\"&AJ$3&\"_\"&AJ$4&\"_\"&$A32),'All Data'!$A$2:$L$1048576,AJ$1,FALSE)","v":761.57303000000002},{"$f":"VLOOKUP(($B32&\"_\"&AK$2&\"_\"&AK$3&\"_\"&AK$4&\"_\"&$A32),'All Data'!$A$2:$L$1048576,AK$1,FALSE)","v":79.656763702284323},{"$f":"VLOOKUP(($B32&\"_\"&AL$2&\"_\"&AL$3&\"_\"&AL$4&\"_\"&$A32),'All Data'!$A$2:$L$1048576,AL$1,FALSE)","v":81.686265830970711}]
["HB","Cardiff & Vale UHB",{"$f":"VLOOKUP(($B33&\"_\"&C$2&\"_\"&C$3&\"_\"&C$4&\"_\"&$A33),'All Data'!$A$2:$L$1048576,C$1,FALSE)","v":0},{"$f":"VLOOKUP(($B33&\"_\"&D$2&\"_\"&D$3&\"_\"&D$4&\"_\"&$A33),'All Data'!$A$2:$L$1048576,D$1,FALSE)","v":0},{"$f":"VLOOKUP(($B33&\"_\"&E$2&\"_\"&E$3&\"_\"&E$4&\"_\"&$A33),'All Data'!$A$2:$L$1048576,E$1,FALSE)","v":0},{"$f":"VLOOKUP(($B33&\"_\"&F$2&\"_\"&F$3&\"_\"&F$4&\"_\"&$A33),'All Data'!$A$2:$L$1048576,F$1,FALSE)","v":0},{"$f":"VLOOKUP(($B33&\"_\"&G$2&\"_\"&G$3&\"_\"&G$4&\"_\"&$A33),'All Data'!$A$2:$L$1048576,G$1,FALSE)","v":8.5326319999999996},{"$f":"VLOOKUP(($B33&\"_\"&H$2&\"_\"&H$3&\"_\"&H$4&\"_\"&$A33),'All Data'!$A$2:$L$1048576,H$1,FALSE)","v":15.095319999999999},{"$f":"VLOOKUP(($B33&\"_\"&I$2&\"_\"&I$3&\"_\"&I$4&\"_\"&$A33),'All Data'!$A$2:$L$1048576,I$1,FALSE)","v":8.0146320000000006},{"$f":"VLOOKUP(($B33&\"_\"&J$2&\"_\"&J$3&\"_\"&J$4&\"_\"&$A33),'All Data'!$A$2:$L$1048576,J$1,FALSE)","v":11.84717},{"$f":"VLOOKUP(($B33&\"_\"&K$2&\"_\"&K$3&\"_\"&K$4&\"_\"&$A33),'All Data'!$A$2:$L$1048576,K$1,FALSE)","v":72.969629999999995},{"$f":"VLOOKUP(($B33&\"_\"&L$2&\"_\"&L$3&\"_\"&L$4&\"_\"&$A33),'All Data'!$A$2:$L$1048576,L$1,FALSE)","v":76.268290000000007},{"$f":"VLOOKUP(($B33&\"_\"&M$2&\"_\"&M$3&\"_\"&M$4&\"_\"&$A33),'All Data'!$A$2:$L$1048576,M$1,FALSE)","v":{"$error":"#N/A"}},{"$f":"VLOOKUP(($B33&\"_\"&N$2&\"_\"&N$3&\"_\"&N$4&\"_\"&$A33),'All Data'!$A$2:$L$1048576,N$1,FALSE)","v":{"$error":"#N/A"}},{"$f":"VLOOKUP(($B33&\"_\"&O$2&\"_\"&O$3&\"_\"&O$4&\"_\"&$A33),'All Data'!$A$2:$L$1048576,O$1,FALSE)","v":20.704710000000002},{"$f":"VLOOKUP(($B33&\"_\"&P$2&\"_\"&P$3&\"_\"&P$4&\"_\"&$A33),'All Data'!$A$2:$L$1048576,P$1,FALSE)","v":23.962569999999999},{"$f":"VLOOKUP(($B33&\"_\"&Q$2&\"_\"&Q$3&\"_\"&Q$4&\"_\"&$A33),'All Data'!$A$2:$L$1048576,Q$1,FALSE)","v":2.170051},{"$f":"VLOOKUP(($B33&\"_\"&R$2&\"_\"&R$3&\"_\"&R$4&\"_\"&$A33),'All Data'!$A$2:$L$1048576,R$1,FALSE)","v":2.3222040000000002},{"$f":"VLOOKUP(($B33&\"_\"&S$2&\"_\"&S$3&\"_\"&S$4&\"_\"&$A33),'All Data'!$A$2:$L$1048576,S$1,FALSE)","v":34.734140000000004},{"$f":"VLOOKUP(($B33&\"_\"&T$2&\"_\"&T$3&\"_\"&T$4&\"_\"&$A33),'All Data'!$A$2:$L$1048576,T$1,FALSE)","v":38.444409999999998},{"$f":"VLOOKUP(($B33&\"_\"&U$2&\"_\"&U$3&\"_\"&U$4&\"_\"&$A33),'All Data'!$A$2:$L$1048576,U$1,FALSE)","v":52.545459999999999},{"$f":"VLOOKUP(($B33&\"_\"&V$2&\"_\"&V$3&\"_\"&V$4&\"_\"&$A33),'All Data'!$A$2:$L$1048576,V$1,FALSE)","v":56.364349999999995},{"$f":"VLOOKUP(($B33&\"_\"&W$2&\"_\"&W$3&\"_\"&W$4&\"_\"&$A33),'All Data'!$A$2:$L$1048576,W$1,FALSE)","v":298.76713000000001},{"$f":"VLOOKUP(($B33&\"_\"&X$2&\"_\"&X$3&\"_\"&X$4&\"_\"&$A33),'All Data'!$A$2:$L$1048576,X$1,FALSE)","v":331.67358000000002},{"$f":"VLOOKUP(($B33&\"_\"&Y$2&\"_\"&Y$3&\"_\"&Y$4&\"_\"&$A33),'All Data'!$A$2:$L$1048576,Y$1,FALSE)","v":387.45397000000003},{"$f":"VLOOKUP(($B33&\"_\"&Z$2&\"_\"&Z$3&\"_\"&Z$4&\"_\"&$A33),'All Data'!$A$2:$L$1048576,Z$1,FALSE)","v":441.6148},{"$f":"VLOOKUP(($B33&\"_\"&AA$2&\"_\"&AA$3&\"_\"&AA$4&\"_\"&$A33),'All Data'!$A$2:$L$1048576,AA$1,FALSE)","v":203.21733},{"$f":"VLOOKUP(($B33&\"_\"&AB$2&\"_\"&AB$3&\"_\"&AB$4&\"_\"&$A33),'All Data'!$A$2:$L$1048576,AB$1,FALSE)","v":241.98868999999999},{"$f":"VLOOKUP(($B33&\"_\"&AC$2&\"_\"&AC$3&\"_\"&AC$4&\"_\"&$A33),'All Data'!$A$2:$L$1048576,AC$1,FALSE)","v":38.076818318340827},{"$f":"VLOOKUP(($B33&\"_\"&AD$2&\"_\"&AD$3&\"_\"&AD$4&\"_\"&$A33),'All Data'!$A$2:$L$1048576,AD$1,FALSE)","v":47.192201052270192},{"$f":"VLOOKUP(($B33&\"_\"&AE$2&\"_\"&AE$3&\"_\"&AE$4&\"_\"&$A33),'All Data'!$A$2:$L$1048576,AE$1,FALSE)","v":464.10019999999997},{"$f":"VLOOKUP(($B33&\"_\"&AF$2&\"_\"&AF$3&\"_\"&AF$4&\"_\"&$A33),'All Data'!$A$2:$L$1048576,AF$1,FALSE)","v":564.47315000000003},{"$f":"VLOOKUP(($B33&\"_\"&AG$2&\"_\"&AG$3&\"_\"&AG$4&\"_\"&$A33),'All Data'!$A$2:$L$1048576,AG$1,FALSE)","v":295.39591000000001},{"$f":"VLOOKUP(($B33&\"_\"&AH$2&\"_\"&AH$3&\"_\"&AH$4&\"_\"&$A33),'All Data'!$A$2:$L$1048576,AH$1,FALSE)","v":427.43475999999998},{"$f":"VLOOKUP(($B33&\"_\"&AI$2&\"_\"&AI$3&\"_\"&AI$4&\"_\"&$A33),'All Data'!$A$2:$L$1048576,AI$1,FALSE)","v":550.15211999999997},{"$f":"VLOOKUP(($B33&\"_\"&AJ$2&\"_\"&AJ$3&\"_\"&AJ$4&\"_\"&$A33),'All Data'!$A$2:$L$1048576,AJ$1,FALSE)","v":696.86042999999995},{"$f":"VLOOKUP(($B33&\"_\"&AK$2&\"_\"&AK$3&\"_\"&AK$4&\"_\"&$A33),'All Data'!$A$2:$L$1048576,AK$1,FALSE)","v":76.951718511054793},{"$f":"VLOOKUP(($B33&\"_\"&AL$2&\"_\"&AL$3&\"_\"&AL$4&\"_\"&$A33),'All Data'!$A$2:$L$1048576,AL$1,FALSE)","v":79.057852662973133}]
["HB","Cwm Taf HB",{"$f":"VLOOKUP(($B34&\"_\"&C$2&\"_\"&C$3&\"_\"&C$4&\"_\"&$A34),'All Data'!$A$2:$L$1048576,C$1,FALSE)","v":0},{"$f":"VLOOKUP(($B34&\"_\"&D$2&\"_\"&D$3&\"_\"&D$4&\"_\"&$A34),'All Data'!$A$2:$L$1048576,D$1,FALSE)","v":0},{"$f":"VLOOKUP(($B34&\"_\"&E$2&\"_\"&E$3&\"_\"&E$4&\"_\"&$A34),'All Data'!$A$2:$L$1048576,E$1,FALSE)","v":0},{"$f":"VLOOKUP(($B34&\"_\"&F$2&\"_\"&F$3&\"_\"&F$4&\"_\"&$A34),'All Data'!$A$2:$L$1048576,F$1,FALSE)","v":0},{"$f":"VLOOKUP(($B34&\"_\"&G$2&\"_\"&G$3&\"_\"&G$4&\"_\"&$A34),'All Data'!$A$2:$L$1048576,G$1,FALSE)","v":6.9267849999999997},{"$f":"VLOOKUP(($B34&\"_\"&H$2&\"_\"&H$3&\"_\"&H$4&\"_\"&$A34),'All Data'!$A$2:$L$1048576,H$1,FALSE)","v":9.1190549999999995},{"$f":"VLOOKUP(($B34&\"_\"&I$2&\"_\"&I$3&\"_\"&I$4&\"_\"&$A34),'All Data'!$A$2:$L$1048576,I$1,FALSE)","v":4.3392590000000002},{"$f":"VLOOKUP(($B34&\"_\"&J$2&\"_\"&J$3&\"_\"&J$4&\"_\"&$A34),'All Data'!$A$2:$L$1048576,J$1,FALSE)","v":7.7565039999999996},{"$f":"VLOOKUP(($B34&\"_\"&K$2&\"_\"&K$3&\"_\"&K$4&\"_\"&$A34),'All Data'!$A$2:$L$1048576,K$1,FALSE)","v":67.910709999999995},{"$f":"VLOOKUP(($B34&\"_\"&L$2&\"_\"&L$3&\"_\"&L$4&\"_\"&$A34),'All Data'!$A$2:$L$1048576,L$1,FALSE)","v":72.109769999999997},{"$f":"VLOOKUP(($B34&\"_\"&M$2&\"_\"&M$3&\"_\"&M$4&\"_\"&$A34),'All Data'!$A$2:$L$1048576,M$1,FALSE)","v":{"$error":"#N/A"}},{"$f":"VLOOKUP(($B34&\"_\"&N$2&\"_\"&N$3&\"_\"&N$4&\"_\"&$A34),'All Data'!$A$2:$L$1048576,N$1,FALSE)","v":{"$error":"#N/A"}},{"$f":"VLOOKUP(($B34&\"_\"&O$2&\"_\"&O$3&\"_\"&O$4&\"_\"&$A34),'All Data'!$A$2:$L$1048576,O$1,FALSE)","v":24.62538},{"$f":"VLOOKUP(($B34&\"_\"&P$2&\"_\"&P$3&\"_\"&P$4&\"_\"&$A34),'All Data'!$A$2:$L$1048576,P$1,FALSE)","v":28.836040000000001},{"$f":"VLOOKUP(($B34&\"_\"&Q$2&\"_\"&Q$3&\"_\"&Q$4&\"_\"&$A34),'All Data'!$A$2:$L$1048576,Q$1,FALSE)","v":2.0946349999999998},{"$f":"VLOOKUP(($B34&\"_\"&R$2&\"_\"&R$3&\"_\"&R$4&\"_\"&$A34),'All Data'!$A$2:$L$1048576,R$1,FALSE)","v":2.2865600000000001},{"$f":"VLOOKUP(($B34&\"_\"&S$2&\"_\"&S$3&\"_\"&S$4&\"_\"&$A34),'All Data'!$A$2:$L$1048576,S$1,FALSE)","v":28.191090000000003},{"$f":"VLOOKUP(($B34&\"_\"&T$2&\"_\"&T$3&\"_\"&T$4&\"_\"&$A34),'All Data'!$A$2:$L$1048576,T$1,FALSE)","v":32.597619999999999},{"$f":"VLOOKUP(($B34&\"_\"&U$2&\"_\"&U$3&\"_\"&U$4&\"_\"&$A34),'All Data'!$A$2:$L$1048576,U$1,FALSE)","v":59.796059999999997},{"$f":"VLOOKUP(($B34&\"_\"&V$2&\"_\"&V$3&\"_\"&V$4&\"_\"&$A34),'All Data'!$A$2:$L$1048576,V$1,FALSE)","v":63.995420000000003},{"$f":"VLOOKUP(($B34&\"_\"&W$2&\"_\"&W$3&\"_\"&W$4&\"_\"&$A34),'All Data'!$A$2:$L$1048576,W$1,FALSE)","v":330.71086000000003},{"$f":"VLOOKUP(($B34&\"_\"&X$2&\"_\"&X$3&\"_\"&X$4&\"_\"&$A34),'All Data'!$A$2:$L$1048576,X$1,FALSE)","v":374.69896},{"$f":"VLOOKUP(($B34&\"_\"&Y$2&\"_\"&Y$3&\"_\"&Y$4&\"_\"&$A34),'All Data'!$A$2:$L$1048576,Y$1,FALSE)","v":442.72309999999999},{"$f":"VLOOKUP(($B34&\"_\"&Z$2&\"_\"&Z$3&\"_\"&Z$4&\"_\"&$A34),'All Data'!$A$2:$L$1048576,Z$1,FALSE)","v":515.7002},{"$f":"VLOOKUP(($B34&\"_\"&AA$2&\"_\"&AA$3&\"_\"&AA$4&\"_\"&$A34),'All Data'!$A$2:$L$1048576,AA$1,FALSE)","v":207.83734000000001},{"$f":"VLOOKUP(($B34&\"_\"&AB$2&\"_\"&AB$3&\"_\"&AB$4&\"_\"&$A34),'All Data'!$A$2:$L$1048576,AB$1,FALSE)","v":258.73523999999998},{"$f":"VLOOKUP(($B34&\"_\"&AC$2&\"_\"&AC$3&\"_\"&AC$4&\"_\"&$A34),'All Data'!$A$2:$L$1048576,AC$1,FALSE)","v":41.855361781076063},{"$f":"VLOOKUP(($B34&\"_\"&AD$2&\"_\"&AD$3&\"_\"&AD$4&\"_\"&$A34),'All Data'!$A$2:$L$1048576,AD$1,FALSE)","v":53.688606735081187},{"$f":"VLOOKUP(($B34&\"_\"&AE$2&\"_\"&AE$3&\"_\"&AE$4&\"_\"&$A34),'All Data'!$A$2:$L$1048576,AE$1,FALSE)","v":644.73739999999998},{"$f":"VLOOKUP(($B34&\"_\"&AF$2&\"_\"&AF$3&\"_\"&AF$4&\"_\"&$A34),'All Data'!$A$2:$L$1048576,AF$1,FALSE)","v":780.65484000000004},{"$f":"VLOOKUP(($B34&\"_\"&AG$2&\"_\"&AG$3&\"_\"&AG$4&\"_\"&$A34),'All Data'!$A$2:$L$1048576,AG$1,FALSE)","v":371.32715999999999},{"$f":"VLOOKUP(($B34&\"_\"&AH$2&\"_\"&AH$3&\"_\"&AH$4&\"_\"&$A34),'All Data'!$A$2:$L$1048576,AH$1,FALSE)","v":549.80238999999995},{"$f":"VLOOKUP(($B34&\"_\"&AI$2&\"_\"&AI$3&\"_\"&AI$4&\"_\"&$A34),'All Data'!$A$2:$L$1048576,AI$1,FALSE)","v":768.18421000000001},{"$f":"VLOOKUP(($B34&\"_\"&AJ$2&\"_\"&AJ$3&\"_\"&AJ$4&\"_\"&$A34),'All Data'!$A$2:$L$1048576,AJ$1,FALSE)","v":962.30083000000002},{"$f":"VLOOKUP(($B34&\"_\"&AK$2&\"_\"&AK$3&\"_\"&AK$4&\"_\"&$A34),'All Data'!$A$2:$L$1048576,AK$1,FALSE)","v":81.818537233646666},{"$f":"VLOOKUP(($B34&\"_\"&AL$2&\"_\"&AL$3&\"_\"&AL$4&\"_\"&$A34),'All Data'!$A$2:$L$1048576,AL$1,FALSE)","v":84.326706765959827}]
["HB","Aneurin Bevan HB",{"$f":"VLOOKUP(($B35&\"_\"&C$2&\"_\"&C$3&\"_\"&C$4&\"_\"&$A35),'All Data'!$A$2:$L$1048576,C$1,FALSE)","v":0},{"$f":"VLOOKUP(($B35&\"_\"&D$2&\"_\"&D$3&\"_\"&D$4&\"_\"&$A35),'All Data'!$A$2:$L$1048576,D$1,FALSE)","v":0},{"$f":"VLOOKUP(($B35&\"_\"&E$2&\"_\"&E$3&\"_\"&E$4&\"_\"&$A35),'All Data'!$A$2:$L$1048576,E$1,FALSE)","v":0},{"$f":"VLOOKUP(($B35&\"_\"&F$2&\"_\"&F$3&\"_\"&F$4&\"_\"&$A35),'All Data'!$A$2:$L$1048576,F$1,FALSE)","v":0},{"$f":"VLOOKUP(($B35&\"_\"&G$2&\"_\"&G$3&\"_\"&G$4&\"_\"&$A35),'All Data'!$A$2:$L$1048576,G$1,FALSE)","v":7.233314},{"$f":"VLOOKUP(($B35&\"_\"&H$2&\"_\"&H$3&\"_\"&H$4&\"_\"&$A35),'All Data'!$A$2:$L$1048576,H$1,FALSE)","v":10.436109999999999},{"$f":"VLOOKUP(($B35&\"_\"&I$2&\"_\"&I$3&\"_\"&I$4&\"_\"&$A35),'All Data'!$A$2:$L$1048576,I$1,FALSE)","v":5.0629840000000002},{"$f":"VLOOKUP(($B35&\"_\"&J$2&\"_\"&J$3&\"_\"&J$4&\"_\"&$A35),'All Data'!$A$2:$L$1048576,J$1,FALSE)","v":9.8583459999999992},{"$f":"VLOOKUP(($B35&\"_\"&K$2&\"_\"&K$3&\"_\"&K$4&\"_\"&$A35),'All Data'!$A$2:$L$1048576,K$1,FALSE)","v":70.18710999999999},{"$f":"VLOOKUP(($B35&\"_\"&L$2&\"_\"&L$3&\"_\"&L$4&\"_\"&$A35),'All Data'!$A$2:$L$1048576,L$1,FALSE)","v":72.716219999999993},{"$f":"VLOOKUP(($B35&\"_\"&M$2&\"_\"&M$3&\"_\"&M$4&\"_\"&$A35),'All Data'!$A$2:$L$1048576,M$1,FALSE)","v":{"$error":"#N/A"}},{"$f":"VLOOKUP(($B35&\"_\"&N$2&\"_\"&N$3&\"_\"&N$4&\"_\"&$A35),'All Data'!$A$2:$L$1048576,N$1,FALSE)","v":{"$error":"#N/A"}},{"$f":"VLOOKUP(($B35&\"_\"&O$2&\"_\"&O$3&\"_\"&O$4&\"_\"&$A35),'All Data'!$A$2:$L$1048576,O$1,FALSE)","v":22.654109999999999},{"$f":"VLOOKUP(($B35&\"_\"&P$2&\"_\"&P$3&\"_\"&P$4&\"_\"&$A35),'All Data'!$A$2:$L$1048576,P$1,FALSE)","v":25.240349999999999},{"$f":"VLOOKUP(($B35&\"_\"&Q$2&\"_\"&Q$3&\"_\"&Q$4&\"_\"&$A35),'All Data'!$A$2:$L$1048576,Q$1,FALSE)","v":2.2369910000000002},{"$f":"VLOOKUP(($B35&\"_\"&R$2&\"_\"&R$3&\"_\"&R$4&\"_\"&$A35),'All Data'!$A$2:$L$1048576,R$1,FALSE)","v":2.354314},{"$f":"VLOOKUP(($B35&\"_\"&S$2&\"_\"&S$3&\"_\"&S$4&\"_\"&$A35),'All Data'!$A$2:$L$1048576,S$1,FALSE)","v":30.342269999999999},{"$f":"VLOOKUP(($B35&\"_\"&T$2&\"_\"&T$3&\"_\"&T$4&\"_\"&$A35),'All Data'!$A$2:$L$1048576,T$1,FALSE)","v":33.041840000000001},{"$f":"VLOOKUP(($B35&\"_\"&U$2&\"_\"&U$3&\"_\"&U$4&\"_\"&$A35),'All Data'!$A$2:$L$1048576,U$1,FALSE)","v":57.713930000000005},{"$f":"VLOOKUP(($B35&\"_\"&V$2&\"_\"&V$3&\"_\"&V$4&\"_\"&$A35),'All Data'!$A$2:$L$1048576,V$1,FALSE)","v":60.497019999999999},{"$f":"VLOOKUP(($B35&\"_\"&W$2&\"_\"&W$3&\"_\"&W$4&\"_\"&$A35),'All Data'!$A$2:$L$1048576,W$1,FALSE)","v":349.62097999999997},{"$f":"VLOOKUP(($B35&\"_\"&X$2&\"_\"&X$3&\"_\"&X$4&\"_\"&$A35),'All Data'!$A$2:$L$1048576,X$1,FALSE)","v":381.89044999999999},{"$f":"VLOOKUP(($B35&\"_\"&Y$2&\"_\"&Y$3&\"_\"&Y$4&\"_\"&$A35),'All Data'!$A$2:$L$1048576,Y$1,FALSE)","v":456.38062000000002},{"$f":"VLOOKUP(($B35&\"_\"&Z$2&\"_\"&Z$3&\"_\"&Z$4&\"_\"&$A35),'All Data'!$A$2:$L$1048576,Z$1,FALSE)","v":509.15724999999998},{"$f":"VLOOKUP(($B35&\"_\"&AA$2&\"_\"&AA$3&\"_\"&AA$4&\"_\"&$A35),'All Data'!$A$2:$L$1048576,AA$1,FALSE)","v":235.94047},{"$f":"VLOOKUP(($B35&\"_\"&AB$2&\"_\"&AB$3&\"_\"&AB$4&\"_\"&$A35),'All Data'!$A$2:$L$1048576,AB$1,FALSE)","v":274.09872999999999},{"$f":"VLOOKUP(($B35&\"_\"&AC$2&\"_\"&AC$3&\"_\"&AC$4&\"_\"&$A35),'All Data'!$A$2:$L$1048576,AC$1,FALSE)","v":33.32827945564334},{"$f":"VLOOKUP(($B35&\"_\"&AD$2&\"_\"&AD$3&\"_\"&AD$4&\"_\"&$A35),'All Data'!$A$2:$L$1048576,AD$1,FALSE)","v":40.528025972000279},{"$f":"VLOOKUP(($B35&\"_\"&AE$2&\"_\"&AE$3&\"_\"&AE$4&\"_\"&$A35),'All Data'!$A$2:$L$1048576,AE$1,FALSE)","v":703.21073999999999},{"$f":"VLOOKUP(($B35&\"_\"&AF$2&\"_\"&AF$3&\"_\"&AF$4&\"_\"&$A35),'All Data'!$A$2:$L$1048576,AF$1,FALSE)","v":800.08817999999997},{"$f":"VLOOKUP(($B35&\"_\"&AG$2&\"_\"&AG$3&\"_\"&AG$4&\"_\"&$A35),'All Data'!$A$2:$L$1048576,AG$1,FALSE)","v":435.47719999999998},{"$f":"VLOOKUP(($B35&\"_\"&AH$2&\"_\"&AH$3&\"_\"&AH$4&\"_\"&$A35),'All Data'!$A$2:$L$1048576,AH$1,FALSE)","v":563.84666000000004},{"$f":"VLOOKUP(($B35&\"_\"&AI$2&\"_\"&AI$3&\"_\"&AI$4&\"_\"&$A35),'All Data'!$A$2:$L$1048576,AI$1,FALSE)","v":839.4914},{"$f":"VLOOKUP(($B35&\"_\"&AJ$2&\"_\"&AJ$3&\"_\"&AJ$4&\"_\"&$A35),'All Data'!$A$2:$L$1048576,AJ$1,FALSE)","v":977.56627000000003},{"$f":"VLOOKUP(($B35&\"_\"&AK$2&\"_\"&AK$3&\"_\"&AK$4&\"_\"&$A35),'All Data'!$A$2:$L$1048576,AK$1,FALSE)","v":79.93677058434659},{"$f":"VLOOKUP(($B35&\"_\"&AL$2&\"_\"&AL$3&\"_\"&AL$4&\"_\"&$A35),'All Data'!$A$2:$L$1048576,AL$1,FALSE)","v":81.826311224184664}]
["WALES","WALES",{"$f":"VLOOKUP(($B36&\"_\"&C$2&\"_\"&C$3&\"_\"&C$4&\"_\"&$A36),'All Data'!$A$2:$L$1048576,8,FALSE)","v":18.937380000000001},{"$f":"VLOOKUP(($B36&\"_\"&D$2&\"_\"&D$3&\"_\"&D$4&\"_\"&$A36),'All Data'!$A$2:$L$1048576,8,FALSE)","v":18.937380000000001},{"$f":"VLOOKUP(($B36&\"_\"&E$2&\"_\"&E$3&\"_\"&E$4&\"_\"&$A36),'All Data'!$A$2:$L$1048576,8,FALSE)","v":17.792860000000001},{"$f":"VLOOKUP(($B36&\"_\"&F$2&\"_\"&F$3&\"_\"&F$4&\"_\"&$A36),'All Data'!$A$2:$L$1048576,8,FALSE)","v":17.792860000000001},{"$f":"VLOOKUP(($B36&\"_\"&G$2&\"_\"&G$3&\"_\"&G$4&\"_\"&$A36),'All Data'!$A$2:$L$1048576,8,FALSE)","v":9.2429989999999993},{"$f":"VLOOKUP(($B36&\"_\"&H$2&\"_\"&H$3&\"_\"&H$4&\"_\"&$A36),'All Data'!$A$2:$L$1048576,8,FALSE)","v":9.2429989999999993},{"$f":"VLOOKUP(($B36&\"_\"&I$2&\"_\"&I$3&\"_\"&I$4&\"_\"&$A36),'All Data'!$A$2:$L$1048576,8,FALSE)","v":7.0557189999999999},{"$f":"VLOOKUP(($B36&\"_\"&J$2&\"_\"&J$3&\"_\"&J$4&\"_\"&$A36),'All Data'!$A$2:$L$1048576,8,FALSE)","v":7.0557189999999999},{"$f":"VLOOKUP(($B36&\"_\"&K$2&\"_\"&K$3&\"_\"&K$4&\"_\"&$A36),'All Data'!$A$2:$L$1048576,8,FALSE)","v":74.51558},{"$f":"VLOOKUP(($B36&\"_\"&L$2&\"_\"&L$3&\"_\"&L$4&\"_\"&$A36),'All Data'!$A$2:$L$1048576,8,FALSE)","v":74.51558},{"$f":"VLOOKUP(($B36&\"_\"&M$2&\"_\"&M$3&\"_\"&M$4&\"_\"&$A36),'All Data'!$A$2:$L$1048576,8,FALSE)","v":{"$error":"#N/A"}},{"$f":"VLOOKUP(($B36&\"_\"&N$2&\"_\"&N$3&\"_\"&N$4&\"_\"&$A36),'All Data'!$A$2:$L$1048576,8,FALSE)","v":{"$error":"#N/A"}},{"$f":"VLOOKUP(($B36&\"_\"&O$2&\"_\"&O$3&\"_\"&O$4&\"_\"&$A36),'All Data'!$A$2:$L$1048576,8,FALSE)","v":23.514886860251185},{"$f":"VLOOKUP(($B36&\"_\"&P$2&\"_\"&P$3&\"_\"&P$4&\"_\"&$A36),'All Data'!$A$2:$L$1048576,8,FALSE)","v":23.514886860251185},{"$f":"VLOOKUP(($B36&\"_\"&Q$2&\"_\"&Q$3&\"_\"&Q$4&\"_\"&$A36),'All Data'!$A$2:$L$1048576,8,FALSE)","v":2.3616713684915513},{"$f":"VLOOKUP(($B36&\"_\"&R$2&\"_\"&R$3&\"_\"&R$4&\"_\"&$A36),'All Data'!$A$2:$L$1048576,8,FALSE)","v":2.3616713684915513},{"$f":"VLOOKUP(($B36&\"_\"&S$2&\"_\"&S$3&\"_\"&S$4&\"_\"&$A36),'All Data'!$A$2:$L$1048576,8,FALSE)","v":35.016292550863419},{"$f":"VLOOKUP(($B36&\"_\"&T$2&\"_\"&T$3&\"_\"&T$4&\"_\"&$A36),'All Data'!$A$2:$L$1048576,8,FALSE)","v":35.016292550863419},{"$f":"VLOOKUP(($B36&\"_\"&U$2&\"_\"&U$3&\"_\"&U$4&\"_\"&$A36),'All Data'!$A$2:$L$1048576,8,FALSE)","v":57.280596629438094},{"$f":"VLOOKUP(($B36&\"_\"&V$2&\"_\"&V$3&\"_\"&V$4&\"_\"&$A36),'All Data'!$A$2:$L$1048576,8,FALSE)","v":57.280596629438094},{"$f":"VLOOKUP(($B36&\"_\"&W$2&\"_\"&W$3&\"_\"&W$4&\"_\"&$A36),'All Data'!$A$2:$L$1048576,8,FALSE)","v":328.43511999999998},{"$f":"VLOOKUP(($B36&\"_\"&X$2&\"_\"&X$3&\"_\"&X$4&\"_\"&$A36),'All Data'!$A$2:$L$1048576,8,FALSE)","v":328.43511999999998},{"$f":"VLOOKUP(($B36&\"_\"&Y$2&\"_\"&Y$3&\"_\"&Y$4&\"_\"&$A36),'All Data'!$A$2:$L$1048576,8,FALSE)","v":431.66547000000003},{"$f":"VLOOKUP(($B36&\"_\"&Z$2&\"_\"&Z$3&\"_\"&Z$4&\"_\"&$A36),'All Data'!$A$2:$L$1048576,8,FALSE)","v":431.66547000000003},{"$f":"VLOOKUP(($B36&\"_\"&AA$2&\"_\"&AA$3&\"_\"&AA$4&\"_\"&$A36),'All Data'!$A$2:$L$1048576,8,FALSE)","v":230.16815},{"$f":"VLOOKUP(($B36&\"_\"&AB$2&\"_\"&AB$3&\"_\"&AB$4&\"_\"&$A36),'All Data'!$A$2:$L$1048576,8,FALSE)","v":230.16815},{"$f":"VLOOKUP(($B36&\"_\"&AC$2&\"_\"&AC$3&\"_\"&AC$4&\"_\"&$A36),'All Data'!$A$2:$L$1048576,8,FALSE)","v":37.702690461092487},{"$f":"VLOOKUP(($B36&\"_\"&AD$2&\"_\"&AD$3&\"_\"&AD$4&\"_\"&$A36),'All Data'!$A$2:$L$1048576,8,FALSE)","v":37.702690461092487},{"$f":"VLOOKUP(($B36&\"_\"&AE$2&\"_\"&AE$3&\"_\"&AE$4&\"_\"&$A36),'All Data'!$A$2:$L$1048576,8,FALSE)","v":636.40340000000003},{"$f":"VLOOKUP(($B36&\"_\"&AF$2&\"_\"&AF$3&\"_\"&AF$4&\"_\"&$A36),'All Data'!$A$2:$L$1048576,8,FALSE)","v":636.40340000000003},{"$f":"VLOOKUP(($B36&\"_\"&AG$2&\"_\"&AG$3&\"_\"&AG$4&\"_\"&$A36),'All Data'!$A$2:$L$1048576,8,FALSE)","v":424.90069999999997},{"$f":"VLOOKUP(($B36&\"_\"&AH$2&\"_\"&AH$3&\"_\"&AH$4&\"_\"&$A36),'All Data'!$A$2:$L$1048576,8,FALSE)","v":424.90069999999997},{"$f":"VLOOKUP(($B36&\"_\"&AI$2&\"_\"&AI$3&\"_\"&AI$4&\"_\"&$A36),'All Data'!$A$2:$L$1048576,8,FALSE)","v":777.34780000000001},{"$f":"VLOOKUP(($B36&\"_\"&AJ$2&\"_\"&AJ$3&\"_\"&AJ$4&\"_\"&$A36),'All Data'!$A$2:$L$1048576,8,FALSE)","v":777.34780000000001},{"$f":"VLOOKUP(($B36&\"_\"&AK$2&\"_\"&AK$3&\"_\"&AK$4&\"_\"&$A36),'All Data'!$A$2:$L$1048576,8,FALSE)","v":80.842395202708516},{"$f":"VLOOKUP(($B36&\"_\"&AL$2&\"_\"&AL$3&\"_\"&AL$4&\"_\"&$A36),'All Data'!$A$2:$L$1048576,8,FALSE)","v":80.842395202708516}]

{"sheet":"All Data","index":7,"n_rows":511,"n_cols":12,"rows_kept":511,"cut":false,"hidden":true,"merged":[]}
["lookup","Short name","Year","Sex","AreaName","Type","Annual average","EASR","95% LCL","95% UCL","error +","error -"]
[{"$f":"TRIM(E2)&\"_\"&B2&\"_\"&D2&\"_\"&C2&\"_\"&F2","v":"Blaenau Gwent_Smo_Persons_2009-2010_LA"},"Smo","2009-2010","Persons","Blaenau Gwent","LA",{"$f":"\" \"","v":" "},27.653882963345282,24.712419999999998,30.59535,2.9414670366547178,2.941462963345284]
[{"$f":"TRIM(E3)&\"_\"&B3&\"_\"&D3&\"_\"&C3&\"_\"&F3","v":"Rhondda Cynon Taf_Smo_Persons_2009-2010_LA"},"Smo","2009-2010","Persons","Rhondda Cynon Taf","LA",{"$f":"\" \"","v":" "},26.834278615030797,24.324860000000001,29.343700000000002,2.5094213849692046,2.5094186150307962]
["Merthyr Tydfil_Smo_Persons_2009-2010_LA","Smo","2009-2010","Persons","Merthyr Tydfil","LA"," ",26.26629676734699,23.340600000000002,29.191990000000001,2.9256932326530105,2.925696767346988]
["Wrexham_Smo_Persons_2009-2010_LA","Smo","2009-2010","Persons","Wrexham","LA"," ",26.159974646678211,23.267699999999998,29.052240000000001,2.8922653533217897,2.8922746466782137]
["Neath Port Talbot_Smo_Persons_2009-2010_LA","Smo","2009-2010","Persons","Neath Port Talbot","LA"," ",25.941954998516572,23.169039999999999,28.714869999999998,2.7729150014834261,2.7729149985165726]
["Torfaen_Smo_Persons_2009-2010_LA","Smo","2009-2010","Persons","Torfaen","LA"," ",25.553244565993875,22.64048,28.466010000000004,2.9127654340061291,2.912764565993875]
["Newport_Smo_Persons_2009-2010_LA","Smo","2009-2010","Persons","Newport","LA"," ",24.710212443068098,21.837029999999999,27.583400000000001,2.873187556931903,2.8731824430680994]
["Gwynedd_Smo_Persons_2009-2010_LA","Smo","2009-2010","Persons","Gwynedd","LA"," ",24.116288329025675,21.190719999999999,27.04186,2.9255716709743247,2.9255683290256762]
["Isle of Anglesey_Smo_Persons_2009-2010_LA","Smo","2009-2010","Persons","Isle of Anglesey","LA"," ",23.887846218788951,21.015519999999999,26.760169999999999,2.8723237812110476,2.8723262187889524]
["Caerphilly_Smo_Persons_2009-2010_LA","Smo","2009-2010","Persons","Caerphilly","LA"," ",23.840137336435124,21.26661,26.41367,2.5735326635648761,2.5735273364351237]
["Denbighshire_Smo_Persons_2009-2010_LA","Smo","2009-2010","Persons","Denbighshire","LA"," ",23.047920134699481,20.35108,25.744759999999999,2.6968398653005181,2.6968401346994817]
["Cardiff_Smo_Persons_2009-2010_LA","Smo","2009-2010","Persons","Cardiff","LA"," ",22.933263799472908,20.939230000000002,24.927299999999999,1.9940362005270913,1.9940337994729056]
["Ceredigion_Smo_Persons_2009-2010_LA","Smo","2009-2010","Persons","Ceredigion","LA"," ",22.883570709217395,19.99239,25.774760000000001,2.8911892907826058,2.8911807092173945]
["Pembrokeshire_Smo_Persons_2009-2010_LA","Smo","2009-2010","Persons","Pembrokeshire","LA"," ",22.825987566157369,19.97523,25.676739999999999,2.8507524338426293,2.8507575661573696]
["Carmarthenshire_Smo_Persons_2009-2010_LA","Smo","2009-2010","Persons","Carmarthenshire","LA"," ",22.805451214278975,20.140689999999999,25.470209999999998,2.6647587857210233,2.6647612142789754]
["Powys_Smo_Persons_2009-2010_LA","Smo","2009-2010","Persons","Powys","LA"," ",22.752301405820688,19.8109,25.693700000000003,2.941398594179315,2.9414014058206881]
["Conwy_Smo_Persons_2009-2010_LA","Smo","2009-2010","Persons","Conwy","LA"," ",22.14657576926319,19.44904,24.844110000000001,2.6975342307368102,2.6975357692631903]
["Swansea_Smo_Persons_2009-2010_LA","Smo","2009-2010","Persons","Swansea","LA"," ",21.962349406675376,19.714979999999997,24.209720000000001,2.2473705933246251,2.2473694066753787]
["Bridgend_Smo_Persons_2009-2010_LA","Smo","2009-2010","Persons","Bridgend","LA"," ",21.733878179746046,19.098010000000002,24.36975,2.6358718202539535,2.6358681797460441]
["Flintshire_Smo_Persons_2009-2010_LA","Smo","2009-2010","Persons","Flintshire","LA"," ",21.480608707914048,18.910820000000001,24.0504,2.5697912920859523,2.5697887079140465]
["The Vale of Glamorgan_Smo_Persons_2009-2010_LA","Smo","2009-2010","Persons","The Vale of Glamorgan","LA"," ",21.055351141014519,18.210930000000001,23.89978,2.8444288589854807,2.8444211410145179]
["Monmouthshire_Smo_Persons_2009-2010_LA","Smo","2009-2010","Persons","Monmouthshire","LA"," ",18.623433219316293,15.899319999999999,21.347550000000002,2.7241167806837083,2.724113219316294]
["Cwm Taf HB_Smo_Persons_2009-2010_HB","Smo","2009-2010","Persons","Cwm Taf HB","HB"," ",26.730712024453695,24.62538,28.836040000000001,2.1053279755463059,2.1053320244536948]
["Aneurin Bevan HB_Smo_Persons_2009-2010_HB","Smo","2009-2010","Persons","Aneurin Bevan HB","HB"," ",23.947229775948692,22.654109999999999,25.240349999999999,1.2931202240513073,1.2931197759486928]
["Betsi Cadwaladr UHB_Smo_Persons_2009-2010_HB","Smo","2009-2010","Persons","Betsi Cadwaladr UHB","HB"," ",23.37625687165438,22.21743,24.535080000000001,1.1588231283456203,1.1588268716543801]
["Hywel Dda HB_Smo_Persons_2009-2010_HB","Smo","2009-2010","Persons","Hywel Dda HB","HB"," ",22.924998108411174,21.258240000000001,24.591750000000001,1.6667518915888273,1.6667581084111731]
["ABM UHB_Smo_Persons_2009-2010_HB","Smo","2009-2010","Persons","ABM UHB","HB"," ",22.922003786888677,21.461919999999999,24.382090000000002,1.4600862131113246,1.4600837868886778]
["Powys THB_Smo_Persons_2009-2010_HB","Smo","2009-2010","Persons","Powys THB","HB"," ",22.752301405820685,19.8109,25.693700000000003,2.9413985941793186,2.9414014058206845]
["Cardiff & Vale UHB_Smo_Persons_2009-2010_HB","Smo","2009-2010","Persons","Cardiff & Vale UHB","HB"," ",22.333643935056976,20.704710000000002,23.962569999999999,1.6289260649430233,1.628933935056974]
["Wales_Smo_Persons_2009-2010_WALES","Smo","2009-2010","Persons","Wales","WALES"," ",23.514886860251185,22.921150000000001,24.108619999999998,0.5937331397488137,0.59373686025118388]
["Isle of Anglesey_ACT_Persons_2009-2010_LA","ACT","2009-2010","Persons","Isle of Anglesey","LA"," ",2.5100356293876294,2.3789169999999999,2.6411539999999998,0.13111837061237042,0.13111862938762942]
["Gwynedd_ACT_Persons_2009-2010_LA","ACT","2009-2010","Persons","Gwynedd","LA"," ",2.5006581836896564,2.3645700000000001,2.636746,0.13608781631034361,0.13608818368965636]
["Conwy_ACT_Persons_2009-2010_LA","ACT","2009-2010","Persons","Conwy","LA"," ",2.5626001241292231,2.43085,2.69435,0.13174987587077691,0.13175012412922316]
["Denbighshire_ACT_Persons_2009-2010_LA","ACT","2009-2010","Persons","Denbighshire","LA"," ",2.508173772744934,2.3791579999999999,2.6371899999999999,0.1290162272550659,0.12901577274493414]
["Flintshire_ACT_Persons_2009-2010_LA","ACT","2009-2010","Persons","Flintshire","LA"," ",2.4696432265063626,2.3481489999999998,2.5911369999999998,0.12149377349363721,0.12149422650636277]
["Wrexham_ACT_Persons_2009-2010_LA","ACT","2009-2010","Persons","Wrexham","LA"," ",2.3664298997357038,2.2382460000000002,2.4946139999999999,0.12818410026429605,0.12818389973570365]
["Powys_ACT_Persons_2009-2010_LA","ACT","2009-2010","Persons","Powys","LA"," ",2.7589018098519684,2.6259760000000001,2.8918270000000001,0.13292519014803172,0.13292580985196834]
["Ceredigion_ACT_Persons_2009-2010_LA","ACT","2009-2010","Persons","Ceredigion","LA"," ",2.6745058600585034,2.5431650000000001,2.805847,0.13134113994149654,0.13134086005850332]
["Pembrokeshire_ACT_Persons_2009-2010_LA","ACT","2009-2010","Persons","Pembrokeshire","LA"," ",2.612246653098516,2.4700790000000001,2.7544149999999998,0.14216834690148383,0.14216765309851587]
["Carmarthenshire_ACT_Persons_2009-2010_LA","ACT","2009-2010","Persons","Carmarthenshire","LA"," ",2.3607693002090158,2.2373270000000001,2.4842110000000002,0.1234416997909844,0.1234423002090157]
["Swansea_ACT_Persons_2009-2010_LA","ACT","2009-2010","Persons","Swansea","LA"," ",2.3252405127361238,2.2200120000000001,2.430469,0.10522848726387624,0.10522851273612366]
["Neath Port Talbot_ACT_Persons_2009-2010_LA","ACT","2009-2010","Persons","Neath Port Talbot","LA"," ",2.1304238468507921,2.0103930000000001,2.2504550000000001,0.12003115314920798,0.12003084685079202]
["Bridgend_ACT_Persons_2009-2010_LA","ACT","2009-2010","Persons","Bridgend","LA"," ",2.3097411437163857,2.1800259999999998,2.4394559999999998,0.12971485628361412,0.12971514371638593]
["The Vale of Glamorgan_ACT_Persons_2009-2010_LA","ACT","2009-2010","Persons","The Vale of Glamorgan","LA"," ",2.4284866979304489,2.2985250000000002,2.558449,0.12996230206955106,0.12996169793044876]
["Cardiff_ACT_Persons_2009-2010_LA","ACT","2009-2010","Persons","Cardiff","LA"," ",2.1683167892348227,2.0746920000000002,2.2619410000000002,9.3624210765177462E-2,9.3624789234822536E-2]
["Rhondda Cynon Taf_ACT_Persons_2009-2010_LA","ACT","2009-2010","Persons","Rhondda Cynon Taf","LA"," ",2.1949819989472266,2.0808469999999999,2.3091170000000001,0.11413500105277352,0.11413499894722667]
["Merthyr Tydfil_ACT_Persons_2009-2010_LA","ACT","2009-2010","Persons","Merthyr Tydfil","LA"," ",2.1760763495731079,2.0406010000000001,2.3115519999999998,0.13547565042689191,0.13547534957310781]
["Caerphilly_ACT_Persons_2009-2010_LA","ACT","2009-2010","Persons","Caerphilly","LA"," ",2.1986221583122125,2.0753460000000001,2.321898,0.12327584168778749,0.12327615831221239]
["Blaenau Gwent_ACT_Persons_2009-2010_LA","ACT","2009-2010","Persons","Blaenau Gwent","LA"," ",2.1992657710392383,2.0699969999999999,2.328535,0.12926922896076176,0.12926877103923839]
["Torfaen_ACT_Persons_2009-2010_LA","ACT","2009-2010","Persons","Torfaen","LA"," ",2.2478397060678055,2.115748,2.379931,0.13209129393219454,0.13209170606780551]
["Monmouthshire_ACT_Persons_2009-2010_LA","ACT","2009-2010","Persons","Monmouthshire","LA"," ",2.6820197783465134,2.549871,2.814168,0.13214822165348661,0.1321487783465134]
["Newport_ACT_Persons_2009-2010_LA","ACT","2009-2010","Persons","Newport","LA"," ",2.243658238230668,2.1234670000000002,2.3638499999999998,0.12019176176933177,0.1201912382306678]
["Betsi Cadwaladr UHB_ACT_Persons_2009-2010_HB","ACT","2009-2010","Persons","Betsi Cadwaladr UHB","HB"," ",2.480558715434964,2.4267349999999999,2.5343819999999999,5.3823284565035934E-2,5.3823715434964114E-2]
["Hywel Dda HB_ACT_Persons_2009-2010_HB","ACT","2009-2010","Persons","Hywel Dda HB","HB"," ",2.4993368056891017,2.4213209999999998,2.5773519999999999,7.8015194310898206E-2,7.8015805689101825E-2]
["Powys THB_ACT_Persons_2009-2010_HB","ACT","2009-2010","Persons","Powys THB","HB"," ",2.7589018098519684,2.6259760000000001,2.8918270000000001,0.13292519014803172,0.13292580985196834]
["ABM UHB_ACT_Persons_2009-2010_HB","ACT","2009-2010","Persons","ABM UHB","HB"," ",2.2657118515624624,2.1976689999999999,2.333755,6.8043148437537671E-2,6.8042851562462481E-2]
["Cwm Taf HB_ACT_Persons_2009-2010_HB","ACT","2009-2010","Persons","Cwm Taf HB","HB"," ",2.1905973231834106,2.0946349999999998,2.2865600000000001,9.5962676816589543E-2,9.5962323183410803E-2]
["Cardiff & Vale UHB_ACT_Persons_2009-2010_HB","ACT","2009-2010","Persons","Cardiff & Vale UHB","HB"," ",2.2461274938552633,2.170051,2.3222040000000002,7.6076506144736822E-2,7.6076493855263383E-2]
["Aneurin Bevan HB_ACT_Persons_2009-2010_HB","ACT","2009-2010","Persons","Aneurin Bevan HB","HB"," ",2.2956527804222526,2.2369910000000002,2.354314,5.8661219577747392E-2,5.8661780422252452E-2]
["Wales_ACT_Persons_2009-2010_Wales","ACT","2009-2010","Persons","Wales","Wales"," ",2.3616713684915513,2.3338220000000001,2.3889680000000002,2.7296631508448854E-2,2.7849368491551285E-2]
["Bridgend_Vacc_Children at age 4_2011-2012 (FY)_LA","Vacc","2011-2012 (FY)","Children at age 4","Bridgend","LA"," ",80.949326491340599,78.924789625456356,82.821711107567424,1.8723846162268245,2.0245368658842438]
["Neath Port Talbot_Vacc_Children at age 4_2011-2012 (FY)_LA","Vacc","2011-2012 (FY)","Children at age 4","Neath Port Talbot","LA"," ",81.50551589876703,79.489481665165357,83.364858870459784,1.8593429716927545,2.0160342336016726]
["Swansea_Vacc_Children at age 4_2011-2012 (FY)_LA","Vacc","2011-2012 (FY)","Children at age 4","Swansea","LA"," ",80.081150866838797,78.5355975550099,81.541572324809209,1.460421457970412,1.5455533118288969]
["ABM UHB_Vacc_Children at age 4_2011-2012 (FY)_HB","Vacc","2011-2012 (FY)","Children at age 4","ABM UHB","HB"," ",80.691791430046464,79.656763702284323,81.686265830970711,0.99447440092424699,1.0350277277621416]
["Blaenau Gwent_Vacc_Children at age 4_2011-2012 (FY)_LA","Vacc","2011-2012 (FY)","Children at age 4","Blaenau Gwent","LA"," ",83.94736842105263,81.16770282360369,86.385570001547492,2.4382015804948622,2.7796655974489397]
[{"$f":"TRIM(E67)&\"_\"&B67&\"_\"&D67&\"_\"&C67&\"_\"&F67","v":"Caerphilly_Vacc_Children at age 4_2011-2012 (FY)_LA"},"Vacc","2011-2012 (FY)","Children at age 4","Caerphilly","LA",{"$f":"\" \"","v":" "},81.804878048780481,80.075776817749357,83.415000659929532,1.6101226111490519,1.7291012310311231]
["Monmouthshire_Vacc_Children at age 4_2011-2012 (FY)_LA","Vacc","2011-2012 (FY)","Children at age 4","Monmouthshire","LA"," ",83.179723502304142,80.546303794244324,85.520743247328369,2.3410197450242265,2.6334197080598187]
["Newport_Vacc_Children at age 4_2011-2012 (FY)_LA","Vacc","2011-2012 (FY)","Children at age 4","Newport","LA"," ",76.535433070866148,74.580163584196271,78.383895874692314,1.8484628038261661,1.9552694866698772]
["Torfaen_Vacc_Children at age 4_2011-2012 (FY)_LA","Vacc","2011-2012 (FY)","Children at age 4","Torfaen","LA"," ",82.926829268292678,80.550734122462316,85.066456310214818,2.1396270419221395,2.3760951458303623]
["Aneurin Bevan HB_Vacc_Children at age 4_2011-2012 (FY)_HB","Vacc","2011-2012 (FY)","Children at age 4","Aneurin Bevan HB","HB"," ",80.899383365919689,79.93677058434659,81.826311224184664,0.9269278582649747,0.9626127815730996]
["Isle of Anglesey_Vacc_Children at age 4_2011-2012 (FY)_LA","Vacc","2011-2012 (FY)","Children at age 4","Isle of Anglesey","LA"," ",82.222222222222214,79.353896049810942,84.768544775451389,2.5463225532291744,2.8683261724112725]
["Conwy_Vacc_Children at age 4_2011-2012 (FY)_LA","Vacc","2011-2012 (FY)","Children at age 4","Conwy","LA"," ",81.227436823104696,78.821662305346919,83.417419232886587,2.1899824097818907,2.4057745177577772]
["Denbighshire_Vacc_Children at age 4_2011-2012 (FY)_LA","Vacc","2011-2012 (FY)","Children at age 4","Denbighshire","LA"," ",82.324687800192123,79.889767026769547,84.521910303076424,2.1972225028843013,2.4349207734225757]
["Flintshire_Vacc_Children at age 4_2011-2012 (FY)_LA","Vacc","2011-2012 (FY)","Children at age 4","Flintshire","LA"," ",83.065855008301043,81.266821004160278,84.724594258223817,1.6587392499227747,1.7990340041407649]
["Gwynedd_Vacc_Children at age 4_2011-2012 (FY)_LA","Vacc","2011-2012 (FY)","Children at age 4","Gwynedd","LA"," ",85.064935064935071,82.965694500450965,86.946177700646672,1.881242635711601,2.0992405644841057]
["Wrexham_Vacc_Children at age 4_2011-2012 (FY)_LA","Vacc","2011-2012 (FY)","Children at age 4","Wrexham","LA"," ",84.766584766584756,82.9392945361557,86.430183481808797,1.6635987152240403,1.8272902304290568]
["Betsi Cadwaladr UHB_Vacc_Children at age 4_2011-2012 (FY)_HB","Vacc","2011-2012 (FY)","Children at age 4","Betsi Cadwaladr UHB","HB"," ",83.300356153541742,82.44393825028159,84.12304186964603,0.82268571610428864,0.85641790326015155]
["Cardiff_Vacc_Children at age 4_2011-2012 (FY)_LA","Vacc","2011-2012 (FY)","Children at age 4","Cardiff","LA"," ",76.876130198915007,75.610695210149814,78.094929670378889,1.2187994714638819,1.2654349887651932]
["The Vale of Glamorgan_Vacc_Children at age 4_2011-2012 (FY)_LA","Vacc","2011-2012 (FY)","Children at age 4","The Vale of Glamorgan","LA"," ",81.373844121532372,79.334224029815147,83.254652174394835,1.8808080528624629,2.0396200917172251]
["Cardiff & Vale UHB_Vacc_Children at age 4_2011-2012 (FY)_HB","Vacc","2011-2012 (FY)","Children at age 4","Cardiff & Vale UHB","HB"," ",78.022903334456046,76.951718511054793,79.057852662973133,1.0349493285170865,1.0711848234012535]
["Merthyr Tydfil_Vacc_Children at age 4_2011-2012 (FY)_LA","Vacc","2011-2012 (FY)","Children at age 4","Merthyr Tydfil","LA"," ",85.094066570188133,82.244793182272034,87.555287872172599,2.461221301984466,2.8492733879160994]
["Rhondda Cynon Taf_Vacc_Children at age 4_2011-2012 (FY)_LA","Vacc","2011-2012 (FY)","Children at age 4","Rhondda Cynon Taf","LA"," ",82.608695652173907,81.143220169327947,83.9827615729223,1.374065920748393,1.4654754828459602]
["Cwm Taf HB_Vacc_Children at age 4_2011-2012 (FY)_HB","Vacc","2011-2012 (FY)","Children at age 4","Cwm Taf HB","HB"," ",83.109684947491246,81.818537233646666,84.326706765959827,1.2170218184685808,1.2911477138445804]
["Carmarthenshire_Vacc_Children at age 4_2011-2012 (FY)_LA","Vacc","2011-2012 (FY)","Children at age 4","Carmarthenshire","LA"," ",78.62444334487877,76.78365337075401,80.356618737444478,1.7321753925657077,1.8407899741247604]
["Ceredigion_Vacc_Children at age 4_2011-2012 (FY)_LA","Vacc","2011-2012 (FY)","Children at age 4","Ceredigion","LA"," ",83.796296296296291,80.761300633610162,86.432937966687845,2.6366416703915547,3.0349956626861285]
["Pembrokeshire_Vacc_Children at age 4_2011-2012 (FY)_LA","Vacc","2011-2012 (FY)","Children at age 4","Pembrokeshire","LA"," ",75.34142640364189,72.942979542770331,77.592576305978866,2.2511499023369765,2.3984468608715588]
["Hywel Dda HB_Vacc_Children at age 4_2011-2012 (FY)_HB","Vacc","2011-2012 (FY)","Children at age 4","Hywel Dda HB","HB"," ",78.379734135941817,77.07493142993323,79.629899951998823,1.2501658160570059,1.3048027060085872]
["Powys THB_Vacc_Children at age 4_2011-2012 (FY)_HB","Vacc","2011-2012 (FY)","Children at age 4","Powys THB","HB"," ",81.411764705882348,79.183204060416742,83.451605442183137,2.0398407363007891,2.2285606454656062]
["Powys_Vacc_Children at age 4_2011-2012 (FY)_LA","Vacc","2011-2012 (FY)","Children at age 4","Powys","LA"," ",81.411764705882348,79.183204060416742,83.451605442183137,2.0398407363007891,2.2285606454656062]
["Wales_Vacc_Children at age 4_2011-2012 (FY)_Wales","Vacc","2011-2012 (FY)","Children at age 4","Wales","Wales"," ",80.842395202708516,80.425837297549023,81.252154778474292,0.40975957576577571,0.4165579051594932]
["Wales_ALC_Females_2010_Wales","ALC",2010,"Females","Wales","Wales",3532,230.16815,222.47051999999999,238.05972,7.8915699999999998,7.6976300000000002]
["Hywel Dda HB_ALC_Females_2010_HB","ALC",2010,"Females","Hywel Dda HB","HB",380,199.49186,179.12868,221.46433999999999,21.972480000000001,20.36318]
["Cwm Taf HB_ALC_Females_2010_HB","ALC",2010,"Females","Cwm Taf HB","HB",340,232.26340999999999,207.83734000000001,258.73523999999998,26.471820000000001,24.426069999999999]
["Powys THB_ALC_Females_2010_HB","ALC",2010,"Females","Powys THB","HB",89,133.88287,105.40588,167.22681,33.343940000000003,28.476990000000001]
["ABM UHB_ALC_Females_2010_HB","ALC",2010,"Females","ABM UHB","HB",520,202.04006000000001,184.64718999999999,220.60075000000001,18.560690000000001,17.392869999999998]
["Aneurin Bevan HB_ALC_Females_2010_HB","ALC",2010,"Females","Aneurin Bevan HB","HB",724,254.49462,235.94047,274.09872999999999,19.604109999999999,18.55415]
["Betsi Cadwaladr UHB_ALC_Females_2010_HB","ALC",2010,"Females","Betsi Cadwaladr UHB","HB",941,274.71100999999999,256.86076000000003,293.44396,18.732949999999999,17.850249999999999]
["Cardiff & Vale UHB_ALC_Females_2010_HB","ALC",2010,"Females","Cardiff & Vale UHB","HB",538,221.98399000000001,203.21733,241.98868999999999,20.0047,18.766660000000002]
["Carmarthenshire_ALC_Females_2010_LA","ALC",2010,"Females","Carmarthenshire","LA",211,228.65536,197.84764999999999,262.77838000000003,34.123019999999997,30.80771]
["Ceredigion_ALC_Females_2010_LA","ALC",2010,"Females","Ceredigion","LA",47,117.33358,83.471940000000004,159.42984999999999,42.096269999999997,33.861640000000001]
["Conwy_ALC_Females_2010_LA","ALC",2010,"Females","Conwy","LA",162,301.37362000000002,253.77180999999999,354.86909000000003,53.495469999999997,47.60181]
["Blaenau Gwent_ALC_Females_2010_LA","ALC",2010,"Females","Blaenau Gwent","LA",91,260.08472999999998,208.58721,320.27782999999999,60.193100000000001,51.497520000000002]
["Bridgend_ALC_Females_2010_LA","ALC",2010,"Females","Bridgend","LA",128,185.72235000000001,154.05044000000001,221.84200999999999,36.119660000000003,31.671900000000001]
["Caerphilly_ALC_Females_2010_LA","ALC",2010,"Females","Caerphilly","LA",189,214.43716000000001,184.45939000000001,247.83457999999999,33.397410000000001,29.97777]
["Cardiff_ALC_Females_2010_LA","ALC",2010,"Females","Cardiff","LA",380,219.70339999999999,197.50945999999999,243.65133,23.947929999999999,22.193950000000001]
["Rhondda Cynon Taf_ALC_Females_2010_LA","ALC",2010,"Females","Rhondda Cynon Taf","LA",283,238.47686999999999,211.05869000000001,268.42295000000001,29.946090000000002,27.41818]
["Swansea_ALC_Females_2010_LA","ALC",2010,"Females","Swansea","LA",224,192.46559999999999,167.50418999999999,220.02967000000001,27.564080000000001,24.961410000000001]
["The Vale of Glamorgan_ALC_Females_2010_LA","ALC",2010,"Females","The Vale of Glamorgan","LA",158,246.23600999999999,208.17413999999999,289.07359000000002,42.837580000000003,38.061880000000002]
["Torfaen_ALC_Females_2010_LA","ALC",2010,"Females","Torfaen","LA",141,314.15404999999998,263.68432000000001,371.35329000000002,57.19923,50.469729999999998]
["Denbighshire_ALC_Females_2010_LA","ALC",2010,"Females","Denbighshire","LA",146,294.00943000000001,245.96544,348.34120000000001,54.331769999999999,48.043990000000001]
["Flintshire_ALC_Females_2010_LA","ALC",2010,"Females","Flintshire","LA",197,265.37837999999999,228.68026,306.17178000000001,40.793399999999998,36.698120000000003]
["Gwynedd_ALC_Females_2010_LA","ALC",2010,"Females","Gwynedd","LA",149,249.91433000000001,210.11350999999999,294.86779000000001,44.953470000000003,39.800809999999998]
["Isle of Anglesey_ALC_Females_2010_LA","ALC",2010,"Females","Isle of Anglesey","LA",86,232.21964,182.43272999999999,290.67597999999998,58.456330000000001,49.786909999999999]
["Merthyr Tydfil_ALC_Females_2010_LA","ALC",2010,"Females","Merthyr Tydfil","LA",57,207.54177000000001,156.22108,270.06823000000003,62.526470000000003,51.320689999999999]
["Monmouthshire_ALC_Females_2010_LA","ALC",2010,"Females","Monmouthshire","LA",84,197.98847000000001,154.98956000000001,248.57150999999999,50.583039999999997,42.998910000000002]
["Neath Port Talbot_ALC_Females_2010_LA","ALC",2010,"Females","Neath Port Talbot","LA",168,236.43279999999999,201.07561000000001,276.08368000000002,39.650880000000001,35.357199999999999]
["Newport_ALC_Females_2010_LA","ALC",2010,"Females","Newport","LA",219,303.87292000000002,264.36345,347.55135000000001,43.678429999999999,39.50947]
["Pembrokeshire_ALC_Females_2010_LA","ALC",2010,"Females","Pembrokeshire","LA",122,208.28975,171.09990999999999,250.83873,42.54898,37.18985]
["Powys_ALC_Females_2010_LA","ALC",2010,"Females","Powys","LA",89,133.88287,105.40588,167.22681,33.343940000000003,28.476990000000001]
["Wrexham_ALC_Females_2010_LA","ALC",2010,"Females","Wrexham","LA",201,296.58775000000003,256.36304000000001,341.25378000000001,44.666029999999999,40.224719999999998]
["Wales_ALC_Males_2010_Wales","ALC",2010,"Males","Wales","Wales",6551,431.66547000000003,421.08307000000002,442.44292000000002,10.77745,10.5824]
["Cwm Taf HB_ALC_Males_2010_HB","ALC",2010,"Males","Cwm Taf HB","HB",688,478.18162999999998,442.72309999999999,515.7002,37.518560000000001,35.458539999999999]
["Powys THB_ALC_Males_2010_HB","ALC",2010,"Males","Powys THB","HB",203,305.18295000000001,261.83452,353.29257999999999,48.109630000000003,43.348439999999997]
["ABM UHB_ALC_Males_2010_HB","ALC",2010,"Males","ABM UHB","HB",1136,442.38315,416.61968000000002,469.30333999999999,26.920190000000002,25.763470000000002]
["Aneurin Bevan HB_ALC_Males_2010_HB","ALC",2010,"Males","Aneurin Bevan HB","HB",1348,482.23716000000002,456.38062000000002,509.15724999999998,26.920100000000001,25.856529999999999]
["Betsi Cadwaladr UHB_ALC_Males_2010_HB","ALC",2010,"Males","Betsi Cadwaladr UHB","HB",1604,468.26287000000002,445.01456999999999,492.38619,24.12332,23.2483]
["Cardiff & Vale UHB_ALC_Males_2010_HB","ALC",2010,"Males","Cardiff & Vale UHB","HB",936,413.87923000000001,387.45397000000003,441.6148,27.735569999999999,26.425260000000002]
["Hywel Dda HB_ALC_Males_2010_HB","ALC",2010,"Males","Hywel Dda HB","HB",636,342.72284999999999,315.42232999999999,371.67507999999998,28.95224,27.300509999999999]
["Isle of Anglesey_ALC_Males_2010_LA","ALC",2010,"Males","Isle of Anglesey","LA",195,580.31137999999999,498.51384000000002,671.28650000000005,90.975120000000004,81.797539999999998]
[{"$f":"TRIM(E131)&\"_\"&B131&\"_\"&D131&\"_\"&C131&\"_\"&F131","v":"Merthyr Tydfil_ALC_Males_2010_LA"},"ALC",2010,"Males","Merthyr Tydfil","LA",144,525.24170000000004,442.01150000000001,619.44530999999995,94.203620000000001,83.230199999999996]
["Monmouthshire_ALC_Males_2010_LA","ALC",2010,"Males","Monmouthshire","LA",163,345.68788999999998,291.63342999999998,406.41302000000002,60.725119999999997,54.054459999999999]
["Neath Port Talbot_ALC_Males_2010_LA","ALC",2010,"Males","Neath Port Talbot","LA",332,472.66829999999999,422.14395000000002,527.47717999999998,54.808880000000002,50.524340000000002]
["Newport_ALC_Males_2010_LA","ALC",2010,"Males","Newport","LA",381,554.83759999999995,499.96275000000003,614.04324999999994,59.205649999999999,54.874850000000002]
["Pembrokeshire_ALC_Males_2010_LA","ALC",2010,"Males","Pembrokeshire","LA",234,387.92563000000001,337.44841000000002,443.54613999999998,55.620510000000003,50.477220000000003]
["Powys_ALC_Males_2010_LA","ALC",2010,"Males","Powys","LA",203,305.18295000000001,261.83452,353.29257999999999,48.109630000000003,43.348439999999997]
["Carmarthenshire_ALC_Males_2010_LA","ALC",2010,"Males","Carmarthenshire","LA",306,349.31297999999998,309.93295999999998,392.17806000000002,42.865079999999999,39.380020000000002]
["Ceredigion_ALC_Males_2010_LA","ALC",2010,"Males","Ceredigion","LA",96,264.98253999999997,210.13822999999999,328.82234,63.839799999999997,54.84431]
["Conwy_ALC_Males_2010_LA","ALC",2010,"Males","Conwy","LA",293,527.79268000000002,465.96588000000003,595.21693000000005,67.424250000000001,61.826799999999999]
["Blaenau Gwent_ALC_Males_2010_LA","ALC",2010,"Males","Blaenau Gwent","LA",197,584.49523999999997,503.92583999999999,674.0557,89.560450000000003,80.569400000000002]
["Bridgend_ALC_Males_2010_LA","ALC",2010,"Males","Bridgend","LA",293,425.28357999999997,377.18804999999998,477.73340999999999,52.449829999999999,48.095529999999997]
["Caerphilly_ALC_Males_2010_LA","ALC",2010,"Males","Caerphilly","LA",374,439.60833000000002,395.65877999999998,487.06013999999999,47.451810000000002,43.949550000000002]
["Cardiff_ALC_Males_2010_LA","ALC",2010,"Males","Cardiff","LA",666,415.88914999999997,384.34134999999998,449.30076000000003,33.411610000000003,31.547799999999999]
["Rhondda Cynon Taf_ALC_Males_2010_LA","ALC",2010,"Males","Rhondda Cynon Taf","LA",544,467.06887,428.20328999999998,508.48372999999998,41.414859999999997,38.865569999999998]
["Swansea_ALC_Males_2010_LA","ALC",2010,"Males","Swansea","LA",511,441.11108000000002,402.99572999999998,481.80887999999999,40.697800000000001,38.115349999999999]
["The Vale of Glamorgan_ALC_Males_2010_LA","ALC",2010,"Males","The Vale of Glamorgan","LA",270,434.76342,383.36162999999999,491.02280999999999,56.259390000000003,51.401789999999998]
["Torfaen_ALC_Males_2010_LA","ALC",2010,"Males","Torfaen","LA",233,508.22280999999998,443.72446000000002,579.30795999999998,71.085149999999999,64.498350000000002]
["Denbighshire_ALC_Males_2010_LA","ALC",2010,"Males","Denbighshire","LA",213,443.86833999999999,384.24912999999998,509.87144000000001,66.003100000000003,59.619210000000002]
["Flintshire_ALC_Males_2010_LA","ALC",2010,"Males","Flintshire","LA",297,383.02123999999998,339.83902999999998,430.08524,47.064,43.182209999999998]
["Gwynedd_ALC_Males_2010_LA","ALC",2010,"Males","Gwynedd","LA",281,484.22366,427.42394999999999,546.27972999999997,62.056069999999998,56.799709999999997]
["Wrexham_ALC_Males_2010_LA","ALC",2010,"Males","Wrexham","LA",325,473.49266,422.72622999999999,528.61239,55.119729999999997,50.76643]
["Wales_ALC_Persons_2010_Wales","ALC",2010,"Persons","Wales","Wales",10083,328.43511999999998,321.92182000000003,335.04498000000001,6.6098699999999999,6.5132899999999996]
["Powys THB_ALC_Persons_2010_HB","ALC",2010,"Persons","Powys THB","HB",292,219.90387999999999,193.4983,248.70436000000001,28.80048,26.40558]
["Hywel Dda HB_ALC_Persons_2010_HB","ALC",2010,"Persons","Hywel Dda HB","HB",1016,268.32794999999999,251.38105999999999,286.08051999999998,17.752569999999999,16.94689]
["ABM UHB_ALC_Persons_2010_HB","ALC",2010,"Persons","ABM UHB","HB",1656,319.44371999999998,303.93767000000003,335.52395000000001,16.08023,15.50604]
["Aneurin Bevan HB_ALC_Persons_2010_HB","ALC",2010,"Persons","Aneurin Bevan HB","HB",2072,365.49355000000003,349.62097999999997,381.89044999999999,16.396899999999999,15.87257]
["Betsi Cadwaladr UHB_ALC_Persons_2010_HB","ALC",2010,"Persons","Betsi Cadwaladr UHB","HB",2545,369.93353999999999,355.25817000000001,385.04556000000002,15.11201,14.675369999999999]
["Cardiff & Vale UHB_ALC_Persons_2010_HB","ALC",2010,"Persons","Cardiff & Vale UHB","HB",1474,314.9033,298.76713000000001,331.67358000000002,16.77028,16.13617]
["Cwm Taf HB_ALC_Persons_2010_HB","ALC",2010,"Persons","Cwm Taf HB","HB",1028,352.19722999999999,330.71086000000003,374.69896,22.501729999999998,21.486370000000001]
["Denbighshire_ALC_Persons_2010_LA","ALC",2010,"Persons","Denbighshire","LA",359,366.91975000000002,328.41045000000003,408.56401,41.644269999999999,38.509300000000003]
["Flintshire_ALC_Persons_2010_LA","ALC",2010,"Persons","Flintshire","LA",494,322.61637999999999,294.10234000000003,353.09652999999997,30.480149999999998,28.514040000000001]
["Gwynedd_ALC_Persons_2010_LA","ALC",2010,"Persons","Gwynedd","LA",430,365.87833999999998,330.94650999999999,403.39877000000001,37.520420000000001,34.931829999999998]
["Carmarthenshire_ALC_Persons_2010_LA","ALC",2010,"Persons","Carmarthenshire","LA",517,286.39105999999998,261.40352999999999,313.06137999999999,26.670310000000001,24.98753]
["Ceredigion_ALC_Persons_2010_LA","ALC",2010,"Persons","Ceredigion","LA",143,188.65411,156.51338999999999,225.04822999999999,36.394109999999998,32.140720000000002]
["Conwy_ALC_Persons_2010_LA","ALC",2010,"Persons","Conwy","LA",455,411.61941999999999,372.39395999999999,453.66752000000002,42.048099999999998,39.225459999999998]
["Blaenau Gwent_ALC_Persons_2010_LA","ALC",2010,"Persons","Blaenau Gwent","LA",288,417.47223000000002,369.63902999999999,469.67525000000001,52.203009999999999,47.833210000000001]
["Bridgend_ALC_Persons_2010_LA","ALC",2010,"Persons","Bridgend","LA",421,303.09645,274.17685999999998,334.18281000000002,31.086359999999999,28.919589999999999]
["Caerphilly_ALC_Persons_2010_LA","ALC",2010,"Persons","Caerphilly","LA",563,324.39139999999998,297.78613000000001,352.71105,28.319649999999999,26.60528]
["Cardiff_ALC_Persons_2010_LA","ALC",2010,"Persons","Cardiff","LA",1046,315.28215999999998,296.02695999999997,335.43923999999998,20.157070000000001,19.255210000000002]
["Isle of Anglesey_ALC_Persons_2010_LA","ALC",2010,"Persons","Isle of Anglesey","LA",281,404.13981999999999,355.90109000000001,456.84264999999999,52.702829999999999,48.238720000000001]
["Merthyr Tydfil_ALC_Persons_2010_LA","ALC",2010,"Persons","Merthyr Tydfil","LA",201,362.03359999999998,313.01636999999999,416.46296000000001,54.429349999999999,49.017240000000001]
["Monmouthshire_ALC_Persons_2010_LA","ALC",2010,"Persons","Monmouthshire","LA",247,268.96197999999998,234.27700999999999,307.08186999999998,38.119889999999998,34.68497]
["Neath Port Talbot_ALC_Persons_2010_LA","ALC",2010,"Persons","Neath Port Talbot","LA",500,351.38677999999999,320.52539999999999,384.36284999999998,32.97607,30.86138]
["Newport_ALC_Persons_2010_LA","ALC",2010,"Persons","Newport","LA",600,425.95152000000002,392.11441000000002,461.89837999999997,35.946869999999997,33.8371]
["Pembrokeshire_ALC_Persons_2010_LA","ALC",2010,"Persons","Pembrokeshire","LA",356,294.91548,263.51382000000001,328.88472000000002,33.969230000000003,31.40166]
["Powys_ALC_Persons_2010_LA","ALC",2010,"Persons","Powys","LA",292,219.90387999999999,193.4983,248.70436000000001,28.80048,26.40558]
["Rhondda Cynon Taf_ALC_Persons_2010_LA","ALC",2010,"Persons","Rhondda Cynon Taf","LA",827,349.89884999999998,326.13753000000003,374.91577999999998,25.016940000000002,23.761310000000002]
["Swansea_ALC_Persons_2010_LA","ALC",2010,"Persons","Swansea","LA",735,313.64186000000001,290.89451000000003,337.66649999999998,24.024640000000002,22.747350000000001]
["The Vale of Glamorgan_ALC_Persons_2010_LA","ALC",2010,"Persons","The Vale of Glamorgan","LA",428,335.96445,304.10404,370.19157999999999,34.227130000000002,31.860410000000002]
["Torfaen_ALC_Persons_2010_LA","ALC",2010,"Persons","Torfaen","LA",374,408.11057,367.01082000000002,452.48548,44.37491,41.09975]
["Wrexham_ALC_Persons_2010_LA","ALC",2010,"Persons","Wrexham","LA",526,383.82038,351.2045,418.61322000000001,34.792839999999998,32.615879999999997]
["Wales_HIP_Females_2010_Wales","HIP",2010,"Females","Wales","Wales",3408,777.34780000000001,749.87972000000002,805.52056000000005,28.17276,27.46808]
["Hywel Dda HB_HIP_Females_2010_HB","HIP",2010,"Females","Hywel Dda HB","HB",451,737.50530000000003,666.97379999999998,813.13553000000002,75.630229999999997,70.531499999999994]
["Cwm Taf HB_HIP_Females_2010_HB","HIP",2010,"Females","Cwm Taf HB","HB",347,861.38109999999995,768.18421000000001,962.30083000000002,100.91973,93.196889999999996]
["Powys THB_HIP_Females_2010_HB","HIP",2010,"Females","Powys THB","HB",183,800.07650000000001,681.24068999999997,932.70222000000001,132.62572,118.83581]
["ABM UHB_HIP_Females_2010_HB","HIP",2010,"Females","ABM UHB","HB",503,694.26400000000001,631.25886000000003,761.57303000000002,67.309030000000007,63.005139999999997]
["Aneurin Bevan HB_HIP_Females_2010_HB","HIP",2010,"Females","Aneurin Bevan HB","HB",740,906.6499,839.4914,977.56627000000003,70.916370000000001,67.158500000000004]
["Betsi Cadwaladr UHB_HIP_Females_2010_HB","HIP",2010,"Females","Betsi Cadwaladr UHB","HB",855,812.89089999999999,755.82510000000002,872.92105000000004,60.030149999999999,57.065800000000003]
["Cardiff & Vale UHB_HIP_Females_2010_HB","HIP",2010,"Females","Cardiff & Vale UHB","HB",329,620.50890000000004,550.15211999999997,696.86042999999995,76.351529999999997,70.356780000000001]
["Carmarthenshire_HIP_Females_2010_LA","HIP",2010,"Females","Carmarthenshire              ","LA",225,760.17539999999997,657.87057000000004,873.12228000000005,112.94687999999999,102.30483]
["Ceredigion_HIP_Females_2010_LA","HIP",2010,"Females","Ceredigion                   ","LA",79,635.19889999999998,493.95632999999998,802.20324000000005,167.00434000000001,141.24257]
["Conwy_HIP_Females_2010_LA","HIP",2010,"Females","Conwy                        ","LA",191,860.23649999999998,733.54246999999998,1001.30242,141.06592000000001,126.69403]
["Blaenau Gwent_HIP_Females_2010_LA","HIP",2010,"Females","Blaenau Gwent                ","LA",117,1136.6878999999999,930.71866,1373.0137,236.32579999999999,205.96924000000001]
["Bridgend_HIP_Females_2010_LA","HIP",2010,"Females","Bridgend                     ","LA",111,581.4212,473.93279999999999,705.20770000000005,123.7865,107.4884]
[{"$f":"TRIM(E195)&\"_\"&B195&\"_\"&D195&\"_\"&C195&\"_\"&F195","v":"Caerphilly_HIP_Females_2010_LA"},"HIP",2010,"Females","Caerphilly                   ","LA",209,953.99260000000004,824.34853999999996,1097.6584600000001,143.66586000000001,129.64406]
["Cardiff_HIP_Females_2010_LA","HIP",2010,"Females","Cardiff                      ","LA",218,597.60879999999997,514.13672999999994,689.90997000000004,92.301169999999999,83.472070000000002]
["Rhondda Cynon Taf_HIP_Females_2010_LA","HIP",2010,"Females","Rhondda Cynon Taf","LA",286,873.36429999999996,769.36742000000004,986.89661000000001,113.53231,103.99688]
["Swansea_HIP_Females_2010_LA","HIP",2010,"Females","Swansea                      ","LA",216,636.67769999999996,549.90408000000002,732.67443000000003,95.996729999999999,86.773619999999994]
["The Vale of Glamorgan_HIP_Females_2010_LA","HIP",2010,"Females","The Vale of Glamorgan        ","LA",111,670.58270000000005,544.29618000000005,816.01760999999999,145.43491,126.28652]
["Torfaen_HIP_Females_2010_LA","HIP",2010,"Females","Torfaen                      ","LA",119,823.52189999999996,676.31075999999996,992.23249999999996,168.7106,147.21114]
["Denbighshire_HIP_Females_2010_LA","HIP",2010,"Females","Denbighshire                 ","LA",107,586.81780000000003,471.04228000000001,720.49932999999999,133.68153000000001,115.77552]
["Flintshire_HIP_Females_2010_LA","HIP",2010,"Females","Flintshire                   ","LA",168,927.49829999999997,787.12114999999994,1084.92247,157.42417,140.37715]
["Gwynedd_HIP_Females_2010_LA","HIP",2010,"Females","Gwynedd                      ","LA",177,1002.0168,850.11874999999998,1171.85617,169.83937,151.89805000000001]
["Isle of Anglesey_HIP_Females_2010_LA","HIP",2010,"Females","Isle of Anglesey             ","LA",105,904.55679999999995,732.39571999999998,1103.61754,199.06074000000001,172.16108]
["Merthyr Tydfil_HIP_Females_2010_LA","HIP",2010,"Females","Merthyr Tydfil               ","LA",61,809.72109999999998,610.30380000000002,1051.0731800000001,241.35208,199.41730000000001]
["Monmouthshire_HIP_Females_2010_LA","HIP",2010,"Females","Monmouthshire                ","LA",146,972.40719999999999,812.49189000000001,1153.2515100000001,180.84431000000001,159.91531000000001]
["Neath Port Talbot_HIP_Females_2010_LA","HIP",2010,"Females","Neath Port Talbot            ","LA",176,891.91250000000002,754.70074999999997,1045.37976,153.46726000000001,137.21174999999999]
["Newport_HIP_Females_2010_LA","HIP",2010,"Females","Newport                      ","LA",149,747.64890000000003,626.53036999999995,884.44754999999998,136.79865000000001,121.11853000000001]
["Pembrokeshire_HIP_Females_2010_LA","HIP",2010,"Females","Pembrokeshire                ","LA",147,773.85500000000002,647.54444000000001,916.63633000000004,142.78133,126.31056]
["Powys_HIP_Females_2010_LA","HIP",2010,"Females","Powys                        ","LA",183,800.07650000000001,681.24068999999997,932.70222000000001,132.62572,118.83581]
["Wrexham_HIP_Females_2010_LA","HIP",2010,"Females","Wrexham                      ","LA",107,586.65440000000001,473.70765999999998,717.06965000000002,130.41524999999999,112.94674000000001]
["Wales_HIP_Males_2010_Wales","HIP",2010,"Males","Wales","Wales",1171,424.90069999999997,400.63601999999997,450.238,25.337299999999999,24.264679999999998]
["Cwm Taf HB_HIP_Males_2010_HB","HIP",2010,"Males","Cwm Taf HB","HB",107,454.15929999999997,371.32715999999999,549.80238999999995,95.643090000000001,82.832139999999995]
["Powys THB_HIP_Males_2010_HB","HIP",2010,"Males","Powys THB","HB",58,362.3168,274.07488000000001,469.64096000000001,107.32416000000001,88.241919999999993]
["ABM UHB_HIP_Males_2010_HB","HIP",2010,"Males","ABM UHB","HB",168,373.06169999999997,318.04360000000003,434.76105000000001,61.699350000000003,55.018099999999997]
["Aneurin Bevan HB_HIP_Males_2010_HB","HIP",2010,"Males","Aneurin Bevan HB","HB",243,496.60879999999997,435.47719999999998,563.84666000000004,67.237859999999998,61.131599999999999]
["Betsi Cadwaladr UHB_HIP_Males_2010_HB","HIP",2010,"Males","Betsi Cadwaladr UHB","HB",292,441.03660000000002,391.41392000000002,495.15989999999999,54.1233,49.622680000000003]
["Cardiff & Vale UHB_HIP_Males_2010_HB","HIP",2010,"Males","Cardiff & Vale UHB","HB",123,356.99639999999999,295.39591000000001,427.43475999999998,70.438360000000003,61.600490000000001]
["Hywel Dda HB_HIP_Males_2010_HB","HIP",2010,"Males","Hywel Dda HB","HB",180,446.4083,382.89184,517.36027999999999,70.951980000000006,63.516460000000002]
["Isle of Anglesey_HIP_Males_2010_LA","HIP",2010,"Males","Isle of Anglesey             ","LA",40,559.97810000000004,398.36189999999999,764.63932999999997,204.66122999999999,161.61619999999999]
["Merthyr Tydfil_HIP_Males_2010_LA","HIP",2010,"Males","Merthyr Tydfil               ","LA",19,424.37830000000002,252.85289,666.32568000000003,241.94738000000001,171.52540999999999]
["Monmouthshire_HIP_Males_2010_LA","HIP",2010,"Males","Monmouthshire                ","LA",51,532.47749999999996,394.61507999999998,702.36666000000002,169.88916,137.86241999999999]
["Neath Port Talbot_HIP_Males_2010_LA","HIP",2010,"Males","Neath Port Talbot            ","LA",55,439.0127,329.62389000000002,572.76554999999996,133.75285,109.38881000000001]
["Newport_HIP_Males_2010_LA","HIP",2010,"Males","Newport                      ","LA",56,474.60660000000001,356.98421999999999,618.16553999999996,143.55894000000001,117.62238000000001]
["Pembrokeshire_HIP_Males_2010_LA","HIP",2010,"Males","Pembrokeshire                ","LA",52,416.78179999999998,309.82317,548.31985999999995,131.53806,106.95863]
["Powys_HIP_Males_2010_LA","HIP",2010,"Males","Powys                        ","LA",58,362.3168,274.07488000000001,469.64096000000001,107.32416000000001,88.241919999999993]
["Carmarthenshire_HIP_Males_2010_LA","HIP",2010,"Males","Carmarthenshire              ","LA",96,513.25350000000003,414.46634,628.24359000000004,114.99009,98.78716]
["Ceredigion_HIP_Males_2010_LA","HIP",2010,"Males","Ceredigion                   ","LA",32,347.44009999999997,236.31156999999999,492.18630000000002,144.74619999999999,111.12853]
["Conwy_HIP_Males_2010_LA","HIP",2010,"Males","Conwy                        ","LA",72,504.64429999999999,392.51495999999997,638.29253000000006,133.64823000000001,112.12934]
["Blaenau Gwent_HIP_Males_2010_LA","HIP",2010,"Males","Blaenau Gwent                ","LA",36,616.65769999999998,430.42426,855.55472999999995,238.89703,186.23344]
["Bridgend_HIP_Males_2010_LA","HIP",2010,"Males","Bridgend                     ","LA",34,292.61259999999999,201.86581000000001,409.87304999999998,117.26045000000001,90.746790000000004]
["Caerphilly_HIP_Males_2010_LA","HIP",2010,"Males","Caerphilly                   ","LA",60,447.20170000000002,340.39312999999999,576.67728,129.47558000000001,106.80857]
["Cardiff_HIP_Males_2010_LA","HIP",2010,"Males","Cardiff                      ","LA",88,384.06950000000001,305.64251999999999,475.98302999999999,91.913529999999994,78.42698]
["Rhondda Cynon Taf_HIP_Males_2010_LA","HIP",2010,"Males","Rhondda Cynon Taf","LA",88,465.13409999999999,372.04255000000001,574.23396000000002,109.09986000000001,93.091549999999998]
["Swansea_HIP_Males_2010_LA","HIP",2010,"Males","Swansea                      ","LA",79,388.87610000000001,306.02076,486.84374000000003,97.967640000000003,82.855339999999998]
["The Vale of Glamorgan_HIP_Males_2010_LA","HIP",2010,"Males","The Vale of Glamorgan        ","LA",35,307.36989999999997,213.44672,428.28356000000002,120.91365999999999,93.923180000000002]
["Torfaen_HIP_Males_2010_LA","HIP",2010,"Males","Torfaen                      ","LA",40,469.07389999999998,332.75513000000001,641.69996000000003,172.62606,136.31877]
["Denbighshire_HIP_Males_2010_LA","HIP",2010,"Males","Denbighshire                 ","LA",28,264.49790000000002,175.15889000000001,383.02936,118.53146,89.339010000000002]
["Flintshire_HIP_Males_2010_LA","HIP",2010,"Males","Flintshire                   ","LA",59,472.80970000000002,359.11914000000002,610.85365000000002,138.04395,113.69056]
["Gwynedd_HIP_Males_2010_LA","HIP",2010,"Males","Gwynedd                      ","LA",57,508.28640000000001,383.79665,659.95825000000002,151.67185000000001,124.48975]
["Wrexham_HIP_Males_2010_LA","HIP",2010,"Males","Wrexham                      ","LA",36,331.5795,231.16972999999999,460.38342,128.80392000000001,100.40976999999999]
["Wales_HIP_Persons_2010_Wales","HIP",2010,"Persons","Wales","Wales",4579,636.40340000000003,617.51894000000004,655.70501999999999,19.30162,18.884460000000001]
["Powys THB_HIP_Persons_2010_HB","HIP",2010,"Persons","Powys THB","HB",241,614.60550000000001,536.83633999999995,700.17668000000003,85.571179999999998,77.769159999999999]
["Hywel Dda HB_HIP_Persons_2010_HB","HIP",2010,"Persons","Hywel Dda HB","HB",631,610.81600000000003,562.75545,661.79616999999996,50.980170000000001,48.060549999999999]
["ABM UHB_HIP_Persons_2010_HB","HIP",2010,"Persons","ABM UHB","HB",671,568.65520000000004,524.96154999999999,614.92029000000002,46.265090000000001,43.693649999999998]
["Aneurin Bevan HB_HIP_Persons_2010_HB","HIP",2010,"Persons","Aneurin Bevan HB","HB",983,750.50599999999997,703.21073999999999,800.08817999999997,49.582180000000001,47.295259999999999]
["Betsi Cadwaladr UHB_HIP_Persons_2010_HB","HIP",2010,"Persons","Betsi Cadwaladr UHB","HB",1147,661.8261,622.87671,702.51561000000004,40.689509999999999,38.949390000000001]
["Cardiff & Vale UHB_HIP_Persons_2010_HB","HIP",2010,"Persons","Cardiff & Vale UHB","HB",452,512.53790000000004,464.10019999999997,564.47315000000003,51.935250000000003,48.4377]
["Cwm Taf HB_HIP_Persons_2010_HB","HIP",2010,"Persons","Cwm Taf HB","HB",454,710.33330000000001,644.73739999999998,780.65484000000004,70.321539999999999,65.5959]
["Denbighshire_HIP_Persons_2010_LA","HIP",2010,"Persons","Denbighshire                 ","LA",135,454.87430000000001,378.21557999999999,541.99528999999995,87.120990000000006,76.658720000000002]
["Flintshire_HIP_Persons_2010_LA","HIP",2010,"Persons","Flintshire                   ","LA",227,734.0874,640.13422000000003,837.76833999999997,103.68094000000001,93.953180000000003]
["Gwynedd_HIP_Persons_2010_LA","HIP",2010,"Persons","Gwynedd                      ","LA",234,798.90480000000002,696.38687000000004,911.86860999999999,112.96381,102.51793000000001]
["Carmarthenshire_HIP_Persons_2010_LA","HIP",2010,"Persons","Carmarthenshire              ","LA",321,654.55539999999996,582.83338000000003,732.46767,77.912270000000007,71.722020000000001]
["Ceredigion_HIP_Persons_2010_LA","HIP",2010,"Persons","Ceredigion                   ","LA",111,499.64490000000001,407.9042,605.29593,105.65103000000001,91.740700000000004]
["Conwy_HIP_Persons_2010_LA","HIP",2010,"Persons","Conwy                        ","LA",263,715.74059999999997,627.92705000000001,811.96808999999996,96.227490000000003,87.813550000000006]
["Blaenau Gwent_HIP_Persons_2010_LA","HIP",2010,"Persons","Blaenau Gwent                ","LA",153,942.5172,796.27994000000001,1107.4205999999999,164.9034,146.23725999999999]
["Bridgend_HIP_Persons_2010_LA","HIP",2010,"Persons","Bridgend                     ","LA",145,466.7971,392.59124000000003,550.75044000000003,83.953339999999997,74.205860000000001]
["Caerphilly_HIP_Persons_2010_LA","HIP",2010,"Persons","Caerphilly                   ","LA",269,764.44,674.36541,863.04348000000005,98.603480000000005,90.074590000000001]
[{"$f":"TRIM(E259)&\"_\"&B259&\"_\"&D259&\"_\"&C259&\"_\"&F259","v":"Cardiff_HIP_Persons_2010_LA"},"HIP",2010,"Persons","Cardiff                      ","LA",306,514.34720000000004,454.97892000000002,578.96947,64.62227,59.368279999999999]
["Isle of Anglesey_HIP_Persons_2010_LA","HIP",2010,"Persons","Isle of Anglesey             ","LA",145,789.92660000000001,663.76607000000001,932.65922999999998,142.73263,126.16052999999999]
["Merthyr Tydfil_HIP_Persons_2010_LA","HIP",2010,"Persons","Merthyr Tydfil               ","LA",80,649.64210000000003,512.97619999999995,811.06411000000003,161.42201,136.66589999999999]
["Monmouthshire_HIP_Persons_2010_LA","HIP",2010,"Persons","Monmouthshire                ","LA",197,803.93370000000004,692.56087000000002,927.73505999999998,123.80136,111.37282999999999]
["Neath Port Talbot_HIP_Persons_2010_LA","HIP",2010,"Persons","Neath Port Talbot            ","LA",231,706.65899999999999,614.90909999999997,807.82141000000001,101.16240999999999,91.749899999999997]
["Newport_HIP_Persons_2010_LA","HIP",2010,"Persons","Newport                      ","LA",205,632.75480000000005,546.67102999999997,728.24469999999997,95.489900000000006,86.083770000000001]
["Pembrokeshire_HIP_Persons_2010_LA","HIP",2010,"Persons","Pembrokeshire                ","LA",199,620.10770000000002,535.00612000000001,714.65544,94.547740000000005,85.101579999999998]
["Powys_HIP_Persons_2010_LA","HIP",2010,"Persons","Powys                        ","LA",241,614.60550000000001,536.83633999999995,700.17668000000003,85.571179999999998,77.769159999999999]
["Rhondda Cynon Taf_HIP_Persons_2010_LA","HIP",2010,"Persons","Rhondda Cynon Taf","LA",374,725.45749999999998,651.61521000000005,805.18415000000005,79.726650000000006,73.842290000000006]
["Swansea_HIP_Persons_2010_LA","HIP",2010,"Persons","Swansea                      ","LA",295,544.4982,481.60448000000002,613.06569999999999,68.567499999999995,62.893720000000002]
["The Vale of Glamorgan_HIP_Persons_2010_LA","HIP",2010,"Persons","The Vale of Glamorgan        ","LA",146,513.35609999999997,430.81007,606.70537999999999,93.349279999999993,82.546030000000002]
["Torfaen_HIP_Persons_2010_LA","HIP",2010,"Persons","Torfaen                      ","LA",159,694.45889999999997,587.55557999999996,814.73058000000003,120.27168,106.90331999999999]
["Wrexham_HIP_Persons_2010_LA","HIP",2010,"Persons","Wrexham                      ","LA",143,485.54579999999999,406.99666000000002,574.48985000000005,88.944050000000004,78.549139999999994]
["Isle of Anglesey_OBE_Persons_2009-2010_LA","OBE","2009-2010","Persons","Isle of Anglesey","LA",{"$f":"\" \"","v":" "},54.165547923818572,51.028300000000002,57.302790000000002,3.1372420761814297,3.1372479238185704]
["Gwynedd_OBE_Persons_2009-2010_LA","OBE","2009-2010","Persons","Gwynedd","LA",{"$f":"\" \"","v":" "},56.101251216356729,52.863050000000001,59.339450000000006,3.2381987836432771,3.2382012163567282]
["Conwy_OBE_Persons_2009-2010_LA","OBE","2009-2010","Persons","Conwy","LA"," ",51.133775870175981,48.064019999999999,54.203539999999997,3.0697641298240157,3.0697558701759817]
["Denbighshire_OBE_Persons_2009-2010_LA","OBE","2009-2010","Persons","Denbighshire","LA"," ",54.445516385663936,51.3506,57.540430000000001,3.0949136143360647,3.0949163856639359]
["Flintshire_OBE_Persons_2009-2010_LA","OBE","2009-2010","Persons","Flintshire","LA"," ",56.2438316227448,53.399319999999996,59.088339999999995,2.8445083772551953,2.844511622744804]
["Wrexham_OBE_Persons_2009-2010_LA","OBE","2009-2010","Persons","Wrexham","LA"," ",54.349552822078387,51.403770000000002,57.29533,2.9457771779216131,2.9457828220783853]
["Powys_OBE_Persons_2009-2010_LA","OBE","2009-2010","Persons","Powys","LA"," ",55.973118219788418,52.762450000000008,59.183779999999999,3.2106617802115807,3.2106682197884098]
["Ceredigion_OBE_Persons_2009-2010_LA","OBE","2009-2010","Persons","Ceredigion","LA"," ",53.464115928285871,50.311760000000007,56.61647,3.1523540717141287,3.1523559282858642]
["Pembrokeshire_OBE_Persons_2009-2010_LA","OBE","2009-2010","Persons","Pembrokeshire","LA"," ",59.220667443311484,56.100680000000004,62.34066,3.1199925566885156,3.11998744331148]
["Carmarthenshire_OBE_Persons_2009-2010_LA","OBE","2009-2010","Persons","Carmarthenshire","LA"," ",59.448254086114758,56.723970000000001,62.172539999999998,2.7242859138852396,2.724284086114757]
["Swansea_OBE_Persons_2009-2010_LA","OBE","2009-2010","Persons","Swansea","LA"," ",56.612536587284012,54.009640000000005,59.215430000000005,2.6028934127159928,2.6028965872840075]
["Neath Port Talbot_OBE_Persons_2009-2010_LA","OBE","2009-2010","Persons","Neath Port Talbot","LA"," ",60.631463157575695,57.810029999999998,63.4529,2.8214368424243048,2.8214331575756972]
["Bridgend_OBE_Persons_2009-2010_LA","OBE","2009-2010","Persons","Bridgend","LA"," ",59.963117747903368,57.015210000000003,62.911019999999994,2.9479022520966254,2.9479077479033649]
["The Vale of Glamorgan_OBE_Persons_2009-2010_LA","OBE","2009-2010","Persons","The Vale of Glamorgan","LA"," ",54.658458129961495,51.47766,57.839260000000003,3.1808018700385077,3.1807981299614951]
["Cardiff_OBE_Persons_2009-2010_LA","OBE","2009-2010","Persons","Cardiff","LA"," ",54.555034810723988,52.206180000000003,56.903890000000004,2.3488551892760157,2.3488548107239851]
["Rhondda Cynon Taf_OBE_Persons_2009-2010_LA","OBE","2009-2010","Persons","Rhondda Cynon Taf","LA"," ",61.551741863550106,59.056620000000002,64.046860000000009,2.4951181364499035,2.4951218635501036]
["Merthyr Tydfil_OBE_Persons_2009-2010_LA","OBE","2009-2010","Persons","Merthyr Tydfil","LA"," ",63.353268717564994,60.370339999999999,66.336200000000005,2.9829312824350112,2.9829287175649952]
["Caerphilly_OBE_Persons_2009-2010_LA","OBE","2009-2010","Persons","Caerphilly","LA"," ",60.172649833378479,57.256339999999994,63.088960000000007,2.9163101666215283,2.9163098333784845]
["Blaenau Gwent_OBE_Persons_2009-2010_LA","OBE","2009-2010","Persons","Blaenau Gwent","LA"," ",60.882741367852525,57.885220000000004,63.88026,2.9975186321474752,2.9975213678525208]
["Torfaen_OBE_Persons_2009-2010_LA","OBE","2009-2010","Persons","Torfaen","LA"," ",62.587536280359345,59.673670000000001,65.501410000000007,2.9138737196406623,2.9138662803593434]
["Monmouthshire_OBE_Persons_2009-2010_LA","OBE","2009-2010","Persons","Monmouthshire","LA"," ",53.684134010725792,50.579320000000003,56.788939999999997,3.1048059892742046,3.1048140107257893]
["Newport_OBE_Persons_2009-2010_LA","OBE","2009-2010","Persons","Newport","LA"," ",57.921598161506395,54.966999999999999,60.876189999999994,2.9545918384935987,2.9545981615063965]
["Betsi Cadwaladr UHB_OBE_Persons_2009-2010_HB","OBE","2009-2010","Persons","Betsi Cadwaladr UHB","HB"," ",54.517605456588889,53.257580000000004,55.777630000000002,1.260024543411113,1.2600254565888847]
["Hywel Dda HB_OBE_Persons_2009-2010_HB","OBE","2009-2010","Persons","Hywel Dda HB","HB"," ",58.024086280330067,56.28181,59.766359999999999,1.7422737196699316,1.7422762803300671]
["Powys THB_OBE_Persons_2009-2010_HB","OBE","2009-2010","Persons","Powys THB","HB"," ",55.973118219788439,52.762450000000008,59.183779999999999,3.2106617802115593,3.2106682197884311]
["ABM UHB_OBE_Persons_2009-2010_HB","OBE","2009-2010","Persons","ABM UHB","HB"," ",58.45314498097737,56.820700000000002,60.085589999999996,1.6324450190226258,1.6324449809773682]
["Cwm Taf HB_OBE_Persons_2009-2010_HB","OBE","2009-2010","Persons","Cwm Taf HB","HB"," ",61.895740281829639,59.796059999999997,63.995420000000003,2.0996797181703641,2.0996802818296416]
["Cardiff & Vale UHB_OBE_Persons_2009-2010_HB","OBE","2009-2010","Persons","Cardiff & Vale UHB","HB"," ",54.454905206304275,52.545459999999999,56.364349999999995,1.9094447936957195,1.9094452063042766]
["Aneurin Bevan HB_OBE_Persons_2009-2010_HB","OBE","2009-2010","Persons","Aneurin Bevan HB","HB"," ",59.105476080435935,57.713930000000005,60.497019999999999,1.3915439195640644,1.3915460804359299]
["Wales_OBE_Persons_2009-2010_Wales","OBE","2009-2010","Persons","Wales ","Wales"," ",57.280596629438094,56.631589999999996,57.929600000000001,0.64900337056190693,0.64900662943809806]
["Isle of Anglesey_FRU_Persons_2009-2010_LA","FRU","2009-2010","Persons","Isle of Anglesey","LA"," ",37.704562938468868,34.49156,40.917569999999998,3.2130070615311297,3.2130029384688683]
["Gwynedd_FRU_Persons_2009-2010_LA","FRU","2009-2010","Persons","Gwynedd","LA"," ",40.710576856966604,37.3797,44.041449999999998,3.3308731430333935,3.3308768569666043]
["Conwy_FRU_Persons_2009-2010_LA","FRU","2009-2010","Persons","Conwy","LA"," ",34.636084217506429,31.545840000000002,37.726330000000004,3.0902457824935752,3.0902442175064273]
["Denbighshire_FRU_Persons_2009-2010_LA","FRU","2009-2010","Persons","Denbighshire","LA"," ",36.067370574949862,33.01999,39.114750000000001,3.0473794250501385,3.0473805749498624]
["Flintshire_FRU_Persons_2009-2010_LA","FRU","2009-2010","Persons","Flintshire","LA"," ",35.648718003113444,32.514189999999999,38.783250000000002,3.1345319968865581,3.134528003113445]
["Wrexham_FRU_Persons_2009-2010_LA","FRU","2009-2010","Persons","Wrexham","LA"," ",31.744437650527217,28.832090000000001,34.656779999999998,2.9123423494727803,2.9123476505272166]
["Powys_FRU_Persons_2009-2010_LA","FRU","2009-2010","Persons","Powys","LA"," ",37.069775138145552,33.775570000000002,40.363979999999998,3.2942048618544462,3.2942051381455499]
["Ceredigion_FRU_Persons_2009-2010_LA","FRU","2009-2010","Persons","Ceredigion","LA"," ",41.063956561656212,37.88317,44.244749999999996,3.1807934383437839,3.1807865616562125]
["Pembrokeshire_FRU_Persons_2009-2010_LA","FRU","2009-2010","Persons","Pembrokeshire","LA"," ",38.264852859471283,35.050409999999999,41.479300000000002,3.2144471405287192,3.2144428594712835]
["Carmarthenshire_FRU_Persons_2009-2010_LA","FRU","2009-2010","Persons","Carmarthenshire","LA"," ",40.027514488305229,37.09234,42.962689999999995,2.9351755116947658,2.9351744883052291]
["Swansea_FRU_Persons_2009-2010_LA","FRU","2009-2010","Persons","Swansea","LA"," ",37.968953732827941,35.335450000000002,40.602460000000001,2.6335062671720593,2.6335037328279398]
["Neath Port Talbot_FRU_Persons_2009-2010_LA","FRU","2009-2010","Persons","Neath Port Talbot","LA"," ",32.601350409651758,29.817430000000002,35.385280000000002,2.7839295903482437,2.7839204096517562]
["Bridgend_FRU_Persons_2009-2010_LA","FRU","2009-2010","Persons","Bridgend","LA"," ",30.779379491762533,27.920859999999998,33.637900000000002,2.8585205082374685,2.8585194917625358]
["The Vale of Glamorgan_FRU_Persons_2009-2010_LA","FRU","2009-2010","Persons","The Vale of Glamorgan","LA"," ",33.641562744220963,30.620969999999996,36.662149999999997,3.0205872557790343,3.0205927442209664]
["Cardiff_FRU_Persons_2009-2010_LA","FRU","2009-2010","Persons","Cardiff","LA"," ",37.676317572023144,35.371069999999996,39.981569999999998,2.3052524279768534,2.3052475720231485]
["Rhondda Cynon Taf_FRU_Persons_2009-2010_LA","FRU","2009-2010","Persons","Rhondda Cynon Taf","LA"," ",29.888193822185986,27.25534,32.521050000000002,2.6328561778140163,2.6328538221859858]
["Merthyr Tydfil_FRU_Persons_2009-2010_LA","FRU","2009-2010","Persons","Merthyr Tydfil","LA"," ",32.52667924298752,29.567179999999997,35.486179999999997,2.9595007570124778,2.9594992429875226]
["Caerphilly_FRU_Persons_2009-2010_LA","FRU","2009-2010","Persons","Caerphilly","LA"," ",29.68948800811911,26.963140000000003,32.415840000000003,2.7263519918808932,2.7263480081191069]
["Blaenau Gwent_FRU_Persons_2009-2010_LA","FRU","2009-2010","Persons","Blaenau Gwent","LA"," ",28.394923155753265,25.492720000000002,31.29712,2.9021968442467347,2.9022031557532628]
["Torfaen_FRU_Persons_2009-2010_LA","FRU","2009-2010","Persons","Torfaen","LA"," ",29.558274697192914,26.638400000000001,32.478149999999999,2.9198753028070854,2.9198746971929133]
["Monmouthshire_FRU_Persons_2009-2010_LA","FRU","2009-2010","Persons","Monmouthshire","LA"," ",37.631172225177387,34.475679999999997,40.786660000000005,3.1554877748226176,3.1554922251773903]
[{"$f":"TRIM(E323)&\"_\"&B323&\"_\"&D323&\"_\"&C323&\"_\"&F323","v":"Newport_FRU_Persons_2009-2010_LA"},"FRU","2009-2010","Persons","Newport","LA"," ",33.530688648127786,30.615189999999998,36.446190000000001,2.9155013518722157,2.9154986481277874]
["Betsi Cadwaladr UHB_FRU_Persons_2009-2010_HB","FRU","2009-2010","Persons","Betsi Cadwaladr UHB","HB"," ",35.935311953178918,34.636620000000001,37.234000000000002,1.2986880468210842,1.2986919531789169]
["Hywel Dda HB_FRU_Persons_2009-2010_HB","FRU","2009-2010","Persons","Hywel Dda HB","HB"," ",39.717261177952039,37.887450000000001,41.547070000000005,1.8298088220479656,1.8298111779520383]
["Powys THB_FRU_Persons_2009-2010_HB","FRU","2009-2010","Persons","Powys THB","HB"," ",37.069775138145552,33.775570000000002,40.363979999999998,3.2942048618544462,3.2942051381455499]
["ABM UHB_FRU_Persons_2009-2010_HB","FRU","2009-2010","Persons","ABM UHB","HB"," ",34.577197362059763,32.957830000000001,36.196559999999998,1.6193626379402346,1.6193673620597622]
["Cwm Taf HB_FRU_Persons_2009-2010_HB","FRU","2009-2010","Persons","Cwm Taf HB","HB"," ",30.394354890746929,28.191090000000003,32.597619999999999,2.2032651092530706,2.2032648907469259]
["Cardiff & Vale UHB_FRU_Persons_2009-2010_HB","FRU","2009-2010","Persons","Cardiff & Vale UHB","HB"," ",36.589271004646683,34.734140000000004,38.444409999999998,1.8551389953533146,1.8551310046466796]
["Aneurin Bevan HB_FRU_Persons_2009-2010_HB","FRU","2009-2010","Persons","Aneurin Bevan HB","HB"," ",31.692057626839183,30.342269999999999,33.041840000000001,1.3497823731608172,1.3497876268391842]
["Wales_FRU_Persons_2009-2010_Wales","FRU","2009-2010","Persons","Wales ","Wales"," ",35.016292550863419,34.363169999999997,35.669420000000002,0.65312744913658349,0.65312255086342219]
["ABM UHB_LE_Males_2005-2009_HB","LE","2005-2009","Males","ABM UHB","HB",{"$f":"\" \"","v":" "},10.376010000000001,8.9340499999999992,11.817959999999999,1.4419499999999985,1.4419600000000017]
["Aneurin Bevan HB_LE_Males_2005-2009_HB","LE","2005-2009","Males","Aneurin Bevan HB","HB",{"$f":"\" \"","v":" "},8.8347110000000004,7.233314,10.436109999999999,1.6013989999999989,1.6013970000000004]
["Betsi Cadwaladr UHB_LE_Males_2005-2009_HB","LE","2005-2009","Males","Betsi Cadwaladr UHB","HB"," ",7.1881979999999999,2.8664239999999999,11.509969999999999,4.3217719999999993,4.3217739999999996]
["Blaenau Gwent_LE_Males_2005-2009_LA","LE","2005-2009","Males","Blaenau Gwent","LA"," ",2.646846,-3.1136550000000001,8.4073469999999997,5.7605009999999996,5.7605009999999996]
["Bridgend_LE_Males_2005-2009_LA","LE","2005-2009","Males","Bridgend","LA"," ",7.8449989999999996,4.0547209999999998,11.63528,3.7902810000000002,3.7902779999999998]
["Caerphilly_LE_Males_2005-2009_LA","LE","2005-2009","Males","Caerphilly","LA"," ",8.4935559999999999,5.9764549999999996,11.01066,2.5171039999999998,2.5171010000000003]
["Cardiff_LE_Males_2005-2009_LA","LE","2005-2009","Males","Cardiff","LA"," ",12.845470000000001,10.99283,14.69811,1.8526399999999992,1.852640000000001]
["Cardiff & Vale UHB_LE_Males_2005-2009_HB","LE","2005-2009","Males","Cardiff & Vale UHB","HB"," ",11.813980000000001,8.5326319999999996,15.095319999999999,3.2813399999999984,3.2813480000000013]
["Carmarthenshire_LE_Males_2005-2009_LA","LE","2005-2009","Males","Carmarthenshire","LA"," ",5.7528119999999996,-0.47629850000000001,11.981920000000001,6.229108000000001,6.2291105]
["Ceredigion_LE_Males_2005-2009_LA","LE","2005-2009","Males","Ceredigion","LA"," ",7.6682649999999999,2.851477,12.485049999999999,4.8167849999999994,4.8167879999999998]
["Conwy_LE_Males_2005-2009_LA","LE","2005-2009","Males","Conwy","LA"," ",8.0631459999999997,5.7928949999999997,10.333399999999999,2.2702539999999996,2.270251]
["Cwm Taf HB_LE_Males_2005-2009_HB","LE","2005-2009","Males","Cwm Taf HB","HB"," ",8.0229199999999992,6.9267849999999997,9.1190549999999995,1.0961350000000003,1.0961349999999994]
["Denbighshire_LE_Males_2005-2009_LA","LE","2005-2009","Males","Denbighshire","LA"," ",7.6459210000000004,-3.09605,18.387889999999999,10.741968999999997,10.741970999999999]
["Flintshire_LE_Males_2005-2009_LA","LE","2005-2009","Males","Flintshire","LA"," ",7.4599970000000004,1.470987,13.449009999999999,5.989012999999999,5.9890100000000004]
["Gwynedd_LE_Males_2005-2009_LA","LE","2005-2009","Males","Gwynedd","LA"," ",3.4251330000000002,0.18031449999999999,6.6699520000000003,3.2448190000000001,3.2448185]
["Hywel Dda HB_LE_Males_2005-2009_HB","LE","2005-2009","Males","Hywel Dda HB","HB"," ",6.83758,2.2331889999999999,11.44197,4.6043899999999995,4.6043909999999997]
["Isle of Anglesey_LE_Males_2005-2009_LA","LE","2005-2009","Males","Isle of Anglesey","LA"," ",6.8199509999999997,-8.5565299999999997E-2,13.72547,6.905519,6.9055162999999995]
["Merthyr Tydfil_LE_Males_2005-2009_LA","LE","2005-2009","Males","Merthyr Tydfil","LA"," ",9.3745329999999996,5.005026,13.74404,4.3695070000000005,4.3695069999999996]
["Monmouthshire_LE_Males_2005-2009_LA","LE","2005-2009","Males","Monmouthshire","LA"," ",5.8893380000000004,4.4028770000000002,7.3757989999999998,1.4864609999999994,1.4864610000000003]
["Neath Port Talbot_LE_Males_2005-2009_LA","LE","2005-2009","Males","Neath Port Talbot","LA"," ",10.415850000000001,7.9771660000000004,12.85454,2.4386899999999994,2.4386840000000003]
["Newport_LE_Males_2005-2009_LA","LE","2005-2009","Males","Newport","LA"," ",11.030279999999999,9.4929000000000006,12.56765,1.537370000000001,1.5373799999999989]
["Pembrokeshire_LE_Males_2005-2009_LA","LE","2005-2009","Males","Pembrokeshire","LA"," ",5.9476430000000002,-2.4788670000000002,14.37415,8.4265070000000009,8.4265100000000004]
["Powys_LE_Males_2005-2009_LA","LE","2005-2009","Males","Powys","LA"," ",5.4724659999999998,-0.49527690000000002,11.44021,5.9677440000000006,5.9677429000000002]
["Rhondda Cynon Taf_LE_Males_2005-2009_LA","LE","2005-2009","Males","Rhondda Cynon Taf","LA"," ",7.9250939999999996,5.2450979999999996,10.605090000000001,2.6799960000000009,2.679996]
["Swansea_LE_Males_2005-2009_LA","LE","2005-2009","Males","Swansea","LA"," ",12.17048,9.2075390000000006,15.133419999999999,2.9629399999999997,2.9629409999999989]
["The Vale of Glamorgan_LE_Males_2005-2009_LA","LE","2005-2009","Males","The Vale of Glamorgan","LA"," ",7.5126790000000003,3.1381389999999998,11.887219999999999,4.3745409999999989,4.3745400000000005]
["Torfaen_LE_Males_2005-2009_LA","LE","2005-2009","Males","Torfaen","LA"," ",7.3051440000000003,4.6733919999999998,9.9368960000000008,2.6317520000000005,2.6317520000000005]
["Wales_LE_Males_2005-2009_Wales","LE","2005-2009","Males","Wales","Wales"," ",9.2429989999999993,6.8385160000000003,11.64748,2.4044810000000005,2.404482999999999]
["Wrexham_LE_Males_2005-2009_LA","LE","2005-2009","Males","Wrexham","LA"," ",9.1770169999999993,5.5414770000000004,12.81256,3.6355430000000002,3.6355399999999989]
["Powys THB_LE_Males_2005-2009_HB","LE","2005-2009","Males","Powys THB","HB"," ",5.4724659999999998,-0.49527690000000002,11.44021,5.9677440000000006,5.9677429000000002]
["ABM UHB_LE_Females_2005-2009_HB","LE","2005-2009","Females","ABM UHB","HB"," ",7.3265979999999997,5.7114479999999999,8.9417469999999994,1.6151489999999997,1.6151499999999999]
["Aneurin Bevan HB_LE_Females_2005-2009_HB","LE","2005-2009","Females","Aneurin Bevan HB","HB"," ",7.4606649999999997,5.0629840000000002,9.8583459999999992,2.3976809999999995,2.3976809999999995]
["Betsi Cadwaladr UHB_LE_Females_2005-2009_HB","LE","2005-2009","Females","Betsi Cadwaladr UHB","HB"," ",5.533474,2.0153180000000002,9.0516290000000001,3.5181550000000001,3.5181559999999998]
["Blaenau Gwent_LE_Females_2005-2009_LA","LE","2005-2009","Females","Blaenau Gwent","LA"," ",1.9385570000000001,-1.882884,5.7599989999999996,3.8214419999999993,3.8214410000000001]
["Bridgend_LE_Females_2005-2009_LA","LE","2005-2009","Females","Bridgend","LA"," ",8.0198889999999992,5.1051190000000002,10.934659999999999,2.914771,2.914769999999999]
["Caerphilly_LE_Females_2005-2009_LA","LE","2005-2009","Females","Caerphilly","LA"," ",7.8294249999999996,5.821472,9.8373790000000003,2.0079540000000007,2.0079529999999997]
["Cardiff_LE_Females_2005-2009_LA","LE","2005-2009","Females","Cardiff","LA"," ",9.964594,8.2461579999999994,11.68303,1.7184360000000005,1.7184360000000005]
["Cardiff & Vale UHB_LE_Females_2005-2009_HB","LE","2005-2009","Females","Cardiff & Vale UHB","HB"," ",9.9309010000000004,8.0146320000000006,11.84717,1.9162689999999998,1.9162689999999998]
["Carmarthenshire_LE_Females_2005-2009_LA","LE","2005-2009","Females","Carmarthenshire","LA"," ",2.9389620000000001,0.26154149999999998,5.6163829999999999,2.6774209999999998,2.6774205000000002]
["Ceredigion_LE_Females_2005-2009_LA","LE","2005-2009","Females","Ceredigion","LA"," ",1.2225760000000001,-1.0924240000000001,3.5375770000000002,2.3150010000000001,2.3150000000000004]
["Conwy_LE_Females_2005-2009_LA","LE","2005-2009","Females","Conwy","LA"," ",6.7851800000000004,4.1375900000000003,9.4327699999999997,2.6475899999999992,2.6475900000000001]
["Cwm Taf HB_LE_Females_2005-2009_HB","LE","2005-2009","Females","Cwm Taf HB","HB"," ",6.0478820000000004,4.3392590000000002,7.7565039999999996,1.7086219999999992,1.7086230000000002]
["Denbighshire_LE_Females_2005-2009_LA","LE","2005-2009","Females","Denbighshire","LA"," ",3.7368510000000001,-2.9595189999999998,10.43322,6.6963690000000007,6.6963699999999999]
["Flintshire_LE_Females_2005-2009_LA","LE","2005-2009","Females","Flintshire","LA"," ",6.81,4.1297090000000001,9.4902899999999999,2.6802900000000003,2.6802909999999995]
["Gwynedd_LE_Females_2005-2009_LA","LE","2005-2009","Females","Gwynedd","LA"," ",2.428353,-3.2088549999999998,8.0655599999999996,5.6372070000000001,5.6372079999999993]
["Hywel Dda HB_LE_Females_2005-2009_HB","LE","2005-2009","Females","Hywel Dda HB","HB"," ",4.0529820000000001,1.274608,6.8313560000000004,2.7783740000000003,2.7783740000000003]
["Isle of Anglesey_LE_Females_2005-2009_LA","LE","2005-2009","Females","Isle of Anglesey","LA"," ",4.5579559999999999,1.7588820000000001,7.35703,2.7990740000000001,2.7990740000000001]
["Merthyr Tydfil_LE_Females_2005-2009_LA","LE","2005-2009","Females","Merthyr Tydfil","LA"," ",7.7738649999999998,4.3828519999999997,11.16488,3.3910150000000003,3.3910130000000001]
["Monmouthshire_LE_Females_2005-2009_LA","LE","2005-2009","Females","Monmouthshire","LA"," ",4.1130620000000002,5.0236299999999998E-2,8.1758880000000005,4.0628260000000003,4.0628257000000003]
["Neath Port Talbot_LE_Females_2005-2009_LA","LE","2005-2009","Females","Neath Port Talbot","LA"," ",6.7350070000000004,4.055021,9.4149940000000001,2.6799869999999997,2.6799860000000004]
["Newport_LE_Females_2005-2009_LA","LE","2005-2009","Females","Newport","LA"," ",6.2613269999999996,-0.1301842,12.652839999999999,6.3915129999999998,6.3915112000000001]
["Pembrokeshire_LE_Females_2005-2009_LA","LE","2005-2009","Females","Pembrokeshire","LA"," ",4.1766319999999997,2.1196000000000002,6.2336640000000001,2.0570320000000004,2.0570319999999995]
["Powys_LE_Females_2005-2009_LA","LE","2005-2009","Females","Powys","LA"," ",4.9087379999999996,-4.0372440000000003,13.85472,8.9459820000000008,8.9459820000000008]
["Rhondda Cynon Taf_LE_Females_2005-2009_LA","LE","2005-2009","Females","Rhondda Cynon Taf","LA"," ",5.3946370000000003,3.5697589999999999,7.2195150000000003,1.824878,1.8248780000000004]
["Swansea_LE_Females_2005-2009_LA","LE","2005-2009","Females","Swansea","LA"," ",7.3782800000000002,5.3445780000000003,9.4119829999999993,2.0337029999999992,2.0337019999999999]
[{"$f":"TRIM(E387)&\"_\"&B387&\"_\"&D387&\"_\"&C387&\"_\"&F387","v":"The Vale of Glamorgan_LE_Females_2005-2009_LA"},"LE","2005-2009","Females","The Vale of Glamorgan","LA"," ",7.4437550000000003,6.7376680000000002,8.1498419999999996,0.70608699999999924,0.70608700000000013]
["Torfaen_LE_Females_2005-2009_LA","LE","2005-2009","Females","Torfaen","LA"," ",6.051895,2.9951349999999999,9.1086550000000006,3.0567600000000006,3.0567600000000001]
["Wales_LE_Females_2005-2009_Wales","LE","2005-2009","Females","Wales","Wales"," ",7.0557189999999999,5.1521980000000003,8.9592390000000002,1.9035200000000003,1.9035209999999996]
["Wrexham_LE_Females_2005-2009_LA","LE","2005-2009","Females","Wrexham","LA"," ",8.1565510000000003,0.97660049999999998,15.336499999999999,7.1799489999999988,7.1799505000000003]
["Powys THB_LE_Females_2005-2009_HB","LE","2005-2009","Females","Powys THB","HB"," ",4.9087379999999996,-4.0372440000000003,13.85472,8.9459820000000008,8.9459820000000008]
["ABM UHB_HLE_Males_2005-2009_HB","HLE","2005-2009","Males","ABM UHB","HB"," "]
["Aneurin Bevan HB_HLE_Males_2005-2009_HB","HLE","2005-2009","Males","Aneurin Bevan HB","HB"," "]
["Betsi Cadwaladr UHB_HLE_Males_2005-2009_HB","HLE","2005-2009","Males","Betsi Cadwaladr UHB","HB"," "]
["Blaenau Gwent_HLE_Males_2005-2009_LA","HLE","2005-2009","Males","Blaenau Gwent","LA"," "]
["Bridgend_HLE_Males_2005-2009_LA","HLE","2005-2009","Males","Bridgend","LA"," "]
["Caerphilly_HLE_Males_2005-2009_LA","HLE","2005-2009","Males","Caerphilly","LA",{"$f":"\" \"","v":" "}]
["Cardiff_HLE_Males_2005-2009_LA","HLE","2005-2009","Males","Cardiff","LA"," "]
["Cardiff & Vale UHB_HLE_Males_2005-2009_HB","HLE","2005-2009","Males","Cardiff & Vale UHB","HB"," "]
["Carmarthenshire_HLE_Males_2005-2009_LA","HLE","2005-2009","Males","Carmarthenshire","LA"," "]
["Ceredigion_HLE_Males_2005-2009_LA","HLE","2005-2009","Males","Ceredigion","LA"," "]
["Conwy_HLE_Males_2005-2009_LA","HLE","2005-2009","Males","Conwy","LA"," "]
["Cwm Taf HB_HLE_Males_2005-2009_HB","HLE","2005-2009","Males","Cwm Taf HB","HB"," "]
["Denbighshire_HLE_Males_2005-2009_LA","HLE","2005-2009","Males","Denbighshire","LA"," "]
["Flintshire_HLE_Males_2005-2009_LA","HLE","2005-2009","Males","Flintshire","LA"," "]
["Gwynedd_HLE_Males_2005-2009_LA","HLE","2005-2009","Males","Gwynedd","LA"," "]
["Hywel Dda HB_HLE_Males_2005-2009_HB","HLE","2005-2009","Males","Hywel Dda HB","HB"," "]
["Isle of Anglesey_HLE_Males_2005-2009_LA","HLE","2005-2009","Males","Isle of Anglesey","LA"," "]
["Merthyr Tydfil_HLE_Males_2005-2009_LA","HLE","2005-2009","Males","Merthyr Tydfil","LA"," "]
["Monmouthshire_HLE_Males_2005-2009_LA","HLE","2005-2009","Males","Monmouthshire","LA"," "]
["Neath Port Talbot_HLE_Males_2005-2009_LA","HLE","2005-2009","Males","Neath Port Talbot","LA"," "]
["Newport_HLE_Males_2005-2009_LA","HLE","2005-2009","Males","Newport","LA"," "]
["Pembrokeshire_HLE_Males_2005-2009_LA","HLE","2005-2009","Males","Pembrokeshire","LA"," "]
["Powys_HLE_Males_2005-2009_LA","HLE","2005-2009","Males","Powys","LA"," "]
["Rhondda Cynon Taf_HLE_Males_2005-2009_LA","HLE","2005-2009","Males","Rhondda Cynon Taf","LA"," "]
["Swansea_HLE_Males_2005-2009_LA","HLE","2005-2009","Males","Swansea","LA"," "]
["The Vale of Glamorgan_HLE_Males_2005-2009_LA","HLE","2005-2009","Males","The Vale of Glamorgan","LA"," "]
["Torfaen_HLE_Males_2005-2009_LA","HLE","2005-2009","Males","Torfaen","LA"," "]
["Wales_HLE_Males_2005-2009_Wales","HLE","2005-2009","Males","Wales","Wales"," ",18.937380000000001,13.366199999999999,24.508559999999999,5.5711799999999982,5.5711800000000018]
["Wrexham_HLE_Males_2005-2009_LA","HLE","2005-2009","Males","Wrexham","LA"," "]
["Powys THB_HLE_Males_2005-2009_HB","HLE","2005-2009","Males","Powys THB","HB"," "]
["ABM UHB_HLE_Females_2005-2009_HB","HLE","2005-2009","Females","ABM UHB","HB"," "]
["Aneurin Bevan HB_HLE_Females_2005-2009_HB","HLE","2005-2009","Females","Aneurin Bevan HB","HB"," "]
["Betsi Cadwaladr UHB_HLE_Females_2005-2009_HB","HLE","2005-2009","Females","Betsi Cadwaladr UHB","HB"," "]
["Blaenau Gwent_HLE_Females_2005-2009_LA","HLE","2005-2009","Females","Blaenau Gwent","LA"," "]
["Bridgend_HLE_Females_2005-2009_LA","HLE","2005-2009","Females","Bridgend","LA"," "]
["Caerphilly_HLE_Females_2005-2009_LA","HLE","2005-2009","Females","Caerphilly","LA"," "]
["Cardiff_HLE_Females_2005-2009_LA","HLE","2005-2009","Females","Cardiff","LA"," "]
["Cardiff & Vale UHB_HLE_Females_2005-2009_HB","HLE","2005-2009","Females","Cardiff & Vale UHB","HB"," "]
["Carmarthenshire_HLE_Females_2005-2009_LA","HLE","2005-2009","Females","Carmarthenshire","LA"," "]
["Ceredigion_HLE_Females_2005-2009_LA","HLE","2005-2009","Females","Ceredigion","LA"," "]
["Conwy_HLE_Females_2005-2009_LA","HLE","2005-2009","Females","Conwy","LA"," "]
["Cwm Taf HB_HLE_Females_2005-2009_HB","HLE","2005-2009","Females","Cwm Taf HB","HB"," "]
["Denbighshire_HLE_Females_2005-2009_LA","HLE","2005-2009","Females","Denbighshire","LA"," "]
["Flintshire_HLE_Females_2005-2009_LA","HLE","2005-2009","Females","Flintshire","LA"," "]
["Gwynedd_HLE_Females_2005-2009_LA","HLE","2005-2009","Females","Gwynedd","LA"," "]
["Hywel Dda HB_HLE_Females_2005-2009_HB","HLE","2005-2009","Females","Hywel Dda HB","HB"," "]
["Isle of Anglesey_HLE_Females_2005-2009_LA","HLE","2005-2009","Females","Isle of Anglesey","LA"," "]
["Merthyr Tydfil_HLE_Females_2005-2009_LA","HLE","2005-2009","Females","Merthyr Tydfil","LA"," "]
["Monmouthshire_HLE_Females_2005-2009_LA","HLE","2005-2009","Females","Monmouthshire","LA"," "]
["Neath Port Talbot_HLE_Females_2005-2009_LA","HLE","2005-2009","Females","Neath Port Talbot","LA"," "]
["Newport_HLE_Females_2005-2009_LA","HLE","2005-2009","Females","Newport","LA"," "]
["Pembrokeshire_HLE_Females_2005-2009_LA","HLE","2005-2009","Females","Pembrokeshire","LA"," "]
["Powys_HLE_Females_2005-2009_LA","HLE","2005-2009","Females","Powys","LA"," "]
["Rhondda Cynon Taf_HLE_Females_2005-2009_LA","HLE","2005-2009","Females","Rhondda Cynon Taf","LA"," "]
["Swansea_HLE_Females_2005-2009_LA","HLE","2005-2009","Females","Swansea","LA"," "]
["The Vale of Glamorgan_HLE_Females_2005-2009_LA","HLE","2005-2009","Females","The Vale of Glamorgan","LA"," "]
["Torfaen_HLE_Females_2005-2009_LA","HLE","2005-2009","Females","Torfaen","LA"," "]
["Wales_HLE_Females_2005-2009_Wales","HLE","2005-2009","Females","Wales","Wales"," ",17.792860000000001,12.237959999999999,23.347770000000001,5.5549099999999996,5.5549000000000017]
["Wrexham_HLE_Females_2005-2009_LA","HLE","2005-2009","Females","Wrexham","LA"," "]
[{"$f":"TRIM(E451)&\"_\"&B451&\"_\"&D451&\"_\"&C451&\"_\"&F451","v":"Powys THB_HLE_Females_2005-2009_HB"},"HLE","2005-2009","Females","Powys THB","HB"," "]
[{"$f":"TRIM(E452)&\"_\"&B452&\"_\"&D452&\"_\"&C452&\"_\"&F452","v":"WALES_Concep_Females_2010_WALES"},"Concep",2010,"Females","WALES                               ","WALES",2081,37.702690461092487,36.100175040000316,39.358512887851255,1.6558224267587676,1.6025154210921713]
["Isle of Anglesey_Concep_Females_2010_LA","Concep",2010,"Females","Isle of Anglesey                    ","LA",42,34.008097165991899,24.510121457489877,45.969230769230769,11.961133603238871,9.4979757085020218]
["Gwynedd_Concep_Females_2010_LA","Concep",2010,"Females","Gwynedd                             ","LA",74,33.712984054669704,26.471981776765375,42.323462414578593,8.610478359908889,7.2410022779043288]
["Conwy_Concep_Females_2010_LA","Concep",2010,"Females","Conwy                               ","LA",77,38.654618473895582,30.505522088353416,48.311746987951807,9.6571285140562253,8.1490963855421654]
["Denbighshire_Concep_Females_2010_LA","Concep",2010,"Females","Denbighshire                        ","LA",66,35.218783351120592,27.237993596584843,44.806830309498395,9.5880469583778023,7.9807897545357491]
["Flintshire_Concep_Females_2010_LA","Concep",2010,"Females","Flintshire                          ","LA",105,37.756202804746493,30.87967511640387,45.717308549562944,7.9611057448164502,6.8765276883426232]
["Wrexham_Concep_Females_2010_LA","Concep",2010,"Females","Wrexham                             ","LA",99,42.764578833693307,34.756803455723542,52.064362850971918,9.2997840172786113,8.0077753779697645]
["Powys_Concep_Females_2010_LA","Concep",2010,"Females","Powys                               ","LA",61,23.726176584986387,18.148580318942045,30.477246207701281,6.7510696227148941,5.5775962660443419]
["Ceredigion_Concep_Females_2010_LA","Concep",2010,"Females","Ceredigion                          ","LA",29,22.727272727272727,15.22100313479624,32.640282131661444,9.9130094043887169,7.5062695924764871]
["Pembrokeshire_Concep_Females_2010_LA","Concep",2010,"Females","Pembrokeshire                       ","LA",70,29.711375212224109,23.161290322580644,37.538624787775895,7.8272495755517859,6.5500848896434647]
["Carmarthenshire_Concep_Females_2010_LA","Concep",2010,"Females","Carmarthenshire                     ","LA",110,32.515518770322203,26.722951988136273,39.199019023231259,6.6835002529090559,5.7925667821859292]
["Swansea_Concep_Females_2010_LA","Concep",2010,"Females","Swansea                             ","LA",147,39.761969164187178,33.593903954599675,46.741906713218562,6.9799375490313835,6.1680652095875033]
["Neath Port Talbot_Concep_Females_2010_LA","Concep",2010,"Females","Neath Port Talbot                   ","LA",89,35.97413096200485,28.890056588520615,44.269199676637029,8.2950687146321798,7.0840743734842349]
["Bridgend_Concep_Females_2010_LA","Concep",2010,"Females","Bridgend                            ","LA",101,42.454812946616222,34.578664893906279,51.599592130806926,9.1447791841907033,7.8761480527099437]
["The Vale of Glamorgan_Concep_Females_2010_LA","Concep",2010,"Females","The Vale of Glamorgan                   ","LA",79,31.906300484652665,25.260500807754443,39.764943457189013,7.858642972536348,6.6457996768982213]
["Cardiff_Concep_Females_2010_LA","Concep",2010,"Females","Cardiff                             ","LA",264,47.109207708779444,41.597817532802829,53.152549673154077,6.0433419643746333,5.5113901759766151]
["Rhondda Cynon Taf_Concep_Females_2010_LA","Concep",2010,"Females","Rhondda Cynon Taf          ","LA",207,48.251748251748253,41.902310173175103,55.297883915999456,7.046135664251203,6.3494380785731508]
["Merthyr Tydfil_Concep_Females_2010_LA","Concep",2010,"Females","Merthyr Tydfil                      ","LA",49,44.545454545454547,32.954545454545453,58.891818181818181,14.346363636363634,11.590909090909093]
["Caerphilly_Concep_Females_2010_LA","Concep",2010,"Females","Caerphilly                          ","LA",130,38.782816229116946,32.402434865172097,46.060150763373763,7.2773345342568163,6.3803813639448492]
["Blaenau Gwent_Concep_Females_2010_LA","Concep",2010,"Females","Blaenau Gwent                       ","LA",54,37.526059763724803,28.190410006949275,48.963168867268941,11.437109103544138,9.3356497567755277]
["Torfaen_Concep_Females_2010_LA","Concep",2010,"Females","Torfaen                             ","LA",69,38.10049696300387,29.644395361678633,48.218663721700715,10.118166758696844,8.456101601325237]
["Monmouthshire_Concep_Females_2010_LA","Concep",2010,"Females","Monmouthshire                       ","LA",40,22.459292532285232,16.045480067377877,30.583380123526108,8.1240875912408761,6.4138124649073553]
["Newport_Concep_Females_2010_LA","Concep",2010,"Females","Newport                             ","LA",119,42.288557213930353,35.03174280572636,50.615182748472826,8.3266255345424725,7.2568144082039936]
["Betsi Cadwaladr UHB_Concep_Females_2010_HB","Concep",2010,"Females","Betsi Cadwaladr UHB","HB",463,37.362814719173656,34.036977712149287,40.928025507418859,3.5652107882452029,3.3258370070243686]
["Powys THB_Concep_Females_2010_HB","Concep",2010,"Females","Powys THB","HB",61,23.726176584986387,18.148580318942045,30.477246207701281,6.7510696227148941,5.5775962660443419]
["Hywel Dda HB_Concep_Females_2010_HB","Concep",2010,"Females","Hywel Dda HB","HB",209,29.793300071275837,25.89094920915041,34.121667629726488,4.3283675584506511,3.9023508621254273]
["ABM UHB_Concep_Females_2010_HB","Concep",2010,"Females","ABM UHB","HB",337,39.415204678362571,35.319249460661489,43.85901304903701,4.4438083706744393,4.0959552177010821]
["Cardiff & Vale UHB_Concep_Females_2010_HB","Concep",2010,"Females","Cardiff & Vale UHB","HB",343,42.450495049504951,38.076818318340827,47.192201052270192,4.7417060027652411,4.3736767311641245]
["Cwm Taf HB_Concep_Females_2010_HB","Concep",2010,"Females","Cwm Taf HB","HB",256,47.495361781076063,41.855361781076063,53.688606735081187,6.1932449540051238,5.6400000000000006]
["Aneurin Bevan HB_Concep_Females_2010_HB","Concep",2010,"Females","Aneurin Bevan HB","HB",412,36.795570242029115,33.32827945564334,40.528025972000279,3.7324557299711643,3.4672907863857745]
["Isle of Anglesey_Ment_Persons_2009-2010_LA","Ment","2009-2010","Persons","Isle of Anglesey","LA",{"$f":"\" \"","v":" "},77.081630000000004,74.259509999999992,79.903739999999999,2.822109999999995,2.8221200000000124]
["Gwynedd_Ment_Persons_2009-2010_LA","Ment","2009-2010","Persons","Gwynedd","LA",{"$f":"\" \"","v":" "},77.978200000000001,75.214410000000001,80.741990000000001,2.7637900000000002,2.7637900000000002]
["Conwy_Ment_Persons_2009-2010_LA","Ment","2009-2010","Persons","Conwy","LA"," ",79.965969999999999,77.47878,82.45317,2.4872000000000014,2.4871899999999982]
["Denbighshire_Ment_Persons_2009-2010_LA","Ment","2009-2010","Persons","Denbighshire","LA"," ",77.013559999999998,74.474209999999999,79.552900000000008,2.5393400000000099,2.5393499999999989]
["Flintshire_Ment_Persons_2009-2010_LA","Ment","2009-2010","Persons","Flintshire","LA"," ",79.393460000000005,77.054169999999999,81.732749999999996,2.3392899999999912,2.3392900000000054]
["Wrexham_Ment_Persons_2009-2010_LA","Ment","2009-2010","Persons","Wrexham","LA"," ",74.888400000000004,72.279319999999998,77.497479999999996,2.6090799999999916,2.6090800000000058]
["Powys_Ment_Persons_2009-2010_LA","Ment","2009-2010","Persons","Powys","LA"," ",79.822099999999992,77.070390000000003,82.573810000000009,2.751710000000017,2.7517099999999886]
["Ceredigion_Ment_Persons_2009-2010_LA","Ment","2009-2010","Persons","Ceredigion","LA"," ",80.605840000000001,78.069599999999994,83.142079999999993,2.5362399999999923,2.5362400000000065]
["Pembrokeshire_Ment_Persons_2009-2010_LA","Ment","2009-2010","Persons","Pembrokeshire","LA"," ",78.56701000000001,76.062909999999988,81.071100000000001,2.5040899999999908,2.5041000000000224]
["Carmarthenshire_Ment_Persons_2009-2010_LA","Ment","2009-2010","Persons","Carmarthenshire","LA"," ",71.817160000000001,69.186849999999993,74.44747000000001,2.6303100000000086,2.6303100000000086]
["Swansea_Ment_Persons_2009-2010_LA","Ment","2009-2010","Persons","Swansea","LA"," ",74.877719999999997,72.635000000000005,77.120440000000002,2.2427200000000056,2.2427199999999914]
["Neath Port Talbot_Ment_Persons_2009-2010_LA","Ment","2009-2010","Persons","Neath Port Talbot","LA"," ",70.7864,68.179460000000006,73.393349999999998,2.6069499999999977,2.6069399999999945]
["Bridgend_Ment_Persons_2009-2010_LA","Ment","2009-2010","Persons","Bridgend","LA"," ",73.923630000000003,71.245620000000002,76.60163,2.6779999999999973,2.6780100000000004]
["The Vale of Glamorgan_Ment_Persons_2009-2010_LA","Ment","2009-2010","Persons","The Vale of Glamorgan","LA"," ",76.712500000000006,74.045659999999998,79.379350000000002,2.6668499999999966,2.6668400000000076]
["Cardiff_Ment_Persons_2009-2010_LA","Ment","2009-2010","Persons","Cardiff","LA"," ",73.717100000000002,71.658000000000001,75.776200000000003,2.0591000000000008,2.0591000000000008]
["Rhondda Cynon Taf_Ment_Persons_2009-2010_LA","Ment","2009-2010","Persons","Rhondda Cynon Taf","LA"," ",70.815470000000005,68.317239999999998,73.313699999999997,2.4982299999999924,2.4982300000000066]
["Merthyr Tydfil_Ment_Persons_2009-2010_LA","Ment","2009-2010","Persons","Merthyr Tydfil","LA"," ",66.574569999999994,63.696669999999997,69.452480000000008,2.8779100000000142,2.8778999999999968]
["Caerphilly_Ment_Persons_2009-2010_LA","Ment","2009-2010","Persons","Caerphilly","LA"," ",68.719129999999993,65.996610000000004,71.441649999999996,2.7225200000000029,2.7225199999999887]
["Blaenau Gwent_Ment_Persons_2009-2010_LA","Ment","2009-2010","Persons","Blaenau Gwent","LA"," ",65.149950000000004,62.100639999999999,68.199250000000006,3.0493000000000023,3.0493100000000055]
["Torfaen_Ment_Persons_2009-2010_LA","Ment","2009-2010","Persons","Torfaen","LA"," ",70.760419999999996,67.92607000000001,73.594760000000008,2.8343400000000116,2.8343499999999864]
["Monmouthshire_Ment_Persons_2009-2010_LA","Ment","2009-2010","Persons","Monmouthshire","LA"," ",80.489869999999996,77.983599999999996,82.996139999999997,2.5062700000000007,2.5062700000000007]
["Newport_Ment_Persons_2009-2010_LA","Ment","2009-2010","Persons","Newport","LA"," ",72.098470000000006,69.498739999999998,74.698210000000003,2.5997399999999971,2.5997300000000081]
["Betsi Cadwaladr UHB_Ment_Persons_2009-2010_HB","Ment","2009-2010","Persons","Betsi Cadwaladr UHB","HB"," ",77.777760000000001,76.708629999999999,78.846890000000002,1.0691300000000012,1.0691300000000012]
["Hywel Dda HB_Ment_Persons_2009-2010_HB","Ment","2009-2010","Persons","Hywel Dda HB","HB"," ",75.751429999999999,74.187669999999997,77.315190000000001,1.563760000000002,1.563760000000002]
["Powys THB_Ment_Persons_2009-2010_HB","Ment","2009-2010","Persons","Powys THB","HB"," ",79.822099999999992,77.070390000000003,82.573810000000009,2.751710000000017,2.7517099999999886]
["ABM UHB_Ment_Persons_2009-2010_HB","Ment","2009-2010","Persons","ABM UHB","HB"," ",73.592159999999993,72.1541,75.03022,1.4380600000000072,1.438059999999993]
["Cwm Taf HB_Ment_Persons_2009-2010_HB","Ment","2009-2010","Persons","Cwm Taf HB","HB"," ",70.010239999999996,67.910709999999995,72.109769999999997,2.0995300000000015,2.0995300000000015]
["Cardiff & Vale UHB_Ment_Persons_2009-2010_HB","Ment","2009-2010","Persons","Cardiff & Vale UHB","HB"," ",74.618960000000001,72.969629999999995,76.268290000000007,1.6493300000000062,1.6493300000000062]
["Aneurin Bevan HB_Ment_Persons_2009-2010_HB","Ment","2009-2010","Persons","Aneurin Bevan HB","HB"," ",71.45165999999999,70.18710999999999,72.716219999999993,1.264560000000003,1.2645499999999998]
["Wales_Ment_Persons_2009-2010_Wales","Ment","2009-2010","Persons","Wales","Wales"," ",74.51558,73.94104999999999,75.090119999999999,0.57453999999999894,0.57453000000000998]